{"text_format":"1","workbook":"xlsx","n_sheets":14,"sheets":["MENU","DADOS","NOVO","BDI","ORÇAMENTO","CÁLCULO","EVENTOS","CRONO","CRONOPLE","PLE","QCI","BM","RRE","OFÍCIO"],"not_rendered":{"charts":0,"images":2,"macros":1,"external_links":0,"defined_names":290,"comments":7,"pivot_tables":0},"unopened":[],"bounds":{"document_bytes":16777216,"sheet_cells":100000,"rows_first":2000,"rows_last":500,"rows_between":2000,"halvings":0,"cell_chars":16384,"cell_head_chars":4096},"cells_cut":0,"cells_raw":0,"read":"whole","date_system":"1900"}

{"sheet":"MENU","index":0,"n_rows":24,"n_cols":15,"rows_kept":24,"cut":false,"hidden":false,"merged":[[19,1,19,7],[7,1,7,7],[1,4,2,6],[15,1,15,7]]}
[null,null,null,null,null,null,null,null,null,"PM"]
[null,null,null,null,{"$f":"CHOOSE(MATCH(Objeto,{\"PM\",\"PO\"}),\"PLANILHA MÚLTIPLA \",\"PLANILHA ORÇAMENTÁRIA \")& Versao","v":"PLANILHA MÚLTIPLA v3.0.6"},null,null,null,null,"v3.0.6"]
[null,null,null,null,null,null,null,null,null,null,null,null,null,null,1]
[null,null,null,null,null,null,null,null,null,null,null,null,null,null,2]
[null,null,null,null,null,null,null,null,null,"Proposto"]
[null,null,null,null,"DADOS DO CONTRATO",null,"NOVIDADES DA VERSÃO",null,null,"Licitado"]
[null,null,null,null,null,null,null,null,null,"PLE"]
[null,{"$f":"IF($O$3<>2,\"DOCUMENTAÇÃO DA PROPOSTA\",\"PROPOSTA: Para visualizar/preencher esta seção, altere o TIPO DE ORÇAMENTO para 'Proposto'\")","v":"DOCUMENTAÇÃO DA PROPOSTA"},null,null,null,null,null,null,null,"BM",null,"LEGENDA:"]
[null,null,null,null,null,null,null,null,null,null,null,"Cores das células:"]
[null,null,{"$f":"IF(TIPOORCAMENTO<>\"Proposto\",\"\",\"                    BDI                    \")","v":"                    BDI                    "},null,{"$f":"IF(TIPOORCAMENTO<>\"Proposto\",\"\",\"             ORÇAMENTO             \")","v":"             ORÇAMENTO             "},null,{"$f":"IF(TIPOORCAMENTO<>\"Proposto\",\"\",\"MEMÓRIA DE CÁLCULO / PLQ\")","v":"MEMÓRIA DE CÁLCULO / PLQ"},null,null,null,null,null,null,"Fundo amarelo: células para preencher"]
[]
[null,null,{"$f":"IF(TIPOORCAMENTO<>\"Proposto\",\"\",\"                    QCI                    \")","v":"                    QCI                    "},null,{"$f":"IF(TIPOORCAMENTO<>\"Proposto\",\"\",\"CRONOGRAMA FÍSICO-FINANCEIRO\")","v":"CRONOGRAMA FÍSICO-FINANCEIRO"},null,null,null,null,null,null,null,null,"Fundo azul: células para seleção de opções"]
[]
[null,null,{"$f":"IF(TIPOORCAMENTO<>\"Proposto\",\"\",\"Obs: Composições e Cotações devem ser preenchidas diretamente no arquivo Referência \"&IF(ISBLANK(Import.DataBase),\"mm-aaaa\",TEXT(Import.DataBase,\"mm-aaaa\"))&\".xlsm.\")","v":"Obs: Composições e Cotações devem ser preenchidas diretamente no arquivo Referência 11-2024.xlsm."}]
[null,null,null,null,null,null,null,null,null,null,null,"Cores dos botões:"]
[null,{"$f":"IF($O$3<>2,\"PÓS-LICITADO: Para visualizar/preencher esta seção, altere o TIPO DE ORÇAMENTO para 'Licitado'\",\"RESULTADO DO PROCESSO LICITATÓRIO\")","v":"PÓS-LICITADO: Para visualizar/preencher esta seção, altere o TIPO DE ORÇAMENTO para 'Licitado'"},null,null,null,null,null,null,null,null,null,null,null,"Fundo azul: navegação entre abas"]
[]
[null,null,{"$f":"IF(TIPOORCAMENTO<>\"Licitado\",\"\",\"             ORÇAMENTO             \")","v":""},null,{"$f":"IF(TIPOORCAMENTO<>\"Licitado\",\"\",\"                    QCI                    \")","v":""},null,{"$f":"IF(TIPOORCAMENTO<>\"Licitado\",\"\",\"CRONOGRAMA FÍSICO-FINANCEIRO\")","v":""},null,null,null,null,null,null,"Fundo laranja: execução de macro"]
[]
[null,{"$f":"IF($O$3<>2,\"ACOMPANHAMENTO: Para visualizar/preencher esta seção, altere o TIPO DE ORÇAMENTO para 'Licitado'\",\"ACOMPANHAMENTO DO EMPREENDIMENTO\")","v":"ACOMPANHAMENTO: Para visualizar/preencher esta seção, altere o TIPO DE ORÇAMENTO para 'Licitado'"}]
[]
[null,null,{"$f":"IF(OR(TIPOORCAMENTO<>\"Licitado\",ACOMPANHAMENTO<>\"PLE\"),\"\",\"PLAN. DE LEVANT. DE EVENTOS - PLE\")","v":""},null,{"$f":"IF(TIPOORCAMENTO<>\"Licitado\",\"\",\"                    RRE                    \")","v":""},null,{"$f":"IF(OR(TIPOORCAMENTO<>\"Licitado\",ACOMPANHAMENTO<>\"BM\"),\"\",\"  BOLETIM DE MEDIÇÃO - BM  \")","v":""}]
[]
[null,null,null,null,{"$f":"IF(TIPOORCAMENTO<>\"Licitado\",\"\",\"OF. DE SOLICITAÇÃO DE DESBLOQUEIO\")","v":""}]

{"sheet":"DADOS","index":1,"n_rows":61,"n_cols":44,"rows_kept":61,"cut":false,"hidden":false,"merged":[[49,4,49,5],[58,4,58,5],[0,11,0,43],[2,4,2,5],[14,4,14,5],[20,4,20,5],[26,4,26,5],[34,4,34,5],[45,4,45,5]]}
[null,null,null,null,"A. DOCUMENTAÇÃO DA PROPOSTA",null,null,null,null,null,null,"Sub-Itens de Investimento"]
[null,null,null,null,null,null,null,null,null,"Itens de Investimento","Unidades habitacionais",{"$f":"COUNTA(K:K)-1","v":3},"Equipamentos comunitários",{"$f":"COUNTA(M:M)-1","v":6},"Pavimentação",{"$f":"COUNTA(O:O)-1","v":6},"Drenagem ",{"$f":"COUNTA(Q:Q)-1","v":6},"Abastecimento de água",{"$f":"COUNTA(S:S)-1","v":11},"Esgotamento sanitário",{"$f":"COUNTA(U:U)-1","v":8},"Energia elétrica e iluminação pública",{"$f":"COUNTA(W:W)-1","v":4},"Coleta e tratamento de resíduos sólidos",{"$f":"COUNTA(Y:Y)-1","v":6},"Contenção e estabilização de encostas ",{"$f":"COUNTA(AA:AA)-1","v":2},"Regularização fundiária",{"$f":"COUNTA(AC:AC)-1","v":2},"Aquisição de terreno",{"$f":"COUNTA(AE:AE)-1","v":2},"Aquisição de equipamentos e insumos",{"$f":"COUNTA(AG:AG)-1","v":1},"Elaboração de estudos e projetos",{"$f":"COUNTA(AI:AI)-1","v":1},"Instrumentos e ações em planejamento e gestão pública",{"$f":"COUNTA(AK:AK)-1","v":1},"Ações complementares às obras",{"$f":"COUNTA(AM:AM)-1","v":3},"Gerenciamento",{"$f":"COUNTA(AO:AO)-1","v":1},"Trabalho social",{"$f":"COUNTA(AQ:AQ)-1","v":4}]
[null,null,null,null,"Dados do Contrato (Inicial)",null,null,null,null,"Unidades habitacionais","Aquisição","un","Convivência comunitária, assistência social e/ou comunitária","m²","Capeamento de vias","m²","Obras de microdrenagem ","m","Captação subterrânea","m³/s","Ligações domiciliares e/ou intradomiciliares","un","Iluminação pública - luminárias","un","Acondicionamento ","un","Estabilização de taludes","m²","Desapropriacões/Indenizações","m²","Aquisição de terreno","m²","Aquisição de equipamentos e insumos","un","Elaboração de estudos e projetos","un","Instrumentos e ações em planejamento e gestão pública","un","Avaliação pós intervenção","un","Gerenciamento","%CT","Projeto de Trabalho Social Preliminar","nº fam"]
[null,null,null,null,"Fonte de recursos:","OGU",null,null,null,"Equipamentos comunitários","Construção","un","Educação e cultura","m²","Recapeamento de vias","m²","Desassoreamento de cursos de água","m","Captação superficial","m³/s","Rede coletora e/ou condominial","m","Ligações domiciliares","un","Aterro sanitário e/ou disposição final","m³","Obras complementares a ações de redução de risco e/ou contenções","m²","Projeto de Regularização Fundiária","m²","Benfeitorias","m²",null,null,null,null,null,null,"Demolições","un",null,null,"Projeto de Trabalho Social","nº fam"]
[null,null,null,null,"Proponente/Tomador:","PREFEITURA MUNICIPAL DE TRAMANDAÍ ",null,null,null,"Pavimentação","Reforma e/ou melhoria","un","Esportes","m²","Obras de artes especiais","m","Canalização de cursos de água","m","Estação de bombeamento de água bruta","m³/s","Coletor tronco e/ou interceptores","m","Linhas de distribuição - baixa tensão ","m","Erradicação de lixões","m³",null,null,null,null,null,null,null,null,null,null,null,null,"Plano de Reassentamento e medidas compensatórias","un",null,null,"Plano de Desenvolvimento Socioterritorial","nº fam"]
[null,null,null,null,"Município/UF:","TRAMANDAÍ/RS",null,null,null,"Drenagem ",null,null,"Lazer e turismo","m²","Pavimentação de calçadas","m²","Recomposição de vegetação ciliar, renaturalização de cursos de água ou restauração de margens","m²","Adução","m","Emissário","m","Linhas de transmissão - alta tensão ","m","Sistema de coleta seletiva tradicional, transporte e/ou equipamentos","un",null,null,null,null,null,null,null,null,null,null,null,null,null,null,null,null,"Plano de Gestão Condominial","nº fam"]
[null,null,null,null,"Nº da Operação (0000000-00):","109437911",null,null,null,"Abastecimento de água",null,null,"Saúde","m²","Pavimentação de vias","m²","Reservatório de amortecimento de cheias","m³","Estação de Tratamento de Água (ETA)","m³/s","Estação Elevatória","m³/s",null,null,"Tratamento local ","un"]
[null,null,null,null,"Nº do TransfereGOV (000000):","02829/2024",null,null,null,"Esgotamento sanitário",null,null,"Segurança pública","m²","Sinalização","m²","Estação de Bombeamento","m³/s","Estação de bombeamento de água tratada","m³/s","Estação de Tratamento de Esgoto (ETE)","m³/s",null,null,"Usinas de reciclagem ","m²"]
[null,null,null,null,{"$f":"IF(F4=\"FGTS\",\"Valor de Financiamento Contratado (R$):\",\"Valor do Repasse Contratado (R$):\")","v":"Valor do Repasse Contratado (R$):"},null,null,null,null,"Energia elétrica e iluminação pública",null,null,null,null,null,null,null,null,"Linha de recalque","m","Sistema simplificado de tratamento","m³/s"]
[null,null,null,null,"Valor de Contrapartida Contratada (R$):",null,null,null,null,"Coleta e tratamento de resíduos sólidos",null,null,null,null,null,null,null,null,"Reservação","m³","Unidades sanitárias","un"]
[null,null,null,null,"% mínimo de Contrapartida:",null,null,null,null,"Contenção e estabilização de encostas ",null,null,null,null,null,null,null,null,"Rede de distribuição","m"]
[null,null,null,null,"R$ mínimo de Contrapartida (se houver):",null,null,null,null,"Regularização fundiária",null,null,null,null,null,null,null,null,"Ligações domiciliares e/ou intradomiciliares","un"]
[null,null,null,null,"% máximo de Contrapartida:",null,null,null,null,"Aquisição de terreno",null,null,null,null,null,null,null,null,"Sistema simplificado de abastecimento","m"]
[null,null,null,null,null,null,null,null,null,"Aquisição de equipamentos e insumos"]
[null,null,null,null,"Dados do Empreendimento e Orçamento",null,null,null,null,"Elaboração de estudos e projetos"]
[null,null,null,null,"Nome/apelido:","INFRAESTRUTURA EMEI PORTAL DAS FLORES",null,null,null,"Instrumentos e ações em planejamento e gestão pública"]
[null,null,null,null,"Descrição do Objeto do Lote / CTEF:","CONSTRUÇÃO DA EMEI PORTAL DAS FLORES",null,null,null,"Ações complementares às obras"]
[null,null,null,null,"Regime previdenciário previsto para a obra:","NÃO DESONERADO",null,null,null,"Gerenciamento"]
[null,null,null,null,"Data base do Orçamento:","2024-11-01",null,null,null,"Trabalho social"]
[]
[null,null,null,null,"Responsável pelo Orçamento"]
[null,null,null,null,"Nome:","PAULO RICARDO VIEGAS ALVES"]
[null,null,null,null,"CREA/CAU:","A86.107-3"]
[null,null,null,null,"ART/RRT:","RRT 15101062"]
[null,null,null,null,"Data do preenchimento:",{"$f":"TODAY()","v":"2025-03-14"}]
[]
[null,null,null,null,"Responsável pelo Tomador (Prefeito, no caso de Municípios)"]
[null,null,null,null,"Nome:"]
[null,null,null,null,"Cargo:"]
[]
[null,null,null,null,"Arredondamento das frentes:","Tradicional"]
[]
[null,null,null,null,"B. RESULTADO DO PROCESSO LICITATÓRIO"]
[]
[null,null,null,null,"Licitação"]
[null,null,null,null,"Data de emissão dos documentos de licitação:"]
[null,null,null,null,"Nº do CTEF (contrato com empresa):"]
[null,null,null,null,"Nome da empresa:"]
[null,null,null,null,"CNPJ da empresa:"]
[null,null,null,null,"Regime de execução do CTEF:","(SELECIONAR)"]
[null,null,null,null,"Data base do CTEF:"]
[]
[]
[null,null,null,null,"C. ACOMPANHAMENTO DO EMPREENDIMENTO"]
[]
[null,null,null,null,"Dados da obra"]
[null,null,null,null,"Data do Início da Obra:"]
[null,null,null,null,"Data de fechamento do RRE:",{"$f":"TODAY()","v":"2025-03-14"}]
[]
[null,null,null,null,"Responsável pela Fiscalização"]
[null,null,null,null,"Nome:"]
[null,null,null,null,"Profissão:"]
[null,null,null,null,"CREA/CAU (para obras/projetos):"]
[null,null,null,null,"ART/RRT (para obras/projetos):"]
[]
[]
[null,null,null,null,"D. ACOMPANHAMENTO CAIXA"]
[]
[null,null,null,null,"Responsável Gerencial"]
[null,null,null,null,"Nome:"]
[null,null,null,null,"Função:"]

{"sheet":"NOVO","index":2,"n_rows":52,"n_cols":4,"rows_kept":52,"cut":false,"hidden":false,"merged":[]}
[]
[]
[null,"Novidades da Versão"]
[]
[]
["V3.0.0"]
[null,"GERAL"]
[null,null,{"$f":"IF(D8<>\"\",\"▪\",\"\")","v":"▪"},"Lançamento: Adequação à Portaria 424/2016. Acompanhamento por Eventos."]
[null,null,{"$f":"IF(D9<>\"\",\"▪\",\"\")","v":""}]
["V3.0.1"]
[null,"GERAL"]
[null,null,{"$f":"IF(D12<>\"\",\"▪\",\"\")","v":"▪"},"Ajustes de formatações."]
[null,"PO"]
[null,null,{"$f":"IF(D14<>\"\",\"▪\",\"\")","v":"▪"},"Correção da aplicação do BDI não desonerado."]
[null,null,{"$f":"IF(D15<>\"\",\"▪\",\"\")","v":"▪"},"Inclusão de coluna exclusiva \"Preço Unitário Edital\", para o Modo 'Orçamento Licitado'."]
[]
["V3.0.2"]
[null,"GERAL"]
[null,null,{"$f":"IF(D19<>\"\",\"▪\",\"\")","v":"▪"},"Ajustes de formatações."]
[null,null,{"$f":"IF(D20<>\"\",\"▪\",\"\")","v":"▪"},"Correção do Problema de Guias ocultas no BROFFICE."]
[null,"ORÇAMENTO"]
[null,null,{"$f":"IF(D22<>\"\",\"▪\",\"\")","v":"▪"},"Ampliada obtenção de dados da Planilha Referência de 20.000 para 65.536 linhas."]
[null,"CRONOGRAMA"]
[null,null,{"$f":"IF(D24<>\"\",\"▪\",\"\")","v":"▪"},"Correção na formulação do total acumulado por Repasse, CP e Outros"]
[null,"QCI"]
[null,null,{"$f":"IF(D26<>\"\",\"▪\",\"\")","v":"▪"},"Correção na formulação do arredondamento no rateio dos valores do QCI."]
[null,"RRE"]
[null,null,{"$f":"IF(D28<>\"\",\"▪\",\"\")","v":"▪"},"Correção na formulação do total por Repasse, CP e Outros."]
[]
["V3.0.3"]
[null,"GERAL"]
[null,null,{"$f":"IF(D32<>\"\",\"▪\",\"\")","v":"▪"},"Correção do Problema de Guias ocultas no BROFFICE."]
[null,"CÁLCULO"]
[null,null,{"$f":"IF(D34<>\"\",\"▪\",\"\")","v":"▪"},"Corrigida lentidão e travamento ao incluir e excluir frentes."]
[]
[]
["V3.0.4"]
[null,"BDI"]
[null,null,{"$f":"IF(D39<>\"\",\"▪\",\"\")","v":"▪"},"Correção da CPRB que exibia 4,5% mesmo quando não desonerado."]
[null,"CRONOGRAMA"]
[null,null,{"$f":"IF(D41<>\"\",\"▪\",\"\")","v":"▪"},"Correção da distribuição de Repasse, CP e Outros para as metas manuais."]
[null,"QCI"]
[null,null,{"$f":"IF(D43<>\"\",\"▪\",\"\")","v":"▪"},"Adicionado botão para adotar a CP do QCI como CP do contrato (zera saldo a reprogramar de CP)."]
[]
["V3.0.5"]
[null,"GERAL"]
[null,null,{"$f":"IF(D47<>\"\",\"▪\",\"\")","v":"▪"},"Corrigido modo de Cálculo da Planilha para Automático."]
[]
["V3.0.6"]
[null,"GERAL"]
[null,null,{"$f":"IF(D51<>\"\",\"▪\",\"\")","v":"▪"},"Adicionado modo de arredondamento para compatibilidade com o TransfereGOV, altera na aba DADOS"]
[null,null,{"$f":"IF(D52<>\"\",\"▪\",\"\")","v":"▪"},"A planilha passará a ser disponibilizada com o formato .xlsm. Deve ser usado arquivo referência 1.9 ou superior, também no formato .xlsm"]

{"sheet":"BDI","index":3,"n_rows":146,"n_cols":26,"rows_kept":146,"cut":false,"hidden":false,"merged":[[4,9,4,10],[4,11,4,12],[4,13,4,18],[0,17,0,18],[1,17,1,18],[3,9,3,10],[3,11,3,12],[3,13,3,18],[10,9,10,16],[10,17,10,18],[6,9,6,18],[7,9,7,18],[9,9,9,16],[9,17,9,18],[18,23,19,23],[18,24,19,24],[16,9,16,18],[18,25,19,25],[18,20,19,22],[18,9,19,16],[18,17,19,17],[18,18,19,18],[13,9,13,18],[15,9,15,18],[22,9,22,16],[22,20,22,22],[20,9,20,16],[20,20,20,22],[21,9,21,16],[21,20,21,22],[24,9,24,16],[24,20,24,22],[25,9,25,16],[25,20,25,22],[26,9,26,16],[26,20,26,22],[27,9,27,16],[27,20,27,22],[23,9,23,16],[23,20,23,22],[35,13,35,15],[37,9,37,18],[29,9,29,16],[31,10,31,18],[28,9,28,16],[28,20,28,22],[33,9,33,18],[34,12,35,12],[48,9,48,12],[53,9,53,18],[44,9,44,12],[44,15,44,18],[45,9,45,12],[47,9,47,12],[34,13,34,15],[34,16,35,16],[39,9,39,18],[42,9,42,18],[58,24,59,24],[58,25,59,25],[58,9,59,16],[58,17,59,17],[58,18,59,18],[58,20,59,22],[58,23,59,23],[60,9,60,16],[60,20,60,22],[55,9,55,18],[56,9,56,18],[63,9,63,16],[63,20,63,22],[61,9,61,16],[61,20,61,22],[62,9,62,16],[62,20,62,22],[64,9,64,16],[64,20,64,22],[65,9,65,16],[65,20,65,22],[66,20,66,22],[67,9,67,16],[67,20,67,22],[93,9,93,18],[84,9,84,12],[84,15,84,18],[66,9,66,16],[77,9,77,18],[69,9,69,16],[71,10,71,18],[88,9,88,12],[68,20,68,22],[85,9,85,12],[87,9,87,12],[73,9,73,18],[74,12,75,12],[79,9,79,18],[82,9,82,18],[75,13,75,15],[74,13,74,15],[74,16,75,16],[98,24,99,24],[98,25,99,25],[98,9,99,16],[98,17,99,17],[98,18,99,18],[98,23,99,23],[100,9,100,16],[100,20,100,22],[95,9,95,18],[96,9,96,18],[98,20,99,22],[107,20,107,22],[108,9,108,16],[108,20,108,22],[109,9,109,16],[111,10,111,18],[117,9,117,18],[5,8,9,8],[113,9,113,18],[106,9,106,16],[114,12,115,12],[104,9,104,16],[102,9,102,16],[68,9,68,16],[114,13,114,15],[114,16,115,16],[101,9,101,16],[101,20,101,22],[104,20,104,22],[105,9,105,16],[105,20,105,22],[103,9,103,16],[103,20,103,22],[102,20,102,22],[106,20,106,22],[128,9,128,12],[119,9,119,18],[122,9,122,18],[124,9,124,12],[124,15,124,18],[125,9,125,12],[127,9,127,12],[115,13,115,15],[107,9,107,16]]}
[null,null,null,null,"MIN","MED","MAX",null,null,null,null,null,null,null,{"$f":"\"Quadro de Composição do BDI\"","v":"Quadro de Composição do BDI"},null,null,"Grau de Sigilo"]
["Construção e Reforma de Edifícios","AC",{"$f":"CONCATENATE(A2,\"-\",B2)","v":"Construção e Reforma de Edifícios-AC"},null,0.03,0.04,5.5E-2,null,null,null,null,null,null,null,null,null,null,"#PUBLICO"]
[{"$f":"A2","v":"Construção e Reforma de Edifícios"},"SG","Construção e Reforma de Edifícios-SG",null,8.0000000000000002E-3,8.0000000000000002E-3,0.01]
[{"$f":"A3","v":"Construção e Reforma de Edifícios"},"R","Construção e Reforma de Edifícios-R",null,9.7000000000000003E-3,1.2699999999999999E-2,1.2699999999999999E-2,null,null,"Nº OPERAÇÃO",null,"Nº TRANSFEREGOV",null,"PROPONENTE / TOMADOR"]
[{"$f":"A4","v":"Construção e Reforma de Edifícios"},"DF","Construção e Reforma de Edifícios-DF",null,5.8999999999999999E-3,1.23E-2,1.3899999999999999E-2,null,null,{"$f":"Import.CR","v":"109437911"},null,{"$f":"Import.TransfereGOV","v":"02829/2024"},null,{"$f":"Import.Proponente","v":"PREFEITURA MUNICIPAL DE TRAMANDAÍ "}]
[{"$f":"A5","v":"Construção e Reforma de Edifícios"},"L","Construção e Reforma de Edifícios-L",null,6.1600000000000002E-2,7.400000000000001E-2,8.9600000000000013E-2,null,"FILTRO"]
[{"$f":"A6","v":"Construção e Reforma de Edifícios"},"BDI PAD","Construção e Reforma de Edifícios-BDI PAD",null,0.2034,0.22120000000000001,0.25,null,null,"APELIDO DO EMPREENDIMENTO / DESCRIÇÃO DO LOTE"]
["Construção de Praças Urbanas, Rodovias, Ferrovias e recapeamento e pavimentação de vias urbanas","AC","Construção de Praças Urbanas, Rodovias, Ferrovias e recapeamento e pavimentação de vias urbanas-AC",null,3.7999999999999999E-2,4.0099999999999997E-2,4.6699999999999998E-2,null,null,{"$f":"Import.Apelido&\" / \"&Import.DescLote","v":"INFRAESTRUTURA EMEI PORTAL DAS FLORES / CONSTRUÇÃO DA EMEI PORTAL DAS FLORES"}]
["Construção de Praças Urbanas, Rodovias, Ferrovias e recapeamento e pavimentação de vias urbanas","SG","Construção de Praças Urbanas, Rodovias, Ferrovias e recapeamento e pavimentação de vias urbanas-SG",null,3.2000000000000002E-3,4.0000000000000001E-3,7.4000000000000003E-3]
["Construção de Praças Urbanas, Rodovias, Ferrovias e recapeamento e pavimentação de vias urbanas","R","Construção de Praças Urbanas, Rodovias, Ferrovias e recapeamento e pavimentação de vias urbanas-R",null,5.0000000000000001E-3,5.6000000000000008E-3,9.7000000000000003E-3,null,null,"Conforme legislação tributária municipal, definir estimativa de percentual da base de cálculo para o ISS:"]
["Construção de Praças Urbanas, Rodovias, Ferrovias e recapeamento e pavimentação de vias urbanas","DF","Construção de Praças Urbanas, Rodovias, Ferrovias e recapeamento e pavimentação de vias urbanas-DF",null,1.0200000000000001E-2,1.11E-2,1.21E-2,null,"↓","Sobre a base de cálculo, definir a respectiva alíquota do ISS (entre 2% e 5%):",null,null,null,null,null,null,null,0.02]
["Construção de Praças Urbanas, Rodovias, Ferrovias e recapeamento e pavimentação de vias urbanas","L","Construção de Praças Urbanas, Rodovias, Ferrovias e recapeamento e pavimentação de vias urbanas-L",null,6.6400000000000001E-2,7.2999999999999995E-2,8.6899999999999991E-2,null,"F"]
["Construção de Praças Urbanas, Rodovias, Ferrovias e recapeamento e pavimentação de vias urbanas","BDI PAD","Construção de Praças Urbanas, Rodovias, Ferrovias e recapeamento e pavimentação de vias urbanas-BDI PAD",null,0.19600000000000001,0.2097,0.24230000000000002,null,"F"]
["Construção de Redes de Abastecimento de Água, Coleta de Esgoto","AC","Construção de Redes de Abastecimento de Água, Coleta de Esgoto-AC",null,3.4300000000000004E-2,4.9299999999999997E-2,6.7099999999999993E-2,null,"F","BDI 1"]
[{"$f":"A14","v":"Construção de Redes de Abastecimento de Água, Coleta de Esgoto"},"SG","Construção de Redes de Abastecimento de Água, Coleta de Esgoto-SG",null,2.8000000000000004E-3,4.8999999999999998E-3,7.4999999999999997E-3,null,"F"]
[{"$f":"A15","v":"Construção de Redes de Abastecimento de Água, Coleta de Esgoto"},"R","Construção de Redes de Abastecimento de Água, Coleta de Esgoto-R",null,0.01,1.3899999999999999E-2,1.7399999999999999E-2,null,"F","TIPO DE OBRA"]
[{"$f":"A16","v":"Construção de Redes de Abastecimento de Água, Coleta de Esgoto"},"DF","Construção de Redes de Abastecimento de Água, Coleta de Esgoto-DF",null,9.3999999999999986E-3,9.8999999999999991E-3,1.1699999999999999E-2,null,"F","(SELECIONAR)"]
[{"$f":"A17","v":"Construção de Redes de Abastecimento de Água, Coleta de Esgoto"},"L","Construção de Redes de Abastecimento de Água, Coleta de Esgoto-L",null,6.7400000000000002E-2,8.0399999999999985E-2,9.4E-2,null,"F"]
[{"$f":"A18","v":"Construção de Redes de Abastecimento de Água, Coleta de Esgoto"},"BDI PAD","Construção de Redes de Abastecimento de Água, Coleta de Esgoto-BDI PAD",null,0.20760000000000001,0.24179999999999999,0.26440000000000002,null,"F","Itens",null,null,null,null,null,null,null,"Siglas","% Adotado",null,"Situação",null,null,"1º Quartil","Médio","3º Quartil"]
["Construção e Manutenção de Estações e Redes de Distribuição de Energia Elétrica","AC","Construção e Manutenção de Estações e Redes de Distribuição de Energia Elétrica-AC",null,5.2900000000000003E-2,5.9200000000000003E-2,7.9299999999999995E-2,null,"F"]
[{"$f":"A20","v":"Construção e Manutenção de Estações e Redes de Distribuição de Energia Elétrica"},"SG","Construção e Manutenção de Estações e Redes de Distribuição de Energia Elétrica-SG",null,2.5000000000000001E-3,5.1000000000000004E-3,5.6000000000000008E-3,null,"F",{"$f":"IF($J$17=$A$146,\"Encargos Sociais incidentes sobre a mão de obra\",\"Administração Central\")","v":"Administração Central"},null,null,null,null,null,null,null,{"$f":"IF($J17=$A$146,\"K1\",\"AC\")","v":"AC"},5.5E-2,null,"-",null,null,{"$f":"VLOOKUP(CONCATENATE(J17,\"-\",R21),$C$2:$G$136,3,FALSE)","v":{"$error":"#N/A"}},{"$f":"VLOOKUP(CONCATENATE(J17,\"-\",R21),$C$2:$G$136,4,FALSE)","v":{"$error":"#N/A"}},{"$f":"VLOOKUP(CONCATENATE(J17,\"-\",R21),$C$2:$G$136,5,FALSE)","v":{"$error":"#N/A"}}]
[{"$f":"A21","v":"Construção e Manutenção de Estações e Redes de Distribuição de Energia Elétrica"},"R","Construção e Manutenção de Estações e Redes de Distribuição de Energia Elétrica-R",null,0.01,1.4800000000000001E-2,1.9699999999999999E-2,null,"F",{"$f":"IF($J$17=$A$146,\"Administração Central da empresa ou consultoria - overhead\",\"Seguro e Garantia\")","v":"Seguro e Garantia"},null,null,null,null,null,null,null,{"$f":"IF($J17=$A$146,\"K2\",\"SG\")","v":"SG"},8.0000000000000002E-3,null,"-",null,null,{"$f":"VLOOKUP(CONCATENATE(J17,\"-\",R22),$C$2:$G$136,3,FALSE)","v":{"$error":"#N/A"}},{"$f":"VLOOKUP(CONCATENATE(J17,\"-\",R22),$C$2:$G$136,4,FALSE)","v":{"$error":"#N/A"}},{"$f":"VLOOKUP(CONCATENATE(J17,\"-\",R22),$C$2:$G$136,5,FALSE)","v":{"$error":"#N/A"}}]
[{"$f":"A22","v":"Construção e Manutenção de Estações e Redes de Distribuição de Energia Elétrica"},"DF","Construção e Manutenção de Estações e Redes de Distribuição de Energia Elétrica-DF",null,1.01E-2,1.0700000000000001E-2,1.11E-2,null,"F",{"$f":"IF($J$17=$A$146,\"\",\"Risco\")","v":"Risco"},null,null,null,null,null,null,null,{"$f":"IF($J17=$A$146,\"\",\"R\")","v":"R"},1.265E-2,null,"-",null,null,{"$f":"VLOOKUP(CONCATENATE(J17,\"-\",R23),$C$2:$G$136,3,FALSE)","v":{"$error":"#N/A"}},{"$f":"VLOOKUP(CONCATENATE(J17,\"-\",R23),$C$2:$G$136,4,FALSE)","v":{"$error":"#N/A"}},{"$f":"VLOOKUP(CONCATENATE(J17,\"-\",R23),$C$2:$G$136,5,FALSE)","v":{"$error":"#N/A"}}]
[{"$f":"A23","v":"Construção e Manutenção de Estações e Redes de Distribuição de Energia Elétrica"},"L","Construção e Manutenção de Estações e Redes de Distribuição de Energia Elétrica-L",null,0.08,8.3100000000000007E-2,9.5100000000000004E-2,null,"F",{"$f":"IF($J$17=$A$146,\"\",\"Despesas Financeiras\")","v":"Despesas Financeiras"},null,null,null,null,null,null,null,{"$f":"IF($J17=$A$146,\"\",\"DF\")","v":"DF"},1.24E-2,null,"-",null,null,{"$f":"VLOOKUP(CONCATENATE(J17,\"-\",R24),$C$2:$G$136,3,FALSE)","v":{"$error":"#N/A"}},{"$f":"VLOOKUP(CONCATENATE(J17,\"-\",R24),$C$2:$G$136,4,FALSE)","v":{"$error":"#N/A"}},{"$f":"VLOOKUP(CONCATENATE(J17,\"-\",R24),$C$2:$G$136,5,FALSE)","v":{"$error":"#N/A"}}]
[{"$f":"A24","v":"Construção e Manutenção de Estações e Redes de Distribuição de Energia Elétrica"},"BDI PAD","Construção e Manutenção de Estações e Redes de Distribuição de Energia Elétrica-BDI PAD",null,0.24,0.25840000000000002,0.27860000000000001,null,"F",{"$f":"IF($J$17=$A$146,\"Margem bruta da empresa de consultoria\",\"Lucro\")","v":"Lucro"},null,null,null,null,null,null,null,{"$f":"IF($J17=$A$146,\"K3\",\"L\")","v":"L"},8.3000000000000004E-2,null,"-",null,null,{"$f":"VLOOKUP(CONCATENATE(J17,\"-\",R25),$C$2:$G$136,3,FALSE)","v":{"$error":"#N/A"}},{"$f":"VLOOKUP(CONCATENATE(J17,\"-\",R25),$C$2:$G$136,4,FALSE)","v":{"$error":"#N/A"}},{"$f":"VLOOKUP(CONCATENATE(J17,\"-\",R25),$C$2:$G$136,5,FALSE)","v":{"$error":"#N/A"}}]
["Obras Portuárias, Marítimas e Fluviais","AC","Obras Portuárias, Marítimas e Fluviais-AC",null,0.04,5.5199999999999999E-2,7.85E-2,null,"F","Tributos (impostos COFINS 3%, e  PIS 0,65%)",null,null,null,null,null,null,null,"CP",5.6500000000000002E-2,null,"-",null,null,3.6499999999999998E-2,3.6499999999999998E-2,3.6499999999999998E-2]
[{"$f":"A26","v":"Obras Portuárias, Marítimas e Fluviais"},"SG","Obras Portuárias, Marítimas e Fluviais-SG",null,8.1000000000000013E-3,1.2199999999999999E-2,1.9900000000000001E-2,null,"F","Tributos (ISS, variável de acordo com o município)",null,null,null,null,null,null,null,"ISS",{"$f":"IF(AND($J17<>$A$145,COUNTA(OFFSET(S20,1,0,6))>0),$R$11*$R$10,0)","v":0},null,"-",null,null,0,2.5000000000000001E-2,0.05]
[{"$f":"A27","v":"Obras Portuárias, Marítimas e Fluviais"},"R","Obras Portuárias, Marítimas e Fluviais-R",null,1.46E-2,2.3199999999999998E-2,3.1600000000000003E-2,null,"F","Tributos (Contribuição Previdenciária sobre a Receita Bruta - 0% ou 4,5% - Desoneração)",null,null,null,null,null,null,null,"CPRB",{"$f":"IF(BDI.Opcao<>\"Desonerado\",0,IF(AND($J17<>$A$145,COUNTA(OFFSET(S20,1,0,6))>0),4.5%,0%))","v":0},null,"-",null,null,0,4.4999999999999998E-2,4.4999999999999998E-2]
[{"$f":"A28","v":"Obras Portuárias, Marítimas e Fluviais"},"DF","Obras Portuárias, Marítimas e Fluviais-DF",null,9.3999999999999986E-3,1.0200000000000001E-2,1.3300000000000001E-2,null,"F","BDI SEM desoneração (Fórmula Acórdão TCU)",null,null,null,null,null,null,null,"BDI PAD",{"$f":"IF($J17=$A$145,0,ROUND((((1+S21+S22+S23)*(1+S24)*(1+S25)/(1-(S26+S27)))-1),4))","v":0.25},null,{"$f":"IF(OR($J$17=$A$146,$J$17=$A$145,AND(S29>=X29,S29<=Z29)),\"OK\",\"FORA DO INTERVALO\")","v":{"$error":"#N/A"}},null,null,{"$f":"IF($J17=$A$145,0,VLOOKUP(CONCATENATE($J17,\"-\",$R29),$C$2:$G$136,3,FALSE))","v":{"$error":"#N/A"}},{"$f":"IF($J17=$A$145,0,VLOOKUP(CONCATENATE($J17,\"-\",$R29),$C$2:$G$136,4,FALSE))","v":{"$error":"#N/A"}},{"$f":"IF($J17=$A$145,0,VLOOKUP(CONCATENATE($J17,\"-\",$R29),$C$2:$G$136,5,FALSE))","v":{"$error":"#N/A"}}]
[{"$f":"A29","v":"Obras Portuárias, Marítimas e Fluviais"},"L","Obras Portuárias, Marítimas e Fluviais-L",null,7.1399999999999991E-2,8.4000000000000005E-2,0.1043,null,"F","BDI COM desoneração",null,null,null,null,null,null,null,"BDI DES",{"$f":"IF($J17=$A$145,0,ROUND((((1+S21+S22+S23)*(1+S24)*(1+S25)/(1-(S26+S27+S28)))-1),4))","v":0.25}]
[{"$f":"A30","v":"Obras Portuárias, Marítimas e Fluviais"},"BDI PAD","Obras Portuárias, Marítimas e Fluviais-BDI PAD",null,0.22800000000000001,0.27479999999999999,0.3095,null,"F"]
["Fornecimento de Materiais e Equipamentos (aquisição indireta - em conjunto com licitação de obras)","AC","Fornecimento de Materiais e Equipamentos (aquisição indireta - em conjunto com licitação de obras)-AC",null,1.4999999999999999E-2,3.4500000000000003E-2,4.4900000000000002E-2,null,"F",{"$f":"IF(U29<>\"ok\",\"X\",\"\")","v":{"$error":"#N/A"}},{"$f":"IF(U29<>\"ok\",\"Anexo: Relatório Técnico Circunstanciado justificando a adoção do percentual de cada parcela do BDI.\",\"\")","v":{"$error":"#N/A"}}]
[{"$f":"A32","v":"Fornecimento de Materiais e Equipamentos (aquisição indireta - em conjunto com licitação de obras)"},"SG","Fornecimento de Materiais e Equipamentos (aquisição indireta - em conjunto com licitação de obras)-SG",null,3.0000000000000001E-3,4.7999999999999996E-3,8.199999999999999E-3,null,"F"]
[{"$f":"A33","v":"Fornecimento de Materiais e Equipamentos (aquisição indireta - em conjunto com licitação de obras)"},"R","Fornecimento de Materiais e Equipamentos (aquisição indireta - em conjunto com licitação de obras)-R",null,5.6000000000000008E-3,8.5000000000000006E-3,8.8999999999999999E-3,null,"F","Os valores de BDI foram calculados com o emprego da fórmula:"]
[{"$f":"A34","v":"Fornecimento de Materiais e Equipamentos (aquisição indireta - em conjunto com licitação de obras)"},"DF","Fornecimento de Materiais e Equipamentos (aquisição indireta - em conjunto com licitação de obras)-DF",null,8.5000000000000006E-3,8.5000000000000006E-3,1.11E-2,null,"F",null,null,null,"BDI =",{"$f":"IF($J17=$A$146,\"(1+K1+K2)*(1+K3)\",\"(1+AC + S + R + G)*(1 + DF)*(1+L)\")","v":"(1+AC + S + R + G)*(1 + DF)*(1+L)"},null,null," - 1"]
[{"$f":"A35","v":"Fornecimento de Materiais e Equipamentos (aquisição indireta - em conjunto com licitação de obras)"},"L","Fornecimento de Materiais e Equipamentos (aquisição indireta - em conjunto com licitação de obras)-L",null,3.5000000000000003E-2,5.1100000000000007E-2,6.2199999999999998E-2,null,"F",null,null,null,null,"(1-CP-ISS-CRPB)"]
[{"$f":"A36","v":"Fornecimento de Materiais e Equipamentos (aquisição indireta - em conjunto com licitação de obras)"},"BDI PAD","Fornecimento de Materiais e Equipamentos (aquisição indireta - em conjunto com licitação de obras)-BDI PAD",null,0.111,0.14019999999999999,0.16800000000000001,null,"F"]
["Fornecimento de Materiais e Equipamentos (aquisição direta)","AC","Fornecimento de Materiais e Equipamentos (aquisição direta)-AC",null,"-","-","-",null,"F",{"$f":"CONCATENATE(\"Declaro para os devidos fins que, conforme legislação tributária municipal, a base de cálculo deste tipo de obra corresponde à \",$R$10*100,\"%, com a respectiva alíquota de \",$R$11*100,\"%.\")","v":"Declaro para os devidos fins que, conforme legislação tributária municipal, a base de cálculo deste tipo de obra corresponde à 0%, com a respectiva alíquota de 2%."}]
["Fornecimento de Materiais e Equipamentos (aquisição direta)","SG","Fornecimento de Materiais e Equipamentos (aquisição direta)-SG",null,"-","-","-",null,"F"]
["Fornecimento de Materiais e Equipamentos (aquisição direta)","R","Fornecimento de Materiais e Equipamentos (aquisição direta)-R",null,"-","-","-",null,"F",{"$f":"CONCATENATE(\"Declaro para os devidos fins que o regime de Contribuição Previdenciária sobre a Receita Bruta adotado para elaboração do orçamento foi \",IF(DESONERACAO=\"Sim\",\"COM\",\"SEM\"),\" Desoneração, e que esta é a alternativa mais adequada para a Administração Pública.\")","v":"Declaro para os devidos fins que o regime de Contribuição Previdenciária sobre a Receita Bruta adotado para elaboração do orçamento foi SEM Desoneração, e que esta é a alternativa mais adequada para a Administração Pública."}]
["Fornecimento de Materiais e Equipamentos (aquisição direta)","DF","Fornecimento de Materiais e Equipamentos (aquisição direta)-DF",null,"-","-","-",null,"F"]
["Fornecimento de Materiais e Equipamentos (aquisição direta)","L","Fornecimento de Materiais e Equipamentos (aquisição direta)-L",null,"-","-","-",null,"F","Observações:"]
["Fornecimento de Materiais e Equipamentos (aquisição direta)","BDI PAD","Fornecimento de Materiais e Equipamentos (aquisição direta)-BDI PAD",null,"-","-","-",null,"F"]
["Estudos e Projetos, Planos e Gerenciamento e outros correlatos","K1","Estudos e Projetos, Planos e Gerenciamento e outros correlatos-K1",null,"-","-","-",null,"F"]
[{"$f":"A44","v":"Estudos e Projetos, Planos e Gerenciamento e outros correlatos"},"K2","Estudos e Projetos, Planos e Gerenciamento e outros correlatos-K2",null,"-",0.2,"-",null,"F",{"$f":"Import.Município","v":"TRAMANDAÍ/RS"},null,null,null,null,null,{"$f":"DADOS!$F$25","v":"2025-03-14"}]
[{"$f":"A45","v":"Estudos e Projetos, Planos e Gerenciamento e outros correlatos"},null,"Estudos e Projetos, Planos e Gerenciamento e outros correlatos-",null,"-","-","-",null,"F","Local",null,null,null,null,null,"Data"]
[{"$f":"A46","v":"Estudos e Projetos, Planos e Gerenciamento e outros correlatos"},null,"Estudos e Projetos, Planos e Gerenciamento e outros correlatos-",null,"-","-","-",null,"F"]
[{"$f":"A47","v":"Estudos e Projetos, Planos e Gerenciamento e outros correlatos"},"K3","Estudos e Projetos, Planos e Gerenciamento e outros correlatos-K3",null,"-",0.12,"-",null,"F"]
[{"$f":"A48","v":"Estudos e Projetos, Planos e Gerenciamento e outros correlatos"},"BDI PAD","Estudos e Projetos, Planos e Gerenciamento e outros correlatos-BDI PAD",null,"-","-","-",null,"F","Responsável Técnico"]
[null,null,null,null,null,null,null,null,"F","Nome:",{"$f":"Import.RespOrçamento","v":"PAULO RICARDO VIEGAS ALVES"}]
[null,null,null,null,null,null,null,null,"F","CREA/CAU:","A86.107-3"]
[null,null,null,null,null,null,null,null,"F","ART/RRT:","RRT 15101062"]
[null,null,null,null,null,null,null,null,"F"]
[null,null,null,null,null,null,null,null,{"$f":"IF($S$69=0,\"\",\"F\")","v":""},"BDI 2"]
[null,null,null,null,null,null,null,null,{"$f":"IF($S$69=0,\"\",\"F\")","v":""}]
[null,null,null,null,null,null,null,null,"","TIPO DE OBRA"]
[null,null,null,null,null,null,null,null,"","(SELECIONAR)"]
[null,null,null,null,null,null,null,null,""]
[null,null,null,null,null,null,null,null,"","Itens",null,null,null,null,null,null,null,"Siglas","% Adotado",null,"Situação",null,null,"1º Quartil","Médio","3º Quartil"]
[null,null,null,null,null,null,null,null,""]
[null,null,null,null,null,null,null,null,"",{"$f":"IF($J$17=$A$146,\"Encargos Sociais incidentes sobre a mão de obra\",\"Administração Central\")","v":"Administração Central"},null,null,null,null,null,null,null,{"$f":"IF($J57=$A$146,\"K1\",\"AC\")","v":"AC"},null,null,"-",null,null,{"$f":"VLOOKUP(CONCATENATE(J57,\"-\",R61),$C$2:$G$136,3,FALSE)","v":{"$error":"#N/A"}},{"$f":"VLOOKUP(CONCATENATE(J57,\"-\",R61),$C$2:$G$136,4,FALSE)","v":{"$error":"#N/A"}},{"$f":"VLOOKUP(CONCATENATE(J57,\"-\",R61),$C$2:$G$136,5,FALSE)","v":{"$error":"#N/A"}}]
[null,null,null,null,null,null,null,null,"",{"$f":"IF($J$17=$A$146,\"Administração Central da empresa ou consultoria - overhead\",\"Seguro e Garantia\")","v":"Seguro e Garantia"},null,null,null,null,null,null,null,{"$f":"IF($J57=$A$146,\"K2\",\"SG\")","v":"SG"},null,null,"-",null,null,{"$f":"VLOOKUP(CONCATENATE(J57,\"-\",R62),$C$2:$G$136,3,FALSE)","v":{"$error":"#N/A"}},{"$f":"VLOOKUP(CONCATENATE(J57,\"-\",R62),$C$2:$G$136,4,FALSE)","v":{"$error":"#N/A"}},{"$f":"VLOOKUP(CONCATENATE(J57,\"-\",R62),$C$2:$G$136,5,FALSE)","v":{"$error":"#N/A"}}]
[null,null,null,null,null,null,null,null,"",{"$f":"IF($J$17=$A$146,\"\",\"Risco\")","v":"Risco"},null,null,null,null,null,null,null,{"$f":"IF($J57=$A$146,\"\",\"R\")","v":"R"},null,null,"-",null,null,{"$f":"VLOOKUP(CONCATENATE(J57,\"-\",R63),$C$2:$G$136,3,FALSE)","v":{"$error":"#N/A"}},{"$f":"VLOOKUP(CONCATENATE(J57,\"-\",R63),$C$2:$G$136,4,FALSE)","v":{"$error":"#N/A"}},{"$f":"VLOOKUP(CONCATENATE(J57,\"-\",R63),$C$2:$G$136,5,FALSE)","v":{"$error":"#N/A"}}]
[null,null,null,null,null,null,null,null,"",{"$f":"IF($J$17=$A$146,\"\",\"Despesas Financeiras\")","v":"Despesas Financeiras"},null,null,null,null,null,null,null,{"$f":"IF($J57=$A$146,\"\",\"DF\")","v":"DF"},null,null,"-",null,null,{"$f":"VLOOKUP(CONCATENATE(J57,\"-\",R64),$C$2:$G$136,3,FALSE)","v":{"$error":"#N/A"}},{"$f":"VLOOKUP(CONCATENATE(J57,\"-\",R64),$C$2:$G$136,4,FALSE)","v":{"$error":"#N/A"}},{"$f":"VLOOKUP(CONCATENATE(J57,\"-\",R64),$C$2:$G$136,5,FALSE)","v":{"$error":"#N/A"}}]
[null,null,null,null,null,null,null,null,"",{"$f":"IF($J$17=$A$146,\"Margem bruta da empresa de consultoria\",\"Lucro\")","v":"Lucro"},null,null,null,null,null,null,null,{"$f":"IF($J57=$A$146,\"K3\",\"L\")","v":"L"},null,null,"-",null,null,{"$f":"VLOOKUP(CONCATENATE(J57,\"-\",R65),$C$2:$G$136,3,FALSE)","v":{"$error":"#N/A"}},{"$f":"VLOOKUP(CONCATENATE(J57,\"-\",R65),$C$2:$G$136,4,FALSE)","v":{"$error":"#N/A"}},{"$f":"VLOOKUP(CONCATENATE(J57,\"-\",R65),$C$2:$G$136,5,FALSE)","v":{"$error":"#N/A"}}]
[null,null,null,null,null,null,null,null,"","Tributos (impostos COFINS 3%, e  PIS 0,65%)",null,null,null,null,null,null,null,"CP",null,null,"-",null,null,3.6499999999999998E-2,3.6499999999999998E-2,3.6499999999999998E-2]
[null,null,null,null,null,null,null,null,"","Tributos (ISS, variável de acordo com o município)",null,null,null,null,null,null,null,"ISS",{"$f":"IF(AND($J57<>$A$145,COUNTA(OFFSET(S60,1,0,6))>0),$R$11*$R$10,0)","v":0},null,"-",null,null,0,2.5000000000000001E-2,0.05]
[null,null,null,null,null,null,null,null,"","Tributos (Contribuição Previdenciária sobre a Receita Bruta - 0% ou 4,5% - Desoneração)",null,null,null,null,null,null,null,"CPRB",{"$f":"IF(BDI.Opcao<>\"Desonerado\",0,IF(AND($J57<>$A$145,COUNTA(OFFSET(S60,1,0,6))>0),4.5%,0%))","v":0},null,"-",null,null,0,4.4999999999999998E-2,4.4999999999999998E-2]
[null,null,null,null,null,null,null,null,"","BDI SEM desoneração (Fórmula Acórdão TCU)",null,null,null,null,null,null,null,"BDI PAD",{"$f":"IF($J57=$A$145,0,ROUND((((1+S61+S62+S63)*(1+S64)*(1+S65)/(1-(S66+S67)))-1),4))","v":0},null,{"$f":"IF(OR($J$17=$A$146,$J$17=$A$145,AND(S69>=X69,S69<=Z69)),\"OK\",\"FORA DO INTERVALO\")","v":{"$error":"#N/A"}},null,null,{"$f":"IF($J57=$A$145,0,VLOOKUP(CONCATENATE($J57,\"-\",$R69),$C$2:$G$136,3,FALSE))","v":{"$error":"#N/A"}},{"$f":"IF($J57=$A$145,0,VLOOKUP(CONCATENATE($J57,\"-\",$R69),$C$2:$G$136,4,FALSE))","v":{"$error":"#N/A"}},{"$f":"IF($J57=$A$145,0,VLOOKUP(CONCATENATE($J57,\"-\",$R69),$C$2:$G$136,5,FALSE))","v":{"$error":"#N/A"}}]
[null,null,null,null,null,null,null,null,"","BDI COM desoneração",null,null,null,null,null,null,null,"BDI DES",{"$f":"IF($J57=$A$145,0,ROUND((((1+S61+S62+S63)*(1+S64)*(1+S65)/(1-(S66+S67+S68)))-1),4))","v":0}]
[null,null,null,null,null,null,null,null,""]
[null,null,null,null,null,null,null,null,"",{"$f":"IF(U69<>\"ok\",\"X\",\"\")","v":{"$error":"#N/A"}},{"$f":"IF(U69<>\"ok\",\"Anexo: Relatório Técnico Circunstanciado justificando a adoção do percentual de cada parcela do BDI.\",\"\")","v":{"$error":"#N/A"}}]
[null,null,null,null,null,null,null,null,""]
[null,null,null,null,null,null,null,null,"","Os valores de BDI foram calculados com o emprego da fórmula:"]
[null,null,null,null,null,null,null,null,"",null,null,null,"BDI =",{"$f":"IF($J57=$A$146,\"(1+K1+K2)*(1+K3)\",\"(1+AC + S + R + G)*(1 + DF)*(1+L)\")","v":"(1+AC + S + R + G)*(1 + DF)*(1+L)"},null,null," - 1"]
[null,null,null,null,null,null,null,null,"",null,null,null,null,"(1-CP-ISS-CRPB)"]
[null,null,null,null,null,null,null,null,""]
[null,null,null,null,null,null,null,null,"",{"$f":"CONCATENATE(\"Declaro para os devidos fins que, conforme legislação tributária municipal, a base de cálculo deste tipo de obra corresponde à \",$R$10*100,\"%, com a respectiva alíquota de \",$R$11*100,\"%.\")","v":"Declaro para os devidos fins que, conforme legislação tributária municipal, a base de cálculo deste tipo de obra corresponde à 0%, com a respectiva alíquota de 2%."}]
[null,null,null,null,null,null,null,null,""]
[null,null,null,null,null,null,null,null,"",{"$f":"CONCATENATE(\"Declaro para os devidos fins que o regime de Contribuição Previdenciária sobre a Receita Bruta adotado para elaboração do orçamento foi \",IF(DESONERACAO=\"Sim\",\"COM\",\"SEM\"),\" Desoneração, e que esta é a alternativa mais adequada para a Administração Pública.\")","v":"Declaro para os devidos fins que o regime de Contribuição Previdenciária sobre a Receita Bruta adotado para elaboração do orçamento foi SEM Desoneração, e que esta é a alternativa mais adequada para a Administração Pública."}]
[null,null,null,null,null,null,null,null,""]
[null,null,null,null,null,null,null,null,"","Observações:"]
[null,null,null,null,null,null,null,null,""]
[null,null,null,null,null,null,null,null,""]
[null,null,null,null,null,null,null,null,"",{"$f":"Import.Município","v":"TRAMANDAÍ/RS"},null,null,null,null,null,{"$f":"DADOS!$F$25","v":"2025-03-14"}]
[null,null,null,null,null,null,null,null,"","Local",null,null,null,null,null,"Data"]
[null,null,null,null,null,null,null,null,""]
[null,null,null,null,null,null,null,null,""]
[null,null,null,null,null,null,null,null,"","Responsável Técnico"]
[null,null,null,null,null,null,null,null,"","Nome:",{"$f":"Import.RespOrçamento","v":"PAULO RICARDO VIEGAS ALVES"}]
[null,null,null,null,null,null,null,null,"","CREA/CAU:","A86.107-3"]
[null,null,null,null,null,null,null,null,"","ART/RRT:","RRT 15101062"]
[null,null,null,null,null,null,null,null,""]
[null,null,null,null,null,null,null,null,{"$f":"IF($S$109=0,\"\",\"F\")","v":""},"BDI 3"]
[null,null,null,null,null,null,null,null,{"$f":"IF($S$109=0,\"\",\"F\")","v":""}]
[null,null,null,null,null,null,null,null,"","TIPO DE OBRA"]
[null,null,null,null,null,null,null,null,"","(SELECIONAR)"]
[null,null,null,null,null,null,null,null,""]
[null,null,null,null,null,null,null,null,"","Itens",null,null,null,null,null,null,null,"Siglas","% Adotado",null,"Situação",null,null,"1º Quartil","Médio","3º Quartil"]
[null,null,null,null,null,null,null,null,""]
[null,null,null,null,null,null,null,null,"",{"$f":"IF($J$17=$A$146,\"Encargos Sociais incidentes sobre a mão de obra\",\"Administração Central\")","v":"Administração Central"},null,null,null,null,null,null,null,{"$f":"IF($J97=$A$146,\"K1\",\"AC\")","v":"AC"},null,null,"-",null,null,{"$f":"VLOOKUP(CONCATENATE(J97,\"-\",R101),$C$2:$G$136,3,FALSE)","v":{"$error":"#N/A"}},{"$f":"VLOOKUP(CONCATENATE(J97,\"-\",R101),$C$2:$G$136,4,FALSE)","v":{"$error":"#N/A"}},{"$f":"VLOOKUP(CONCATENATE(J97,\"-\",R101),$C$2:$G$136,5,FALSE)","v":{"$error":"#N/A"}}]
[null,null,null,null,null,null,null,null,"",{"$f":"IF($J$17=$A$146,\"Administração Central da empresa ou consultoria - overhead\",\"Seguro e Garantia\")","v":"Seguro e Garantia"},null,null,null,null,null,null,null,{"$f":"IF($J97=$A$146,\"K2\",\"SG\")","v":"SG"},null,null,"-",null,null,{"$f":"VLOOKUP(CONCATENATE(J97,\"-\",R102),$C$2:$G$136,3,FALSE)","v":{"$error":"#N/A"}},{"$f":"VLOOKUP(CONCATENATE(J97,\"-\",R102),$C$2:$G$136,4,FALSE)","v":{"$error":"#N/A"}},{"$f":"VLOOKUP(CONCATENATE(J97,\"-\",R102),$C$2:$G$136,5,FALSE)","v":{"$error":"#N/A"}}]
[null,null,null,null,null,null,null,null,"",{"$f":"IF($J$17=$A$146,\"\",\"Risco\")","v":"Risco"},null,null,null,null,null,null,null,{"$f":"IF($J97=$A$146,\"\",\"R\")","v":"R"},null,null,"-",null,null,{"$f":"VLOOKUP(CONCATENATE(J97,\"-\",R103),$C$2:$G$136,3,FALSE)","v":{"$error":"#N/A"}},{"$f":"VLOOKUP(CONCATENATE(J97,\"-\",R103),$C$2:$G$136,4,FALSE)","v":{"$error":"#N/A"}},{"$f":"VLOOKUP(CONCATENATE(J97,\"-\",R103),$C$2:$G$136,5,FALSE)","v":{"$error":"#N/A"}}]
[null,null,null,null,null,null,null,null,"",{"$f":"IF($J$17=$A$146,\"\",\"Despesas Financeiras\")","v":"Despesas Financeiras"},null,null,null,null,null,null,null,{"$f":"IF($J97=$A$146,\"\",\"DF\")","v":"DF"},null,null,"-",null,null,{"$f":"VLOOKUP(CONCATENATE(J97,\"-\",R104),$C$2:$G$136,3,FALSE)","v":{"$error":"#N/A"}},{"$f":"VLOOKUP(CONCATENATE(J97,\"-\",R104),$C$2:$G$136,4,FALSE)","v":{"$error":"#N/A"}},{"$f":"VLOOKUP(CONCATENATE(J97,\"-\",R104),$C$2:$G$136,5,FALSE)","v":{"$error":"#N/A"}}]
[null,null,null,null,null,null,null,null,"",{"$f":"IF($J$17=$A$146,\"Margem bruta da empresa de consultoria\",\"Lucro\")","v":"Lucro"},null,null,null,null,null,null,null,{"$f":"IF($J97=$A$146,\"K3\",\"L\")","v":"L"},null,null,"-",null,null,{"$f":"VLOOKUP(CONCATENATE(J97,\"-\",R105),$C$2:$G$136,3,FALSE)","v":{"$error":"#N/A"}},{"$f":"VLOOKUP(CONCATENATE(J97,\"-\",R105),$C$2:$G$136,4,FALSE)","v":{"$error":"#N/A"}},{"$f":"VLOOKUP(CONCATENATE(J97,\"-\",R105),$C$2:$G$136,5,FALSE)","v":{"$error":"#N/A"}}]
[null,null,null,null,null,null,null,null,"","Tributos (impostos COFINS 3%, e  PIS 0,65%)",null,null,null,null,null,null,null,"CP",null,null,"-",null,null,3.6499999999999998E-2,3.6499999999999998E-2,3.6499999999999998E-2]
[null,null,null,null,null,null,null,null,"","Tributos (ISS, variável de acordo com o município)",null,null,null,null,null,null,null,"ISS",{"$f":"IF(AND($J97<>$A$145,COUNTA(OFFSET(S100,1,0,6))>0),$R$11*$R$10,0)","v":0},null,"-",null,null,0,2.5000000000000001E-2,0.05]
[null,null,null,null,null,null,null,null,"","Tributos (Contribuição Previdenciária sobre a Receita Bruta - 0% ou 4,5% - Desoneração)",null,null,null,null,null,null,null,"CPRB",{"$f":"IF(BDI.Opcao<>\"Desonerado\",0,IF(AND($J97<>$A$145,COUNTA(OFFSET(S100,1,0,6))>0),4.5%,0%))","v":0},null,"-",null,null,0,4.4999999999999998E-2,4.4999999999999998E-2]
[null,null,null,null,null,null,null,null,"","BDI SEM desoneração (Fórmula Acórdão TCU)",null,null,null,null,null,null,null,"BDI PAD",{"$f":"IF($J97=$A$145,0,ROUND((((1+S101+S102+S103)*(1+S104)*(1+S105)/(1-(S106+S107)))-1),4))","v":0},null,{"$f":"IF(OR($J$17=$A$146,$J$17=$A$145,AND(S109>=X109,S109<=Z109)),\"OK\",\"FORA DO INTERVALO\")","v":{"$error":"#N/A"}},null,null,{"$f":"IF($J97=$A$145,0,VLOOKUP(CONCATENATE($J97,\"-\",$R109),$C$2:$G$136,3,FALSE))","v":{"$error":"#N/A"}},{"$f":"IF($J97=$A$145,0,VLOOKUP(CONCATENATE($J97,\"-\",$R109),$C$2:$G$136,4,FALSE))","v":{"$error":"#N/A"}},{"$f":"IF($J97=$A$145,0,VLOOKUP(CONCATENATE($J97,\"-\",$R109),$C$2:$G$136,5,FALSE))","v":{"$error":"#N/A"}}]
[null,null,null,null,null,null,null,null,"","BDI COM desoneração",null,null,null,null,null,null,null,"BDI DES",{"$f":"IF($J97=$A$145,0,ROUND((((1+S101+S102+S103)*(1+S104)*(1+S105)/(1-(S106+S107+S108)))-1),4))","v":0}]
[null,null,null,null,null,null,null,null,""]
[null,null,null,null,null,null,null,null,"",{"$f":"IF(U109<>\"ok\",\"X\",\"\")","v":{"$error":"#N/A"}},{"$f":"IF(U109<>\"ok\",\"Anexo: Relatório Técnico Circunstanciado justificando a adoção do percentual de cada parcela do BDI.\",\"\")","v":{"$error":"#N/A"}}]
[null,null,null,null,null,null,null,null,""]
[null,null,null,null,null,null,null,null,"","Os valores de BDI foram calculados com o emprego da fórmula:"]
[null,null,null,null,null,null,null,null,"",null,null,null,"BDI =",{"$f":"IF($J97=$A$146,\"(1+K1+K2)*(1+K3)\",\"(1+AC + S + R + G)*(1 + DF)*(1+L)\")","v":"(1+AC + S + R + G)*(1 + DF)*(1+L)"},null,null," - 1"]
[null,null,null,null,null,null,null,null,"",null,null,null,null,"(1-CP-ISS-CRPB)"]
[null,null,null,null,null,null,null,null,""]
[null,null,null,null,null,null,null,null,"",{"$f":"CONCATENATE(\"Declaro para os devidos fins que, conforme legislação tributária municipal, a base de cálculo deste tipo de obra corresponde à \",$R$10*100,\"%, com a respectiva alíquota de \",$R$11*100,\"%.\")","v":"Declaro para os devidos fins que, conforme legislação tributária municipal, a base de cálculo deste tipo de obra corresponde à 0%, com a respectiva alíquota de 2%."}]
[null,null,null,null,null,null,null,null,""]
[null,null,null,null,null,null,null,null,"",{"$f":"CONCATENATE(\"Declaro para os devidos fins que o regime de Contribuição Previdenciária sobre a Receita Bruta adotado para elaboração do orçamento foi \",IF(DESONERACAO=\"Sim\",\"COM\",\"SEM\"),\" Desoneração, e que esta é a alternativa mais adequada para a Administração Pública.\")","v":"Declaro para os devidos fins que o regime de Contribuição Previdenciária sobre a Receita Bruta adotado para elaboração do orçamento foi SEM Desoneração, e que esta é a alternativa mais adequada para a Administração Pública."}]
[null,null,null,null,null,null,null,null,""]
[null,null,null,null,null,null,null,null,"","Observações:"]
[null,null,null,null,null,null,null,null,""]
[null,null,null,null,null,null,null,null,""]
[null,null,null,null,null,null,null,null,"",{"$f":"Import.Município","v":"TRAMANDAÍ/RS"},null,null,null,null,null,{"$f":"DADOS!$F$25","v":"2025-03-14"}]
[null,null,null,null,null,null,null,null,"","Local",null,null,null,null,null,"Data"]
[null,null,null,null,null,null,null,null,""]
[null,null,null,null,null,null,null,null,""]
[null,null,null,null,null,null,null,null,"","Responsável Técnico"]
[null,null,null,null,null,null,null,null,"","Nome:",{"$f":"Import.RespOrçamento","v":"PAULO RICARDO VIEGAS ALVES"}]
[null,null,null,null,null,null,null,null,"","CREA/CAU:","A86.107-3"]
[null,null,null,null,null,null,null,null,"","ART/RRT:","RRT 15101062"]
[]
[]
[]
[]
[]
["(SELECIONAR)"]
["Construção e Reforma de Edifícios"]
["Construção de Praças Urbanas, Rodovias, Ferrovias e recapeamento e pavimentação de vias urbanas"]
["Construção de Redes de Abastecimento de Água, Coleta de Esgoto"]
["Construção e Manutenção de Estações e Redes de Distribuição de Energia Elétrica"]
["Obras Portuárias, Marítimas e Fluviais"]
["Fornecimento de Materiais e Equipamentos (aquisição indireta - em conjunto com licitação de obras)"]
["Fornecimento de Materiais e Equipamentos (aquisição direta)"]
["Estudos e Projetos, Planos e Gerenciamento e outros correlatos"]

{"sheet":"ORÇAMENTO","index":4,"n_rows":51,"n_cols":40,"rows_kept":51,"cut":false,"hidden":false,"merged":[[49,14,49,16],[14,14,14,17],[36,16,36,23],[39,14,41,23],[43,14,43,23],[46,14,46,16],[44,14,44,23],[3,14,3,15],[3,18,3,23],[4,14,4,15],[4,18,4,23],[7,5,7,10],[7,11,11,11],[7,14,7,15],[7,18,7,20],[8,5,8,10],[4,30,4,31],[6,14,6,15],[6,18,6,20],[6,37,10,37],[7,24,11,24],[7,25,11,25],[11,26,11,27],[6,35,10,35]]}
[null,null,null,null,null,null,null,null,null,null,null,null,null,null,null,null,null,"PO - PLANILHA ORÇAMENTÁRIA",null,null,null,null,null,"Grau de Sigilo"]
[null,null,null,"LOTE","Meta","Nível 2","Nível 3","Nível 4","Serviço",null,null,null,null,null,null,null,null,{"$f":"IF(TIPOORCAMENTO=\"licitado\",\"Orçamento Licitado\",\"Orçamento Base para Licitação\")&\" - \"&import.recurso","v":"Orçamento Base para Licitação - OGU"},null,null,null,null,null,"#PUBLICO"]
[]
["Nmax",null,null,null,null,"BDI 1","BDI 2","BDI 3",0,null,null,null,null,null,"Nº OPERAÇÃO",null,"Nº TransfereGOV","PROPONENTE / TOMADOR","APELIDO DO EMPREENDIMENTO"]
[{"$f":"MAX($C$15:$C$34)","v":2},null,null,null,null,{"$f":"IF(BDI.Opcao=\"DESONERADO\",BDI!$S$30,BDI!$S$29)","v":0.25},{"$f":"IF(BDI.Opcao=\"DESONERADO\",BDI!$S$70,BDI!$S$69)","v":0},{"$f":"IF(BDI.Opcao=\"DESONERADO\",BDI!$S$110,BDI!$S$109)","v":0},null,null,null,null,null,null,{"$f":"Import.CR","v":"109437911"},null,{"$f":"Import.TransfereGOV","v":"02829/2024"},{"$f":"Import.Proponente","v":"PREFEITURA MUNICIPAL DE TRAMANDAÍ "},{"$f":"Import.Apelido","v":"INFRAESTRUTURA EMEI PORTAL DAS FLORES"},null,null,null,null,null,null,null,null,null,null,null,"Arredondamento"]
[]
[null,null,null,null,null,null,null,null,null,null,null,null,null,null,"LOCALIDADE SINAPI",null,"DATA BASE",{"$f":"IF(TIPOORCAMENTO=\"Licitado\",\"NOME DA EMPRESA\",\"DESCRIÇÃO DO LOTE\")","v":"DESCRIÇÃO DO LOTE"},{"$f":"IF(TIPOORCAMENTO=\"Licitado\",\"REGIME DE EXECUÇÃO\",\"MUNICÍPIO / UF\")","v":"MUNICÍPIO / UF"},null,null,{"$f":"IF(TIPOORCAMENTO=\"Licitado\",\"\",\"BDI 1\")","v":"BDI 1"},{"$f":"IF(TIPOORCAMENTO=\"Licitado\",\"\",\"BDI 2\")","v":"BDI 2"},{"$f":"IF(TIPOORCAMENTO=\"Licitado\",\"Nº CTEF\",\"BDI 3\")","v":"BDI 3"},null,null,null,null,null,null,"Quantidade",true,null,null,null,"QUANTIDADES: ACOMP. POR BM",null,"PREÇO UNITÁRIO LICITADO"]
[null,null,null,null,null,{"$f":"IF(LEN(INFO(\"release\"))>5,\"'Referência \"&Excel_BuiltIn_Database&\".xlsm'#Banco.$a5:$a$65536\",\"'[Referência \"&Excel_BuiltIn_Database&\".xlsm]Banco'!$a5:$a$65536\")","v":"'[Referência 11-2024.xlsm]Banco'!$a5:$a$65536"},null,null,null,null,null,"FILTRO",null,null,{"$f":"IF(ISERROR(INDIRECT($F$9)),\"(N/D: 'Referência \"&Excel_BuiltIn_Database&\".xlsm)\",INDIRECT($F$9))","v":"PORTO ALEGRE"},null,{"$f":"TEXT(Import.DataBase,\"mm-aa\")&IF(DESONERACAO=\"Sim\",\" (DES.)\",\" (N DES.)\")","v":"11-24 (N DES.)"},{"$f":"IF(TIPOORCAMENTO=\"Licitado\",Import.empresa,Import.DescLote)","v":"CONSTRUÇÃO DA EMEI PORTAL DAS FLORES"},{"$f":"IF(TIPOORCAMENTO=\"Licitado\",Import.RegimeExecução,Import.Município)","v":"TRAMANDAÍ/RS"},null,null,{"$f":"IF(TIPOORCAMENTO=\"Licitado\",\"\",TEXT(F5,\"0,00%\"))","v":"25,00%"},{"$f":"IF(TIPOORCAMENTO=\"Licitado\",\"\",TEXT(G5,\"0,00%\"))","v":"0,00%"},{"$f":"IF(TIPOORCAMENTO=\"Licitado\",Import.CTEF,TEXT(H5,\"0,00%\"))","v":"0,00%"},"RECURSO","SGL RECURSO",null,null,null,null,"Custo Unitáro",true]
[null,null,null,null,null,{"$f":"IF(LEN(INFO(\"release\"))>5,\"'Referência \"&Excel_BuiltIn_Database&\".xlsm'#Banco.$d$3\",\"'[Referência \"&Excel_BuiltIn_Database&\".xlsm]Banco'!$d$3\")","v":"'[Referência 11-2024.xlsm]Banco'!$d$3"},null,null,null,null,null,null,null,null,null,null,null,null,null,null,null,null,null,null,null,null,null,null,null,null,"BDI",true]
[null,null,null,null,null,null,null,null,null,null,null,null,null,null,null,null,null,null,null,null,null,null,null,null,null,null,null,null,"ERRO GERAL",null,"Preço Unitário",true]
[null,null,null,null,null,null,null,null,null,null,null,null,null,null,null,null,null,null,null,null,null,null,null,null,null,null,null,null,{"$f":"IF(COUNTIF($AC$15:OFFSET($AC$34,-1,0),\"DESCRIÇÃO\")+COUNTIF($AC$15:OFFSET($AC$34,-1,0),\"UNIDADE\")+COUNTIF($AC$15:OFFSET($AC$34,-1,0),\"SEM VALOR\")>0,\"NÃO OK\",\"OK\")","v":"OK"},null,"Preço Total",true]
[null,null,null,null,null,null,null,null,null,null,null,null,null,null,null,null,null,null,null,null,null,null,null,null,null,null,"Valores não Arredondados",null,null,null,null,null,null,null,null,"↓",null,"↓"]
["Nível E","Save Nivel","Nível C","Altura","n1","n2","n3","n4","n5","Czero","Cnível","↓","Nível","Nível Corrigido","Item","Fonte","Código","Descrição","Unidade","Quantidade",{"$f":"IF(TIPOORCAMENTO=\"Licitado\",\"\",\"Custo Unitário (sem BDI) (R$)\")","v":"Custo Unitário (sem BDI) (R$)"},{"$f":"IF(TIPOORCAMENTO=\"Licitado\",\"\",\"BDI\n(%)\")","v":"BDI\n(%)"},"Preço Unitário (com BDI) (R$)","Preço Total\n(R$)","↓","↓","Contrapartida (R$)","Outros (R$)","Erro de Dados","Lista Crono","Concatenação Fonte-Código","BancoDesloc","Custo Unitário Referência (R$)",{"$f":"IF(TIPOORCAMENTO=\"LICITADO\",\"Valor BDI Edital\",\"Valor BDI\")","v":"Valor BDI"},null,"Quantidade",null,"Preço Unitário (com BDI) (R$)","Preço Total\nLicit. (R$)","Preço Unitário Edital (R$)"]
[{"$f":"CHOOSE(1+LOG(1+2*(ORÇAMENTO.Nivel=\"Meta\")+4*(ORÇAMENTO.Nivel=\"Nível 2\")+8*(ORÇAMENTO.Nivel=\"Nível 3\")+16*(ORÇAMENTO.Nivel=\"Nível 4\")+32*(ORÇAMENTO.Nivel=\"Serviço\"),2),0,1,2,3,4,\"S\")","v":"S"},{"$f":"IF(OR(C14=\"s\",C14=0),OFFSET(B14,-1,0),C14)","v":"Save Nivel"},{"$f":"IF(OFFSET(C14,-1,0)=\"L\",1,IF(OFFSET(C14,-1,0)=1,2,IF(OR(A14=\"s\",A14=0),\"S\",IF(AND(OFFSET(C14,-1,0)=2,A14=4),3,IF(AND(OR(OFFSET(C14,-1,0)=\"s\",OFFSET(C14,-1,0)=0),A14<>\"s\",A14>OFFSET(B14,-1,0)),OFFSET(B14,-1,0),A14)))))","v":"S"},{"$f":"IF(OR(C14=\"S\",C14=0),0,IF(ISERROR(K14),J14,SMALL(J14:K14,1)))","v":0},{"$f":"IF($C14=1,OFFSET(E14,-1,0)+MAX(1,COUNTIF(QCI!$A$13:$A$24,OFFSET(ORÇAMENTO!E14,-1,0))),OFFSET(E14,-1,0))","v":"n1"},{"$f":"IF($C14=1,0,IF($C14=2,OFFSET(F14,-1,0)+1,OFFSET(F14,-1,0)))","v":"n2"},{"$f":"IF(AND($C14<=2,$C14<>0),0,IF($C14=3,OFFSET(G14,-1,0)+1,OFFSET(G14,-1,0)))","v":"n3"},{"$f":"IF(AND($C14<=3,$C14<>0),0,IF($C14=4,OFFSET(H14,-1,0)+1,OFFSET(H14,-1,0)))","v":"n4"},{"$f":"IF(AND($C14<=4,$C14<>0),0,IF(AND($C14=\"S\",$X14>0),OFFSET(I14,-1,0)+1,OFFSET(I14,-1,0)))","v":"n5"},{"$f":"IF(OR($C14=\"S\",$C14=0),0,MATCH(0,OFFSET($D14,1,$C14,ROW($C$34)-ROW($C14)),0))","v":0},{"$f":"IF(OR($C14=\"S\",$C14=0),0,MATCH(OFFSET($D14,0,$C14)+IF($C14<>1,1,COUNTIF(QCI!$A$13:$A$24,ORÇAMENTO!E14)),OFFSET($D14,1,$C14,ROW($C$34)-ROW($C14)),0))","v":0},{"$f":"IF(OR($X14>0,$C14=1,$C14=2,$C14=3,$C14=4),\"F\",\"\")","v":""},"Serviço",{"$f":"CHOOSE(1+LOG(1+2*(C14=1)+4*(C14=2)+8*(C14=3)+16*(C14=4)+32*(C14=\"S\"),2),\"\",\"Meta\",\"Nível 2\",\"Nível 3\",\"Nível 4\",\"Serviço\")","v":"Serviço"},{"$f":"IF(OR($C14=0,$L14=\"\"),\"-\",CONCATENATE(E14&\".\",IF(AND($A$5>=2,$C14>=2),F14&\".\",\"\"),IF(AND($A$5>=3,$C14>=3),G14&\".\",\"\"),IF(AND($A$5>=4,$C14>=4),H14&\".\",\"\"),IF($C14=\"S\",I14&\".\",\"\")))","v":"-"},"SINAPI",null,{"$f":"IF($C14=\"S\",REFERENCIA.Descricao,\"(digite a descrição aqui)\")","v":"(Sem Código)"},{"$f":"REFERENCIA.Unidade","v":"-"},{"$f":"OFFSET(CÁLCULO!H$15,ROW($T14)-ROW(T$15),0)","v":0},null,"BDI 1",{"$f":"IF($C14=\"S\",ROUND(IF(TIPOORCAMENTO=\"Proposto\",ORÇAMENTO.CustoUnitario*(1+$AH14),ORÇAMENTO.PrecoUnitarioLicitado),15-13*$AF$10),0)","v":0},{"$f":"IF($C14=\"S\",IF(Import.TipoArredondamento<>\"TransfereGOV\",VTOTAL1,SUM(OFFSET(CÁLCULO!$AA$15,ROW($X14)-ROW($X$15),1):OFFSET(CÁLCULO!$AL$15,ROW($X14)-ROW($X$15),-1))),IF($C14=0,0,ROUND(SomaAgrup,15-13*$AF$11)))","v":0},"RA",{"$f":"IF(AND($C14=\"S\",$X14>0),IF(ISBLANK($Y14),\"RA\",LEFT($Y14,2)),\"\")","v":""},{"$f":"IF($C14=\"S\",IF($Z14=\"CP\",$X14,IF($Z14=\"RA\",(($X14)*QCI!$AA$3),0)),SomaAgrup)","v":0},{"$f":"IF($C14=\"S\",IF($Z14=\"OU\",ROUND($X14,2),0),SomaAgrup)","v":0},{"$f":"IF($N14=\"\",\"\",IF(ORÇAMENTO.Descricao=\"\",\"DESCRIÇÃO\",IF(AND($C14=\"S\",ORÇAMENTO.Unidade=\"\"),\"UNIDADE\",IF($X14<0,\"VALOR NEGATIVO\",IF(OR(AND(TIPOORCAMENTO=\"Proposto\",$AG14<>\"\",$AG14>0,ORÇAMENTO.CustoUnitario>$AG14),AND(TIPOORCAMENTO=\"LICITADO\",ORÇAMENTO.PrecoUnitarioLicitado>$AN14)),\"ACIMA REF.\",\"\")))))","v":""},{"$f":"IF(C14<=CRONO.NivelExibicao,MAX($AD$15:OFFSET(AD14,-1,0))+IF($C14<>1,1,MAX(1,COUNTIF(QCI!$A$13:$A$24,OFFSET($E14,-1,0)))),\"\")","v":""},{"$f":"IF(AND($C14=\"S\",ORÇAMENTO.CodBarra<>\"\"),IF(ORÇAMENTO.Fonte=\"\",ORÇAMENTO.CodBarra,CONCATENATE(ORÇAMENTO.Fonte,\" \",ORÇAMENTO.CodBarra)))","v":false},{"$f":"IF(ISERROR(INDIRECT(ORÇAMENTO.BancoRef)),\"(abra o arquivo 'Referência \"&Excel_BuiltIn_Database&\".xlsm)\",IF(OR($C14<>\"S\",ORÇAMENTO.CodBarra=\"\"),\"(Sem Código)\",IF(ISERROR(MATCH($AE14,INDIRECT(ORÇAMENTO.BancoRef),0)),\"(Código não identificado nas referências)\",MATCH($AE14,INDIRECT(ORÇAMENTO.BancoRef),0))))","v":"(Sem Código)"},{"$f":"ROUND(IF(DESONERACAO=\"sim\",REFERENCIA.Desonerado,REFERENCIA.NaoDesonerado),2)","v":0},{"$f":"ROUND(IF(ISNUMBER(ORÇAMENTO.OpcaoBDI),ORÇAMENTO.OpcaoBDI,IF(LEFT(ORÇAMENTO.OpcaoBDI,3)=\"BDI\",HLOOKUP(ORÇAMENTO.OpcaoBDI,$F$4:$H$5,2,FALSE),0)),15-11*$AF$9)","v":0.25},null,null,null,null,{"$f":"$X14","v":0},{"$f":"ROUND(ORÇAMENTO.CustoUnitario*(1+$AH14),2)","v":0}]
[0,null,"L",{"$f":"COUNTA(OFFSET(D15,1,0):D$34)","v":18},0,null,null,null,null,null,null,"F",{"$f":"IF(TIPOORCAMENTO=\"LICITADO\",\"CTEF\",\"LOTE\")","v":"LOTE"},{"$f":"IF(TIPOORCAMENTO=\"LICITADO\",\"CTEF\",\"LOTE\")","v":"LOTE"},{"$f":"Import.DescLote","v":"CONSTRUÇÃO DA EMEI PORTAL DAS FLORES"},null,null,null,null,null,null,null,null,{"$f":"SUMIF(OFFSET($C15,1,0,ROW(X34)-ROW(X15)-1),\"S\",OFFSET(X15,1,0,ROW(X34)-ROW(X15)-1))","v":196407.48},null,{"$f":"IF(AND($C15=\"S\",$X15>0),LEFT($Y15,2),\"\")","v":""},{"$f":"SUMIF(OFFSET($C15,1,0,ROW(AA34)-ROW(AA15)-1),\"S\",OFFSET(AA15,1,0,ROW(AA34)-ROW(AA15)-1))","v":196407.48},{"$f":"SUMIF(OFFSET($C15,1,0,ROW(AB34)-ROW(AB15)-1),\"S\",OFFSET(AB15,1,0,ROW(AB34)-ROW(AB15)-1))","v":0},null,null,null,null,null,null,null,null,null,null,196407.48]
[{"$f":"CHOOSE(1+LOG(1+2*(ORÇAMENTO.Nivel=\"Meta\")+4*(ORÇAMENTO.Nivel=\"Nível 2\")+8*(ORÇAMENTO.Nivel=\"Nível 3\")+16*(ORÇAMENTO.Nivel=\"Nível 4\")+32*(ORÇAMENTO.Nivel=\"Serviço\"),2),0,1,2,3,4,\"S\")","v":"S"},{"$f":"IF(OR(C16=\"s\",C16=0),OFFSET(B16,-1,0),C16)","v":1},{"$f":"IF(OFFSET(C16,-1,0)=\"L\",1,IF(OFFSET(C16,-1,0)=1,2,IF(OR(A16=\"s\",A16=0),\"S\",IF(AND(OFFSET(C16,-1,0)=2,A16=4),3,IF(AND(OR(OFFSET(C16,-1,0)=\"s\",OFFSET(C16,-1,0)=0),A16<>\"s\",A16>OFFSET(B16,-1,0)),OFFSET(B16,-1,0),A16)))))","v":1},{"$f":"IF(OR(C16=\"S\",C16=0),0,IF(ISERROR(K16),J16,SMALL(J16:K16,1)))","v":18},{"$f":"IF($C16=1,OFFSET(E16,-1,0)+MAX(1,COUNTIF(QCI!$A$13:$A$24,OFFSET(ORÇAMENTO!E16,-1,0))),OFFSET(E16,-1,0))","v":1},{"$f":"IF($C16=1,0,IF($C16=2,OFFSET(F16,-1,0)+1,OFFSET(F16,-1,0)))","v":0},{"$f":"IF(AND($C16<=2,$C16<>0),0,IF($C16=3,OFFSET(G16,-1,0)+1,OFFSET(G16,-1,0)))","v":0},{"$f":"IF(AND($C16<=3,$C16<>0),0,IF($C16=4,OFFSET(H16,-1,0)+1,OFFSET(H16,-1,0)))","v":0},{"$f":"IF(AND($C16<=4,$C16<>0),0,IF(AND($C16=\"S\",$X16>0),OFFSET(I16,-1,0)+1,OFFSET(I16,-1,0)))","v":0},{"$f":"IF(OR($C16=\"S\",$C16=0),0,MATCH(0,OFFSET($D16,1,$C16,ROW($C$34)-ROW($C16)),0))","v":18},{"$f":"IF(OR($C16=\"S\",$C16=0),0,MATCH(OFFSET($D16,0,$C16)+IF($C16<>1,1,COUNTIF(QCI!$A$13:$A$24,ORÇAMENTO!E16)),OFFSET($D16,1,$C16,ROW($C$34)-ROW($C16)),0))","v":{"$error":"#N/A"}},{"$f":"IF(OR($X16>0,$C16=1,$C16=2,$C16=3,$C16=4),\"F\",\"\")","v":"F"},"Serviço",{"$f":"CHOOSE(1+LOG(1+2*(C16=1)+4*(C16=2)+8*(C16=3)+16*(C16=4)+32*(C16=\"S\"),2),\"\",\"Meta\",\"Nível 2\",\"Nível 3\",\"Nível 4\",\"Serviço\")","v":"Meta"},{"$f":"IF(OR($C16=0,$L16=\"\"),\"-\",CONCATENATE(E16&\".\",IF(AND($A$5>=2,$C16>=2),F16&\".\",\"\"),IF(AND($A$5>=3,$C16>=3),G16&\".\",\"\"),IF(AND($A$5>=4,$C16>=4),H16&\".\",\"\"),IF($C16=\"S\",I16&\".\",\"\")))","v":"1."},"SINAPI",null,"PAVIMENTAÇÃO E PAISAGISMO ENTORNO EMEI  PORTAL DAS FLORES",{"$f":"REFERENCIA.Unidade","v":"-"},{"$f":"OFFSET(CÁLCULO!H$15,ROW($T16)-ROW(T$15),0)","v":0},null,"BDI 1",{"$f":"IF($C16=\"S\",ROUND(IF(TIPOORCAMENTO=\"Proposto\",ORÇAMENTO.CustoUnitario*(1+$AH16),ORÇAMENTO.PrecoUnitarioLicitado),15-13*$AF$10),0)","v":0},{"$f":"IF($C16=\"S\",IF(Import.TipoArredondamento<>\"TransfereGOV\",VTOTAL1,SUM(OFFSET(CÁLCULO!$AA$15,ROW($X16)-ROW($X$15),1):OFFSET(CÁLCULO!$AL$15,ROW($X16)-ROW($X$15),-1))),IF($C16=0,0,ROUND(SomaAgrup,15-13*$AF$11)))","v":196407.48},"RA",{"$f":"IF(AND($C16=\"S\",$X16>0),IF(ISBLANK($Y16),\"RA\",LEFT($Y16,2)),\"\")","v":""},{"$f":"IF($C16=\"S\",IF($Z16=\"CP\",$X16,IF($Z16=\"RA\",(($X16)*QCI!$AA$3),0)),SomaAgrup)","v":196407.48},{"$f":"IF($C16=\"S\",IF($Z16=\"OU\",ROUND($X16,2),0),SomaAgrup)","v":0},{"$f":"IF($N16=\"\",\"\",IF(ORÇAMENTO.Descricao=\"\",\"DESCRIÇÃO\",IF(AND($C16=\"S\",ORÇAMENTO.Unidade=\"\"),\"UNIDADE\",IF($X16<0,\"VALOR NEGATIVO\",IF(OR(AND(TIPOORCAMENTO=\"Proposto\",$AG16<>\"\",$AG16>0,ORÇAMENTO.CustoUnitario>$AG16),AND(TIPOORCAMENTO=\"LICITADO\",ORÇAMENTO.PrecoUnitarioLicitado>$AN16)),\"ACIMA REF.\",\"\")))))","v":""},{"$f":"IF(C16<=CRONO.NivelExibicao,MAX($AD$15:OFFSET(AD16,-1,0))+IF($C16<>1,1,MAX(1,COUNTIF(QCI!$A$13:$A$24,OFFSET($E16,-1,0)))),\"\")","v":1},{"$f":"IF(AND($C16=\"S\",ORÇAMENTO.CodBarra<>\"\"),IF(ORÇAMENTO.Fonte=\"\",ORÇAMENTO.CodBarra,CONCATENATE(ORÇAMENTO.Fonte,\" \",ORÇAMENTO.CodBarra)))","v":false},{"$f":"IF(ISERROR(INDIRECT(ORÇAMENTO.BancoRef)),\"(abra o arquivo 'Referência \"&Excel_BuiltIn_Database&\".xlsm)\",IF(OR($C16<>\"S\",ORÇAMENTO.CodBarra=\"\"),\"(Sem Código)\",IF(ISERROR(MATCH($AE16,INDIRECT(ORÇAMENTO.BancoRef),0)),\"(Código não identificado nas referências)\",MATCH($AE16,INDIRECT(ORÇAMENTO.BancoRef),0))))","v":"(Sem Código)"},{"$f":"ROUND(IF(DESONERACAO=\"sim\",REFERENCIA.Desonerado,REFERENCIA.NaoDesonerado),2)","v":0},{"$f":"ROUND(IF(ISNUMBER(ORÇAMENTO.OpcaoBDI),ORÇAMENTO.OpcaoBDI,IF(LEFT(ORÇAMENTO.OpcaoBDI,3)=\"BDI\",HLOOKUP(ORÇAMENTO.OpcaoBDI,$F$4:$H$5,2,FALSE),0)),15-11*$AF$9)","v":0.25},null,null,null,null,196407.48,{"$f":"ROUND(ORÇAMENTO.CustoUnitario*(1+$AH16),2)","v":0}]
["S",2,2,4,{"$f":"IF($C17=1,OFFSET(E17,-1,0)+MAX(1,COUNTIF(QCI!$A$13:$A$24,OFFSET(ORÇAMENTO!E17,-1,0))),OFFSET(E17,-1,0))","v":1},1,0,0,0,{"$f":"IF(OR($C17=\"S\",$C17=0),0,MATCH(0,OFFSET($D17,1,$C17,ROW($C$34)-ROW($C17)),0))","v":17},{"$f":"IF(OR($C17=\"S\",$C17=0),0,MATCH(OFFSET($D17,0,$C17)+IF($C17<>1,1,COUNTIF(QCI!$A$13:$A$24,ORÇAMENTO!E17)),OFFSET($D17,1,$C17,ROW($C$34)-ROW($C17)),0))","v":4},"F","Serviço","Nível 2","1.1.","SINAPI",null,"SERVIÇOS PRELIMINARES",{"$f":"REFERENCIA.Unidade","v":"-"},{"$f":"OFFSET(CÁLCULO!H$15,ROW($T17)-ROW(T$15),0)","v":0},null,"BDI 1",{"$f":"IF($C17=\"S\",ROUND(IF(TIPOORCAMENTO=\"Proposto\",ORÇAMENTO.CustoUnitario*(1+$AH17),ORÇAMENTO.PrecoUnitarioLicitado),15-13*$AF$10),0)","v":0},{"$f":"IF($C17=\"S\",IF(Import.TipoArredondamento<>\"TransfereGOV\",VTOTAL1,SUM(OFFSET(CÁLCULO!$AA$15,ROW($X17)-ROW($X$15),1):OFFSET(CÁLCULO!$AL$15,ROW($X17)-ROW($X$15),-1))),IF($C17=0,0,ROUND(SomaAgrup,15-13*$AF$11)))","v":5744.84},"RA","",{"$f":"IF($C17=\"S\",IF($Z17=\"CP\",$X17,IF($Z17=\"RA\",(($X17)*QCI!$AA$3),0)),SomaAgrup)","v":5744.84},0,{"$f":"IF($N17=\"\",\"\",IF(ORÇAMENTO.Descricao=\"\",\"DESCRIÇÃO\",IF(AND($C17=\"S\",ORÇAMENTO.Unidade=\"\"),\"UNIDADE\",IF($X17<0,\"VALOR NEGATIVO\",IF(OR(AND(TIPOORCAMENTO=\"Proposto\",$AG17<>\"\",$AG17>0,ORÇAMENTO.CustoUnitario>$AG17),AND(TIPOORCAMENTO=\"LICITADO\",ORÇAMENTO.PrecoUnitarioLicitado>$AN17)),\"ACIMA REF.\",\"\")))))","v":""},{"$f":"IF(C17<=CRONO.NivelExibicao,MAX($AD$15:OFFSET(AD17,-1,0))+IF($C17<>1,1,MAX(1,COUNTIF(QCI!$A$13:$A$24,OFFSET($E17,-1,0)))),\"\")","v":2},{"$f":"IF(AND($C17=\"S\",ORÇAMENTO.CodBarra<>\"\"),IF(ORÇAMENTO.Fonte=\"\",ORÇAMENTO.CodBarra,CONCATENATE(ORÇAMENTO.Fonte,\" \",ORÇAMENTO.CodBarra)))","v":false},{"$f":"IF(ISERROR(INDIRECT(ORÇAMENTO.BancoRef)),\"(abra o arquivo 'Referência \"&Excel_BuiltIn_Database&\".xlsm)\",IF(OR($C17<>\"S\",ORÇAMENTO.CodBarra=\"\"),\"(Sem Código)\",IF(ISERROR(MATCH($AE17,INDIRECT(ORÇAMENTO.BancoRef),0)),\"(Código não identificado nas referências)\",MATCH($AE17,INDIRECT(ORÇAMENTO.BancoRef),0))))","v":"(Sem Código)"},{"$f":"ROUND(IF(DESONERACAO=\"sim\",REFERENCIA.Desonerado,REFERENCIA.NaoDesonerado),2)","v":0},0.25,null,null,null,null,5744.84,0]
["S",2,"S",0,{"$f":"IF($C18=1,OFFSET(E18,-1,0)+MAX(1,COUNTIF(QCI!$A$13:$A$24,OFFSET(ORÇAMENTO!E18,-1,0))),OFFSET(E18,-1,0))","v":1},1,0,0,1,{"$f":"IF(OR($C18=\"S\",$C18=0),0,MATCH(0,OFFSET($D18,1,$C18,ROW($C$34)-ROW($C18)),0))","v":0},{"$f":"IF(OR($C18=\"S\",$C18=0),0,MATCH(OFFSET($D18,0,$C18)+IF($C18<>1,1,COUNTIF(QCI!$A$13:$A$24,ORÇAMENTO!E18)),OFFSET($D18,1,$C18,ROW($C$34)-ROW($C18)),0))","v":0},"F","Serviço","Serviço","1.1.1.","SINAPI","98525",{"$f":"IF($C18=\"S\",REFERENCIA.Descricao,\"(digite a descrição aqui)\")","v":"LIMPEZA MECANIZADA DE CAMADA VEGETAL, VEGETAÇÃO E PEQUENAS ÁRVORES (DIÂMETRO DE TRONCO MENOR QUE 0,20 M), COM TRATOR DE ESTEIRAS. AF_03/2024"},{"$f":"REFERENCIA.Unidade","v":"M2"},{"$f":"OFFSET(CÁLCULO!H$15,ROW($T18)-ROW(T$15),0)","v":1674.27},0.71,"BDI 1",{"$f":"IF($C18=\"S\",ROUND(IF(TIPOORCAMENTO=\"Proposto\",ORÇAMENTO.CustoUnitario*(1+$AH18),ORÇAMENTO.PrecoUnitarioLicitado),15-13*$AF$10),0)","v":0.89},{"$f":"IF($C18=\"S\",IF(Import.TipoArredondamento<>\"TransfereGOV\",VTOTAL1,SUM(OFFSET(CÁLCULO!$AA$15,ROW($X18)-ROW($X$15),1):OFFSET(CÁLCULO!$AL$15,ROW($X18)-ROW($X$15),-1))),IF($C18=0,0,ROUND(SomaAgrup,15-13*$AF$11)))","v":1490.1},"RA","RA",{"$f":"IF($C18=\"S\",IF($Z18=\"CP\",$X18,IF($Z18=\"RA\",(($X18)*QCI!$AA$3),0)),SomaAgrup)","v":1490.1},0,{"$f":"IF($N18=\"\",\"\",IF(ORÇAMENTO.Descricao=\"\",\"DESCRIÇÃO\",IF(AND($C18=\"S\",ORÇAMENTO.Unidade=\"\"),\"UNIDADE\",IF($X18<0,\"VALOR NEGATIVO\",IF(OR(AND(TIPOORCAMENTO=\"Proposto\",$AG18<>\"\",$AG18>0,ORÇAMENTO.CustoUnitario>$AG18),AND(TIPOORCAMENTO=\"LICITADO\",ORÇAMENTO.PrecoUnitarioLicitado>$AN18)),\"ACIMA REF.\",\"\")))))","v":""},{"$f":"IF(C18<=CRONO.NivelExibicao,MAX($AD$15:OFFSET(AD18,-1,0))+IF($C18<>1,1,MAX(1,COUNTIF(QCI!$A$13:$A$24,OFFSET($E18,-1,0)))),\"\")","v":""},{"$f":"IF(AND($C18=\"S\",ORÇAMENTO.CodBarra<>\"\"),IF(ORÇAMENTO.Fonte=\"\",ORÇAMENTO.CodBarra,CONCATENATE(ORÇAMENTO.Fonte,\" \",ORÇAMENTO.CodBarra)))","v":"SINAPI 98525"},{"$f":"IF(ISERROR(INDIRECT(ORÇAMENTO.BancoRef)),\"(abra o arquivo 'Referência \"&Excel_BuiltIn_Database&\".xlsm)\",IF(OR($C18<>\"S\",ORÇAMENTO.CodBarra=\"\"),\"(Sem Código)\",IF(ISERROR(MATCH($AE18,INDIRECT(ORÇAMENTO.BancoRef),0)),\"(Código não identificado nas referências)\",MATCH($AE18,INDIRECT(ORÇAMENTO.BancoRef),0))))","v":7466},{"$f":"ROUND(IF(DESONERACAO=\"sim\",REFERENCIA.Desonerado,REFERENCIA.NaoDesonerado),2)","v":0.71},0.25,null,1674.27,null,null,1490.1,0.89]
["S",2,"S",0,{"$f":"IF($C19=1,OFFSET(E19,-1,0)+MAX(1,COUNTIF(QCI!$A$13:$A$24,OFFSET(ORÇAMENTO!E19,-1,0))),OFFSET(E19,-1,0))","v":1},1,0,0,2,{"$f":"IF(OR($C19=\"S\",$C19=0),0,MATCH(0,OFFSET($D19,1,$C19,ROW($C$34)-ROW($C19)),0))","v":0},{"$f":"IF(OR($C19=\"S\",$C19=0),0,MATCH(OFFSET($D19,0,$C19)+IF($C19<>1,1,COUNTIF(QCI!$A$13:$A$24,ORÇAMENTO!E19)),OFFSET($D19,1,$C19,ROW($C$34)-ROW($C19)),0))","v":0},"F","Serviço","Serviço","1.1.2.","SINAPI","90091",{"$f":"IF($C19=\"S\",REFERENCIA.Descricao,\"(digite a descrição aqui)\")","v":"ESCAVAÇÃO MECANIZADA DE VALA COM PROF. ATÉ 1,5 M (MÉDIA MONTANTE E JUSANTE/UMA COMPOSIÇÃO POR TRECHO), ESCAVADEIRA (0,8 M3), LARG. DE 1,5 M A 2,5 M, EM SOLO DE 1A CATEGORIA, LOCAIS COM BAIXO NÍVEL DE INTERFERÊNCIA. AF_09/2024"},{"$f":"REFERENCIA.Unidade","v":"M3"},{"$f":"OFFSET(CÁLCULO!H$15,ROW($T19)-ROW(T$15),0)","v":409.59},6.65,"BDI 1",{"$f":"IF($C19=\"S\",ROUND(IF(TIPOORCAMENTO=\"Proposto\",ORÇAMENTO.CustoUnitario*(1+$AH19),ORÇAMENTO.PrecoUnitarioLicitado),15-13*$AF$10),0)","v":8.31},{"$f":"IF($C19=\"S\",IF(Import.TipoArredondamento<>\"TransfereGOV\",VTOTAL1,SUM(OFFSET(CÁLCULO!$AA$15,ROW($X19)-ROW($X$15),1):OFFSET(CÁLCULO!$AL$15,ROW($X19)-ROW($X$15),-1))),IF($C19=0,0,ROUND(SomaAgrup,15-13*$AF$11)))","v":3403.69},"RA","RA",{"$f":"IF($C19=\"S\",IF($Z19=\"CP\",$X19,IF($Z19=\"RA\",(($X19)*QCI!$AA$3),0)),SomaAgrup)","v":3403.69},0,{"$f":"IF($N19=\"\",\"\",IF(ORÇAMENTO.Descricao=\"\",\"DESCRIÇÃO\",IF(AND($C19=\"S\",ORÇAMENTO.Unidade=\"\"),\"UNIDADE\",IF($X19<0,\"VALOR NEGATIVO\",IF(OR(AND(TIPOORCAMENTO=\"Proposto\",$AG19<>\"\",$AG19>0,ORÇAMENTO.CustoUnitario>$AG19),AND(TIPOORCAMENTO=\"LICITADO\",ORÇAMENTO.PrecoUnitarioLicitado>$AN19)),\"ACIMA REF.\",\"\")))))","v":""},{"$f":"IF(C19<=CRONO.NivelExibicao,MAX($AD$15:OFFSET(AD19,-1,0))+IF($C19<>1,1,MAX(1,COUNTIF(QCI!$A$13:$A$24,OFFSET($E19,-1,0)))),\"\")","v":""},{"$f":"IF(AND($C19=\"S\",ORÇAMENTO.CodBarra<>\"\"),IF(ORÇAMENTO.Fonte=\"\",ORÇAMENTO.CodBarra,CONCATENATE(ORÇAMENTO.Fonte,\" \",ORÇAMENTO.CodBarra)))","v":"SINAPI 90091"},{"$f":"IF(ISERROR(INDIRECT(ORÇAMENTO.BancoRef)),\"(abra o arquivo 'Referência \"&Excel_BuiltIn_Database&\".xlsm)\",IF(OR($C19<>\"S\",ORÇAMENTO.CodBarra=\"\"),\"(Sem Código)\",IF(ISERROR(MATCH($AE19,INDIRECT(ORÇAMENTO.BancoRef),0)),\"(Código não identificado nas referências)\",MATCH($AE19,INDIRECT(ORÇAMENTO.BancoRef),0))))","v":5863},{"$f":"ROUND(IF(DESONERACAO=\"sim\",REFERENCIA.Desonerado,REFERENCIA.NaoDesonerado),2)","v":6.65},0.25,null,409.59,null,null,3403.69,8.31]
["S",2,"S",0,{"$f":"IF($C20=1,OFFSET(E20,-1,0)+MAX(1,COUNTIF(QCI!$A$13:$A$24,OFFSET(ORÇAMENTO!E20,-1,0))),OFFSET(E20,-1,0))","v":1},1,0,0,3,{"$f":"IF(OR($C20=\"S\",$C20=0),0,MATCH(0,OFFSET($D20,1,$C20,ROW($C$34)-ROW($C20)),0))","v":0},{"$f":"IF(OR($C20=\"S\",$C20=0),0,MATCH(OFFSET($D20,0,$C20)+IF($C20<>1,1,COUNTIF(QCI!$A$13:$A$24,ORÇAMENTO!E20)),OFFSET($D20,1,$C20,ROW($C$34)-ROW($C20)),0))","v":0},"F","Serviço","Serviço","1.1.3.","SINAPI","97084",{"$f":"IF($C20=\"S\",REFERENCIA.Descricao,\"(digite a descrição aqui)\")","v":"COMPACTAÇÃO MECÂNICA DE SOLO PARA EXECUÇÃO DE RADIER, PISO DE CONCRETO OU LAJE SOBRE SOLO, COM COMPACTADOR DE SOLOS TIPO PLACA VIBRATÓRIA. AF_09/2021"},{"$f":"REFERENCIA.Unidade","v":"M2"},{"$f":"OFFSET(CÁLCULO!H$15,ROW($T20)-ROW(T$15),0)","v":935.22},0.73,"BDI 1",{"$f":"IF($C20=\"S\",ROUND(IF(TIPOORCAMENTO=\"Proposto\",ORÇAMENTO.CustoUnitario*(1+$AH20),ORÇAMENTO.PrecoUnitarioLicitado),15-13*$AF$10),0)","v":0.91},{"$f":"IF($C20=\"S\",IF(Import.TipoArredondamento<>\"TransfereGOV\",VTOTAL1,SUM(OFFSET(CÁLCULO!$AA$15,ROW($X20)-ROW($X$15),1):OFFSET(CÁLCULO!$AL$15,ROW($X20)-ROW($X$15),-1))),IF($C20=0,0,ROUND(SomaAgrup,15-13*$AF$11)))","v":851.05},"RA","RA",{"$f":"IF($C20=\"S\",IF($Z20=\"CP\",$X20,IF($Z20=\"RA\",(($X20)*QCI!$AA$3),0)),SomaAgrup)","v":851.05},0,{"$f":"IF($N20=\"\",\"\",IF(ORÇAMENTO.Descricao=\"\",\"DESCRIÇÃO\",IF(AND($C20=\"S\",ORÇAMENTO.Unidade=\"\"),\"UNIDADE\",IF($X20<0,\"VALOR NEGATIVO\",IF(OR(AND(TIPOORCAMENTO=\"Proposto\",$AG20<>\"\",$AG20>0,ORÇAMENTO.CustoUnitario>$AG20),AND(TIPOORCAMENTO=\"LICITADO\",ORÇAMENTO.PrecoUnitarioLicitado>$AN20)),\"ACIMA REF.\",\"\")))))","v":""},{"$f":"IF(C20<=CRONO.NivelExibicao,MAX($AD$15:OFFSET(AD20,-1,0))+IF($C20<>1,1,MAX(1,COUNTIF(QCI!$A$13:$A$24,OFFSET($E20,-1,0)))),\"\")","v":""},{"$f":"IF(AND($C20=\"S\",ORÇAMENTO.CodBarra<>\"\"),IF(ORÇAMENTO.Fonte=\"\",ORÇAMENTO.CodBarra,CONCATENATE(ORÇAMENTO.Fonte,\" \",ORÇAMENTO.CodBarra)))","v":"SINAPI 97084"},{"$f":"IF(ISERROR(INDIRECT(ORÇAMENTO.BancoRef)),\"(abra o arquivo 'Referência \"&Excel_BuiltIn_Database&\".xlsm)\",IF(OR($C20<>\"S\",ORÇAMENTO.CodBarra=\"\"),\"(Sem Código)\",IF(ISERROR(MATCH($AE20,INDIRECT(ORÇAMENTO.BancoRef),0)),\"(Código não identificado nas referências)\",MATCH($AE20,INDIRECT(ORÇAMENTO.BancoRef),0))))","v":2395},{"$f":"ROUND(IF(DESONERACAO=\"sim\",REFERENCIA.Desonerado,REFERENCIA.NaoDesonerado),2)","v":0.73},0.25,null,935.22,null,null,851.05,0.91]
[{"$f":"CHOOSE(1+LOG(1+2*(ORÇAMENTO.Nivel=\"Meta\")+4*(ORÇAMENTO.Nivel=\"Nível 2\")+8*(ORÇAMENTO.Nivel=\"Nível 3\")+16*(ORÇAMENTO.Nivel=\"Nível 4\")+32*(ORÇAMENTO.Nivel=\"Serviço\"),2),0,1,2,3,4,\"S\")","v":2},{"$f":"IF(OR(C21=\"s\",C21=0),OFFSET(B21,-1,0),C21)","v":2},{"$f":"IF(OFFSET(C21,-1,0)=\"L\",1,IF(OFFSET(C21,-1,0)=1,2,IF(OR(A21=\"s\",A21=0),\"S\",IF(AND(OFFSET(C21,-1,0)=2,A21=4),3,IF(AND(OR(OFFSET(C21,-1,0)=\"s\",OFFSET(C21,-1,0)=0),A21<>\"s\",A21>OFFSET(B21,-1,0)),OFFSET(B21,-1,0),A21)))))","v":2},{"$f":"IF(OR(C21=\"S\",C21=0),0,IF(ISERROR(K21),J21,SMALL(J21:K21,1)))","v":7},{"$f":"IF($C21=1,OFFSET(E21,-1,0)+MAX(1,COUNTIF(QCI!$A$13:$A$24,OFFSET(ORÇAMENTO!E21,-1,0))),OFFSET(E21,-1,0))","v":1},{"$f":"IF($C21=1,0,IF($C21=2,OFFSET(F21,-1,0)+1,OFFSET(F21,-1,0)))","v":2},{"$f":"IF(AND($C21<=2,$C21<>0),0,IF($C21=3,OFFSET(G21,-1,0)+1,OFFSET(G21,-1,0)))","v":0},{"$f":"IF(AND($C21<=3,$C21<>0),0,IF($C21=4,OFFSET(H21,-1,0)+1,OFFSET(H21,-1,0)))","v":0},{"$f":"IF(AND($C21<=4,$C21<>0),0,IF(AND($C21=\"S\",$X21>0),OFFSET(I21,-1,0)+1,OFFSET(I21,-1,0)))","v":0},{"$f":"IF(OR($C21=\"S\",$C21=0),0,MATCH(0,OFFSET($D21,1,$C21,ROW($C$34)-ROW($C21)),0))","v":13},{"$f":"IF(OR($C21=\"S\",$C21=0),0,MATCH(OFFSET($D21,0,$C21)+IF($C21<>1,1,COUNTIF(QCI!$A$13:$A$24,ORÇAMENTO!E21)),OFFSET($D21,1,$C21,ROW($C$34)-ROW($C21)),0))","v":7},{"$f":"IF(OR($X21>0,$C21=1,$C21=2,$C21=3,$C21=4),\"F\",\"\")","v":"F"},"Nível 2",{"$f":"CHOOSE(1+LOG(1+2*(C21=1)+4*(C21=2)+8*(C21=3)+16*(C21=4)+32*(C21=\"S\"),2),\"\",\"Meta\",\"Nível 2\",\"Nível 3\",\"Nível 4\",\"Serviço\")","v":"Nível 2"},{"$f":"IF(OR($C21=0,$L21=\"\"),\"-\",CONCATENATE(E21&\".\",IF(AND($A$5>=2,$C21>=2),F21&\".\",\"\"),IF(AND($A$5>=3,$C21>=3),G21&\".\",\"\"),IF(AND($A$5>=4,$C21>=4),H21&\".\",\"\"),IF($C21=\"S\",I21&\".\",\"\")))","v":"1.2."},"SINAPI",null,"PAVIMENTAÇÃO",{"$f":"REFERENCIA.Unidade","v":"-"},{"$f":"OFFSET(CÁLCULO!H$15,ROW($T21)-ROW(T$15),0)","v":0},null,"BDI 1",{"$f":"IF($C21=\"S\",ROUND(IF(TIPOORCAMENTO=\"Proposto\",ORÇAMENTO.CustoUnitario*(1+$AH21),ORÇAMENTO.PrecoUnitarioLicitado),15-13*$AF$10),0)","v":0},{"$f":"IF($C21=\"S\",IF(Import.TipoArredondamento<>\"TransfereGOV\",VTOTAL1,SUM(OFFSET(CÁLCULO!$AA$15,ROW($X21)-ROW($X$15),1):OFFSET(CÁLCULO!$AL$15,ROW($X21)-ROW($X$15),-1))),IF($C21=0,0,ROUND(SomaAgrup,15-13*$AF$11)))","v":180910.49},"RA",{"$f":"IF(AND($C21=\"S\",$X21>0),IF(ISBLANK($Y21),\"RA\",LEFT($Y21,2)),\"\")","v":""},{"$f":"IF($C21=\"S\",IF($Z21=\"CP\",$X21,IF($Z21=\"RA\",(($X21)*QCI!$AA$3),0)),SomaAgrup)","v":180910.49000000002},{"$f":"IF($C21=\"S\",IF($Z21=\"OU\",ROUND($X21,2),0),SomaAgrup)","v":0},{"$f":"IF($N21=\"\",\"\",IF(ORÇAMENTO.Descricao=\"\",\"DESCRIÇÃO\",IF(AND($C21=\"S\",ORÇAMENTO.Unidade=\"\"),\"UNIDADE\",IF($X21<0,\"VALOR NEGATIVO\",IF(OR(AND(TIPOORCAMENTO=\"Proposto\",$AG21<>\"\",$AG21>0,ORÇAMENTO.CustoUnitario>$AG21),AND(TIPOORCAMENTO=\"LICITADO\",ORÇAMENTO.PrecoUnitarioLicitado>$AN21)),\"ACIMA REF.\",\"\")))))","v":""},{"$f":"IF(C21<=CRONO.NivelExibicao,MAX($AD$15:OFFSET(AD21,-1,0))+IF($C21<>1,1,MAX(1,COUNTIF(QCI!$A$13:$A$24,OFFSET($E21,-1,0)))),\"\")","v":3},{"$f":"IF(AND($C21=\"S\",ORÇAMENTO.CodBarra<>\"\"),IF(ORÇAMENTO.Fonte=\"\",ORÇAMENTO.CodBarra,CONCATENATE(ORÇAMENTO.Fonte,\" \",ORÇAMENTO.CodBarra)))","v":false},{"$f":"IF(ISERROR(INDIRECT(ORÇAMENTO.BancoRef)),\"(abra o arquivo 'Referência \"&Excel_BuiltIn_Database&\".xlsm)\",IF(OR($C21<>\"S\",ORÇAMENTO.CodBarra=\"\"),\"(Sem Código)\",IF(ISERROR(MATCH($AE21,INDIRECT(ORÇAMENTO.BancoRef),0)),\"(Código não identificado nas referências)\",MATCH($AE21,INDIRECT(ORÇAMENTO.BancoRef),0))))","v":"(Sem Código)"},{"$f":"ROUND(IF(DESONERACAO=\"sim\",REFERENCIA.Desonerado,REFERENCIA.NaoDesonerado),2)","v":0},{"$f":"ROUND(IF(ISNUMBER(ORÇAMENTO.OpcaoBDI),ORÇAMENTO.OpcaoBDI,IF(LEFT(ORÇAMENTO.OpcaoBDI,3)=\"BDI\",HLOOKUP(ORÇAMENTO.OpcaoBDI,$F$4:$H$5,2,FALSE),0)),15-11*$AF$9)","v":0.25},null,null,null,null,180910.49,{"$f":"ROUND(ORÇAMENTO.CustoUnitario*(1+$AH21),2)","v":0}]
["S",2,"S",0,{"$f":"IF($C22=1,OFFSET(E22,-1,0)+MAX(1,COUNTIF(QCI!$A$13:$A$24,OFFSET(ORÇAMENTO!E22,-1,0))),OFFSET(E22,-1,0))","v":1},2,0,0,1,{"$f":"IF(OR($C22=\"S\",$C22=0),0,MATCH(0,OFFSET($D22,1,$C22,ROW($C$34)-ROW($C22)),0))","v":0},{"$f":"IF(OR($C22=\"S\",$C22=0),0,MATCH(OFFSET($D22,0,$C22)+IF($C22<>1,1,COUNTIF(QCI!$A$13:$A$24,ORÇAMENTO!E22)),OFFSET($D22,1,$C22,ROW($C$34)-ROW($C22)),0))","v":0},"F","Serviço","Serviço","1.2.1.","SINAPI","94274",{"$f":"IF($C22=\"S\",REFERENCIA.Descricao,\"(digite a descrição aqui)\")","v":"ASSENTAMENTO DE GUIA (MEIO-FIO) EM TRECHO CURVO, CONFECCIONADA EM CONCRETO PRÉ-FABRICADO, DIMENSÕES 100X15X13X30 CM (COMPRIMENTO X BASE INFERIOR X BASE SUPERIOR X ALTURA). AF_01/2024"},{"$f":"REFERENCIA.Unidade","v":"M"},{"$f":"OFFSET(CÁLCULO!H$15,ROW($T22)-ROW(T$15),0)","v":78.02},53.04,"BDI 1",{"$f":"IF($C22=\"S\",ROUND(IF(TIPOORCAMENTO=\"Proposto\",ORÇAMENTO.CustoUnitario*(1+$AH22),ORÇAMENTO.PrecoUnitarioLicitado),15-13*$AF$10),0)","v":66.3},{"$f":"IF($C22=\"S\",IF(Import.TipoArredondamento<>\"TransfereGOV\",VTOTAL1,SUM(OFFSET(CÁLCULO!$AA$15,ROW($X22)-ROW($X$15),1):OFFSET(CÁLCULO!$AL$15,ROW($X22)-ROW($X$15),-1))),IF($C22=0,0,ROUND(SomaAgrup,15-13*$AF$11)))","v":5172.7299999999996},"RA","RA",{"$f":"IF($C22=\"S\",IF($Z22=\"CP\",$X22,IF($Z22=\"RA\",(($X22)*QCI!$AA$3),0)),SomaAgrup)","v":5172.7299999999996},0,{"$f":"IF($N22=\"\",\"\",IF(ORÇAMENTO.Descricao=\"\",\"DESCRIÇÃO\",IF(AND($C22=\"S\",ORÇAMENTO.Unidade=\"\"),\"UNIDADE\",IF($X22<0,\"VALOR NEGATIVO\",IF(OR(AND(TIPOORCAMENTO=\"Proposto\",$AG22<>\"\",$AG22>0,ORÇAMENTO.CustoUnitario>$AG22),AND(TIPOORCAMENTO=\"LICITADO\",ORÇAMENTO.PrecoUnitarioLicitado>$AN22)),\"ACIMA REF.\",\"\")))))","v":""},{"$f":"IF(C22<=CRONO.NivelExibicao,MAX($AD$15:OFFSET(AD22,-1,0))+IF($C22<>1,1,MAX(1,COUNTIF(QCI!$A$13:$A$24,OFFSET($E22,-1,0)))),\"\")","v":""},{"$f":"IF(AND($C22=\"S\",ORÇAMENTO.CodBarra<>\"\"),IF(ORÇAMENTO.Fonte=\"\",ORÇAMENTO.CodBarra,CONCATENATE(ORÇAMENTO.Fonte,\" \",ORÇAMENTO.CodBarra)))","v":"SINAPI 94274"},{"$f":"IF(ISERROR(INDIRECT(ORÇAMENTO.BancoRef)),\"(abra o arquivo 'Referência \"&Excel_BuiltIn_Database&\".xlsm)\",IF(OR($C22<>\"S\",ORÇAMENTO.CodBarra=\"\"),\"(Sem Código)\",IF(ISERROR(MATCH($AE22,INDIRECT(ORÇAMENTO.BancoRef),0)),\"(Código não identificado nas referências)\",MATCH($AE22,INDIRECT(ORÇAMENTO.BancoRef),0))))","v":2013},{"$f":"ROUND(IF(DESONERACAO=\"sim\",REFERENCIA.Desonerado,REFERENCIA.NaoDesonerado),2)","v":53.04},0.25,null,78.02,null,null,5172.7299999999996,66.3]
["S",2,"S",0,{"$f":"IF($C23=1,OFFSET(E23,-1,0)+MAX(1,COUNTIF(QCI!$A$13:$A$24,OFFSET(ORÇAMENTO!E23,-1,0))),OFFSET(E23,-1,0))","v":1},2,0,0,2,{"$f":"IF(OR($C23=\"S\",$C23=0),0,MATCH(0,OFFSET($D23,1,$C23,ROW($C$34)-ROW($C23)),0))","v":0},{"$f":"IF(OR($C23=\"S\",$C23=0),0,MATCH(OFFSET($D23,0,$C23)+IF($C23<>1,1,COUNTIF(QCI!$A$13:$A$24,ORÇAMENTO!E23)),OFFSET($D23,1,$C23,ROW($C$34)-ROW($C23)),0))","v":0},"F","Serviço","Serviço","1.2.2.","SINAPI","94273",{"$f":"IF($C23=\"S\",REFERENCIA.Descricao,\"(digite a descrição aqui)\")","v":"ASSENTAMENTO DE GUIA (MEIO-FIO) EM TRECHO RETO, CONFECCIONADA EM CONCRETO PRÉ-FABRICADO, DIMENSÕES 100X15X13X30 CM (COMPRIMENTO X BASE INFERIOR X BASE SUPERIOR X ALTURA). AF_01/2024"},{"$f":"REFERENCIA.Unidade","v":"M"},{"$f":"OFFSET(CÁLCULO!H$15,ROW($T23)-ROW(T$15),0)","v":198.57},50.16,"BDI 1",{"$f":"IF($C23=\"S\",ROUND(IF(TIPOORCAMENTO=\"Proposto\",ORÇAMENTO.CustoUnitario*(1+$AH23),ORÇAMENTO.PrecoUnitarioLicitado),15-13*$AF$10),0)","v":62.7},{"$f":"IF($C23=\"S\",IF(Import.TipoArredondamento<>\"TransfereGOV\",VTOTAL1,SUM(OFFSET(CÁLCULO!$AA$15,ROW($X23)-ROW($X$15),1):OFFSET(CÁLCULO!$AL$15,ROW($X23)-ROW($X$15),-1))),IF($C23=0,0,ROUND(SomaAgrup,15-13*$AF$11)))","v":12450.34},"RA","RA",{"$f":"IF($C23=\"S\",IF($Z23=\"CP\",$X23,IF($Z23=\"RA\",(($X23)*QCI!$AA$3),0)),SomaAgrup)","v":12450.34},0,{"$f":"IF($N23=\"\",\"\",IF(ORÇAMENTO.Descricao=\"\",\"DESCRIÇÃO\",IF(AND($C23=\"S\",ORÇAMENTO.Unidade=\"\"),\"UNIDADE\",IF($X23<0,\"VALOR NEGATIVO\",IF(OR(AND(TIPOORCAMENTO=\"Proposto\",$AG23<>\"\",$AG23>0,ORÇAMENTO.CustoUnitario>$AG23),AND(TIPOORCAMENTO=\"LICITADO\",ORÇAMENTO.PrecoUnitarioLicitado>$AN23)),\"ACIMA REF.\",\"\")))))","v":""},{"$f":"IF(C23<=CRONO.NivelExibicao,MAX($AD$15:OFFSET(AD23,-1,0))+IF($C23<>1,1,MAX(1,COUNTIF(QCI!$A$13:$A$24,OFFSET($E23,-1,0)))),\"\")","v":""},{"$f":"IF(AND($C23=\"S\",ORÇAMENTO.CodBarra<>\"\"),IF(ORÇAMENTO.Fonte=\"\",ORÇAMENTO.CodBarra,CONCATENATE(ORÇAMENTO.Fonte,\" \",ORÇAMENTO.CodBarra)))","v":"SINAPI 94273"},{"$f":"IF(ISERROR(INDIRECT(ORÇAMENTO.BancoRef)),\"(abra o arquivo 'Referência \"&Excel_BuiltIn_Database&\".xlsm)\",IF(OR($C23<>\"S\",ORÇAMENTO.CodBarra=\"\"),\"(Sem Código)\",IF(ISERROR(MATCH($AE23,INDIRECT(ORÇAMENTO.BancoRef),0)),\"(Código não identificado nas referências)\",MATCH($AE23,INDIRECT(ORÇAMENTO.BancoRef),0))))","v":2012},{"$f":"ROUND(IF(DESONERACAO=\"sim\",REFERENCIA.Desonerado,REFERENCIA.NaoDesonerado),2)","v":50.16},0.25,null,198.57,null,null,12450.34,62.7]
["S",2,"S",0,{"$f":"IF($C24=1,OFFSET(E24,-1,0)+MAX(1,COUNTIF(QCI!$A$13:$A$24,OFFSET(ORÇAMENTO!E24,-1,0))),OFFSET(E24,-1,0))","v":1},2,0,0,3,{"$f":"IF(OR($C24=\"S\",$C24=0),0,MATCH(0,OFFSET($D24,1,$C24,ROW($C$34)-ROW($C24)),0))","v":0},{"$f":"IF(OR($C24=\"S\",$C24=0),0,MATCH(OFFSET($D24,0,$C24)+IF($C24<>1,1,COUNTIF(QCI!$A$13:$A$24,ORÇAMENTO!E24)),OFFSET($D24,1,$C24,ROW($C$34)-ROW($C24)),0))","v":0},"F","Serviço","Serviço","1.2.3.","SINAPI","92398",{"$f":"IF($C24=\"S\",REFERENCIA.Descricao,\"(digite a descrição aqui)\")","v":"EXECUÇÃO DE PAVIMENTO EM PISO INTERTRAVADO, COM BLOCO RETANGULAR COR NATURAL DE 20 X 10 CM, ESPESSURA 8 CM. AF_10/2022"},{"$f":"REFERENCIA.Unidade","v":"M2"},{"$f":"OFFSET(CÁLCULO!H$15,ROW($T24)-ROW(T$15),0)","v":567.4},82.9,"BDI 1",{"$f":"IF($C24=\"S\",ROUND(IF(TIPOORCAMENTO=\"Proposto\",ORÇAMENTO.CustoUnitario*(1+$AH24),ORÇAMENTO.PrecoUnitarioLicitado),15-13*$AF$10),0)","v":103.63},{"$f":"IF($C24=\"S\",IF(Import.TipoArredondamento<>\"TransfereGOV\",VTOTAL1,SUM(OFFSET(CÁLCULO!$AA$15,ROW($X24)-ROW($X$15),1):OFFSET(CÁLCULO!$AL$15,ROW($X24)-ROW($X$15),-1))),IF($C24=0,0,ROUND(SomaAgrup,15-13*$AF$11)))","v":58799.66},"RA","RA",{"$f":"IF($C24=\"S\",IF($Z24=\"CP\",$X24,IF($Z24=\"RA\",(($X24)*QCI!$AA$3),0)),SomaAgrup)","v":58799.66},0,{"$f":"IF($N24=\"\",\"\",IF(ORÇAMENTO.Descricao=\"\",\"DESCRIÇÃO\",IF(AND($C24=\"S\",ORÇAMENTO.Unidade=\"\"),\"UNIDADE\",IF($X24<0,\"VALOR NEGATIVO\",IF(OR(AND(TIPOORCAMENTO=\"Proposto\",$AG24<>\"\",$AG24>0,ORÇAMENTO.CustoUnitario>$AG24),AND(TIPOORCAMENTO=\"LICITADO\",ORÇAMENTO.PrecoUnitarioLicitado>$AN24)),\"ACIMA REF.\",\"\")))))","v":""},{"$f":"IF(C24<=CRONO.NivelExibicao,MAX($AD$15:OFFSET(AD24,-1,0))+IF($C24<>1,1,MAX(1,COUNTIF(QCI!$A$13:$A$24,OFFSET($E24,-1,0)))),\"\")","v":""},{"$f":"IF(AND($C24=\"S\",ORÇAMENTO.CodBarra<>\"\"),IF(ORÇAMENTO.Fonte=\"\",ORÇAMENTO.CodBarra,CONCATENATE(ORÇAMENTO.Fonte,\" \",ORÇAMENTO.CodBarra)))","v":"SINAPI 92398"},{"$f":"IF(ISERROR(INDIRECT(ORÇAMENTO.BancoRef)),\"(abra o arquivo 'Referência \"&Excel_BuiltIn_Database&\".xlsm)\",IF(OR($C24<>\"S\",ORÇAMENTO.CodBarra=\"\"),\"(Sem Código)\",IF(ISERROR(MATCH($AE24,INDIRECT(ORÇAMENTO.BancoRef),0)),\"(Código não identificado nas referências)\",MATCH($AE24,INDIRECT(ORÇAMENTO.BancoRef),0))))","v":6299},{"$f":"ROUND(IF(DESONERACAO=\"sim\",REFERENCIA.Desonerado,REFERENCIA.NaoDesonerado),2)","v":82.9},0.25,null,567.4,null,null,58799.66,103.63]
["S",2,"S",0,{"$f":"IF($C25=1,OFFSET(E25,-1,0)+MAX(1,COUNTIF(QCI!$A$13:$A$24,OFFSET(ORÇAMENTO!E25,-1,0))),OFFSET(E25,-1,0))","v":1},2,0,0,4,{"$f":"IF(OR($C25=\"S\",$C25=0),0,MATCH(0,OFFSET($D25,1,$C25,ROW($C$34)-ROW($C25)),0))","v":0},{"$f":"IF(OR($C25=\"S\",$C25=0),0,MATCH(OFFSET($D25,0,$C25)+IF($C25<>1,1,COUNTIF(QCI!$A$13:$A$24,ORÇAMENTO!E25)),OFFSET($D25,1,$C25,ROW($C$34)-ROW($C25)),0))","v":0},"F","Serviço","Serviço","1.2.4.","SINAPI","92396",{"$f":"IF($C25=\"S\",REFERENCIA.Descricao,\"(digite a descrição aqui)\")","v":"EXECUÇÃO DE PASSEIO EM PISO INTERTRAVADO, COM BLOCO RETANGULAR COR NATURAL DE 20 X 10 CM, ESPESSURA 6 CM. AF_10/2022"},{"$f":"REFERENCIA.Unidade","v":"M2"},{"$f":"OFFSET(CÁLCULO!H$15,ROW($T25)-ROW(T$15),0)","v":678.8},76.64,"BDI 1",{"$f":"IF($C25=\"S\",ROUND(IF(TIPOORCAMENTO=\"Proposto\",ORÇAMENTO.CustoUnitario*(1+$AH25),ORÇAMENTO.PrecoUnitarioLicitado),15-13*$AF$10),0)","v":95.8},{"$f":"IF($C25=\"S\",IF(Import.TipoArredondamento<>\"TransfereGOV\",VTOTAL1,SUM(OFFSET(CÁLCULO!$AA$15,ROW($X25)-ROW($X$15),1):OFFSET(CÁLCULO!$AL$15,ROW($X25)-ROW($X$15),-1))),IF($C25=0,0,ROUND(SomaAgrup,15-13*$AF$11)))","v":65029.04},"RA","RA",{"$f":"IF($C25=\"S\",IF($Z25=\"CP\",$X25,IF($Z25=\"RA\",(($X25)*QCI!$AA$3),0)),SomaAgrup)","v":65029.04},0,{"$f":"IF($N25=\"\",\"\",IF(ORÇAMENTO.Descricao=\"\",\"DESCRIÇÃO\",IF(AND($C25=\"S\",ORÇAMENTO.Unidade=\"\"),\"UNIDADE\",IF($X25<0,\"VALOR NEGATIVO\",IF(OR(AND(TIPOORCAMENTO=\"Proposto\",$AG25<>\"\",$AG25>0,ORÇAMENTO.CustoUnitario>$AG25),AND(TIPOORCAMENTO=\"LICITADO\",ORÇAMENTO.PrecoUnitarioLicitado>$AN25)),\"ACIMA REF.\",\"\")))))","v":""},{"$f":"IF(C25<=CRONO.NivelExibicao,MAX($AD$15:OFFSET(AD25,-1,0))+IF($C25<>1,1,MAX(1,COUNTIF(QCI!$A$13:$A$24,OFFSET($E25,-1,0)))),\"\")","v":""},{"$f":"IF(AND($C25=\"S\",ORÇAMENTO.CodBarra<>\"\"),IF(ORÇAMENTO.Fonte=\"\",ORÇAMENTO.CodBarra,CONCATENATE(ORÇAMENTO.Fonte,\" \",ORÇAMENTO.CodBarra)))","v":"SINAPI 92396"},{"$f":"IF(ISERROR(INDIRECT(ORÇAMENTO.BancoRef)),\"(abra o arquivo 'Referência \"&Excel_BuiltIn_Database&\".xlsm)\",IF(OR($C25<>\"S\",ORÇAMENTO.CodBarra=\"\"),\"(Sem Código)\",IF(ISERROR(MATCH($AE25,INDIRECT(ORÇAMENTO.BancoRef),0)),\"(Código não identificado nas referências)\",MATCH($AE25,INDIRECT(ORÇAMENTO.BancoRef),0))))","v":6297},{"$f":"ROUND(IF(DESONERACAO=\"sim\",REFERENCIA.Desonerado,REFERENCIA.NaoDesonerado),2)","v":76.64},0.25,null,678.8,null,null,65029.04,95.8]
["S",2,"S",0,{"$f":"IF($C26=1,OFFSET(E26,-1,0)+MAX(1,COUNTIF(QCI!$A$13:$A$24,OFFSET(ORÇAMENTO!E26,-1,0))),OFFSET(E26,-1,0))","v":1},2,0,0,5,{"$f":"IF(OR($C26=\"S\",$C26=0),0,MATCH(0,OFFSET($D26,1,$C26,ROW($C$34)-ROW($C26)),0))","v":0},{"$f":"IF(OR($C26=\"S\",$C26=0),0,MATCH(OFFSET($D26,0,$C26)+IF($C26<>1,1,COUNTIF(QCI!$A$13:$A$24,ORÇAMENTO!E26)),OFFSET($D26,1,$C26,ROW($C$34)-ROW($C26)),0))","v":0},"F","Serviço","Serviço","1.2.5.","SINAPI","94994",{"$f":"IF($C26=\"S\",REFERENCIA.Descricao,\"(digite a descrição aqui)\")","v":"EXECUÇÃO DE PASSEIO (CALÇADA) OU PISO DE CONCRETO COM CONCRETO MOLDADO IN LOCO, FEITO EM OBRA, ACABAMENTO CONVENCIONAL, ESPESSURA 8 CM, ARMADO. AF_08/2022"},{"$f":"REFERENCIA.Unidade","v":"M2"},{"$f":"OFFSET(CÁLCULO!H$15,ROW($T26)-ROW(T$15),0)","v":196.67},99.85,"BDI 1",{"$f":"IF($C26=\"S\",ROUND(IF(TIPOORCAMENTO=\"Proposto\",ORÇAMENTO.CustoUnitario*(1+$AH26),ORÇAMENTO.PrecoUnitarioLicitado),15-13*$AF$10),0)","v":124.81},{"$f":"IF($C26=\"S\",IF(Import.TipoArredondamento<>\"TransfereGOV\",VTOTAL1,SUM(OFFSET(CÁLCULO!$AA$15,ROW($X26)-ROW($X$15),1):OFFSET(CÁLCULO!$AL$15,ROW($X26)-ROW($X$15),-1))),IF($C26=0,0,ROUND(SomaAgrup,15-13*$AF$11)))","v":24546.38},"RA","RA",{"$f":"IF($C26=\"S\",IF($Z26=\"CP\",$X26,IF($Z26=\"RA\",(($X26)*QCI!$AA$3),0)),SomaAgrup)","v":24546.38},0,{"$f":"IF($N26=\"\",\"\",IF(ORÇAMENTO.Descricao=\"\",\"DESCRIÇÃO\",IF(AND($C26=\"S\",ORÇAMENTO.Unidade=\"\"),\"UNIDADE\",IF($X26<0,\"VALOR NEGATIVO\",IF(OR(AND(TIPOORCAMENTO=\"Proposto\",$AG26<>\"\",$AG26>0,ORÇAMENTO.CustoUnitario>$AG26),AND(TIPOORCAMENTO=\"LICITADO\",ORÇAMENTO.PrecoUnitarioLicitado>$AN26)),\"ACIMA REF.\",\"\")))))","v":""},{"$f":"IF(C26<=CRONO.NivelExibicao,MAX($AD$15:OFFSET(AD26,-1,0))+IF($C26<>1,1,MAX(1,COUNTIF(QCI!$A$13:$A$24,OFFSET($E26,-1,0)))),\"\")","v":""},{"$f":"IF(AND($C26=\"S\",ORÇAMENTO.CodBarra<>\"\"),IF(ORÇAMENTO.Fonte=\"\",ORÇAMENTO.CodBarra,CONCATENATE(ORÇAMENTO.Fonte,\" \",ORÇAMENTO.CodBarra)))","v":"SINAPI 94994"},{"$f":"IF(ISERROR(INDIRECT(ORÇAMENTO.BancoRef)),\"(abra o arquivo 'Referência \"&Excel_BuiltIn_Database&\".xlsm)\",IF(OR($C26<>\"S\",ORÇAMENTO.CodBarra=\"\"),\"(Sem Código)\",IF(ISERROR(MATCH($AE26,INDIRECT(ORÇAMENTO.BancoRef),0)),\"(Código não identificado nas referências)\",MATCH($AE26,INDIRECT(ORÇAMENTO.BancoRef),0))))","v":6560},{"$f":"ROUND(IF(DESONERACAO=\"sim\",REFERENCIA.Desonerado,REFERENCIA.NaoDesonerado),2)","v":99.85},0.25,null,196.67,null,null,24546.38,124.81]
["S",2,"S",0,{"$f":"IF($C27=1,OFFSET(E27,-1,0)+MAX(1,COUNTIF(QCI!$A$13:$A$24,OFFSET(ORÇAMENTO!E27,-1,0))),OFFSET(E27,-1,0))","v":1},2,0,0,6,{"$f":"IF(OR($C27=\"S\",$C27=0),0,MATCH(0,OFFSET($D27,1,$C27,ROW($C$34)-ROW($C27)),0))","v":0},{"$f":"IF(OR($C27=\"S\",$C27=0),0,MATCH(OFFSET($D27,0,$C27)+IF($C27<>1,1,COUNTIF(QCI!$A$13:$A$24,ORÇAMENTO!E27)),OFFSET($D27,1,$C27,ROW($C$34)-ROW($C27)),0))","v":0},"F","Serviço","Serviço","1.2.6.","SINAPI","104658",{"$f":"IF($C27=\"S\",REFERENCIA.Descricao,\"(digite a descrição aqui)\")","v":"PISO PODOTÁTIL DE ALERTA OU DIRECIONAL, DE CONCRETO, ASSENTADO SOBRE ARGAMASSA. AF_03/2024"},{"$f":"REFERENCIA.Unidade","v":"M2"},{"$f":"OFFSET(CÁLCULO!H$15,ROW($T27)-ROW(T$15),0)","v":81.16},146.99,"BDI 1",{"$f":"IF($C27=\"S\",ROUND(IF(TIPOORCAMENTO=\"Proposto\",ORÇAMENTO.CustoUnitario*(1+$AH27),ORÇAMENTO.PrecoUnitarioLicitado),15-13*$AF$10),0)","v":183.74},{"$f":"IF($C27=\"S\",IF(Import.TipoArredondamento<>\"TransfereGOV\",VTOTAL1,SUM(OFFSET(CÁLCULO!$AA$15,ROW($X27)-ROW($X$15),1):OFFSET(CÁLCULO!$AL$15,ROW($X27)-ROW($X$15),-1))),IF($C27=0,0,ROUND(SomaAgrup,15-13*$AF$11)))","v":14912.34},"RA","RA",{"$f":"IF($C27=\"S\",IF($Z27=\"CP\",$X27,IF($Z27=\"RA\",(($X27)*QCI!$AA$3),0)),SomaAgrup)","v":14912.34},0,{"$f":"IF($N27=\"\",\"\",IF(ORÇAMENTO.Descricao=\"\",\"DESCRIÇÃO\",IF(AND($C27=\"S\",ORÇAMENTO.Unidade=\"\"),\"UNIDADE\",IF($X27<0,\"VALOR NEGATIVO\",IF(OR(AND(TIPOORCAMENTO=\"Proposto\",$AG27<>\"\",$AG27>0,ORÇAMENTO.CustoUnitario>$AG27),AND(TIPOORCAMENTO=\"LICITADO\",ORÇAMENTO.PrecoUnitarioLicitado>$AN27)),\"ACIMA REF.\",\"\")))))","v":""},{"$f":"IF(C27<=CRONO.NivelExibicao,MAX($AD$15:OFFSET(AD27,-1,0))+IF($C27<>1,1,MAX(1,COUNTIF(QCI!$A$13:$A$24,OFFSET($E27,-1,0)))),\"\")","v":""},{"$f":"IF(AND($C27=\"S\",ORÇAMENTO.CodBarra<>\"\"),IF(ORÇAMENTO.Fonte=\"\",ORÇAMENTO.CodBarra,CONCATENATE(ORÇAMENTO.Fonte,\" \",ORÇAMENTO.CodBarra)))","v":"SINAPI 104658"},{"$f":"IF(ISERROR(INDIRECT(ORÇAMENTO.BancoRef)),\"(abra o arquivo 'Referência \"&Excel_BuiltIn_Database&\".xlsm)\",IF(OR($C27<>\"S\",ORÇAMENTO.CodBarra=\"\"),\"(Sem Código)\",IF(ISERROR(MATCH($AE27,INDIRECT(ORÇAMENTO.BancoRef),0)),\"(Código não identificado nas referências)\",MATCH($AE27,INDIRECT(ORÇAMENTO.BancoRef),0))))","v":6564},{"$f":"ROUND(IF(DESONERACAO=\"sim\",REFERENCIA.Desonerado,REFERENCIA.NaoDesonerado),2)","v":146.99},0.25,null,81.16,null,null,14912.34,183.74]
[{"$f":"CHOOSE(1+LOG(1+2*(ORÇAMENTO.Nivel=\"Meta\")+4*(ORÇAMENTO.Nivel=\"Nível 2\")+8*(ORÇAMENTO.Nivel=\"Nível 3\")+16*(ORÇAMENTO.Nivel=\"Nível 4\")+32*(ORÇAMENTO.Nivel=\"Serviço\"),2),0,1,2,3,4,\"S\")","v":2},{"$f":"IF(OR(C28=\"s\",C28=0),OFFSET(B28,-1,0),C28)","v":2},{"$f":"IF(OFFSET(C28,-1,0)=\"L\",1,IF(OFFSET(C28,-1,0)=1,2,IF(OR(A28=\"s\",A28=0),\"S\",IF(AND(OFFSET(C28,-1,0)=2,A28=4),3,IF(AND(OR(OFFSET(C28,-1,0)=\"s\",OFFSET(C28,-1,0)=0),A28<>\"s\",A28>OFFSET(B28,-1,0)),OFFSET(B28,-1,0),A28)))))","v":2},{"$f":"IF(OR(C28=\"S\",C28=0),0,IF(ISERROR(K28),J28,SMALL(J28:K28,1)))","v":2},{"$f":"IF($C28=1,OFFSET(E28,-1,0)+MAX(1,COUNTIF(QCI!$A$13:$A$24,OFFSET(ORÇAMENTO!E28,-1,0))),OFFSET(E28,-1,0))","v":1},{"$f":"IF($C28=1,0,IF($C28=2,OFFSET(F28,-1,0)+1,OFFSET(F28,-1,0)))","v":3},{"$f":"IF(AND($C28<=2,$C28<>0),0,IF($C28=3,OFFSET(G28,-1,0)+1,OFFSET(G28,-1,0)))","v":0},{"$f":"IF(AND($C28<=3,$C28<>0),0,IF($C28=4,OFFSET(H28,-1,0)+1,OFFSET(H28,-1,0)))","v":0},{"$f":"IF(AND($C28<=4,$C28<>0),0,IF(AND($C28=\"S\",$X28>0),OFFSET(I28,-1,0)+1,OFFSET(I28,-1,0)))","v":0},{"$f":"IF(OR($C28=\"S\",$C28=0),0,MATCH(0,OFFSET($D28,1,$C28,ROW($C$34)-ROW($C28)),0))","v":6},{"$f":"IF(OR($C28=\"S\",$C28=0),0,MATCH(OFFSET($D28,0,$C28)+IF($C28<>1,1,COUNTIF(QCI!$A$13:$A$24,ORÇAMENTO!E28)),OFFSET($D28,1,$C28,ROW($C$34)-ROW($C28)),0))","v":2},{"$f":"IF(OR($X28>0,$C28=1,$C28=2,$C28=3,$C28=4),\"F\",\"\")","v":"F"},"Nível 2",{"$f":"CHOOSE(1+LOG(1+2*(C28=1)+4*(C28=2)+8*(C28=3)+16*(C28=4)+32*(C28=\"S\"),2),\"\",\"Meta\",\"Nível 2\",\"Nível 3\",\"Nível 4\",\"Serviço\")","v":"Nível 2"},{"$f":"IF(OR($C28=0,$L28=\"\"),\"-\",CONCATENATE(E28&\".\",IF(AND($A$5>=2,$C28>=2),F28&\".\",\"\"),IF(AND($A$5>=3,$C28>=3),G28&\".\",\"\"),IF(AND($A$5>=4,$C28>=4),H28&\".\",\"\"),IF($C28=\"S\",I28&\".\",\"\")))","v":"1.3."},"SINAPI",null,"PAISAGISMO",{"$f":"REFERENCIA.Unidade","v":"-"},{"$f":"OFFSET(CÁLCULO!H$15,ROW($T28)-ROW(T$15),0)","v":0},null,"BDI 1",{"$f":"IF($C28=\"S\",ROUND(IF(TIPOORCAMENTO=\"Proposto\",ORÇAMENTO.CustoUnitario*(1+$AH28),ORÇAMENTO.PrecoUnitarioLicitado),15-13*$AF$10),0)","v":0},{"$f":"IF($C28=\"S\",IF(Import.TipoArredondamento<>\"TransfereGOV\",VTOTAL1,SUM(OFFSET(CÁLCULO!$AA$15,ROW($X28)-ROW($X$15),1):OFFSET(CÁLCULO!$AL$15,ROW($X28)-ROW($X$15),-1))),IF($C28=0,0,ROUND(SomaAgrup,15-13*$AF$11)))","v":1827.65},"RA",{"$f":"IF(AND($C28=\"S\",$X28>0),IF(ISBLANK($Y28),\"RA\",LEFT($Y28,2)),\"\")","v":""},{"$f":"IF($C28=\"S\",IF($Z28=\"CP\",$X28,IF($Z28=\"RA\",(($X28)*QCI!$AA$3),0)),SomaAgrup)","v":1827.65},{"$f":"IF($C28=\"S\",IF($Z28=\"OU\",ROUND($X28,2),0),SomaAgrup)","v":0},{"$f":"IF($N28=\"\",\"\",IF(ORÇAMENTO.Descricao=\"\",\"DESCRIÇÃO\",IF(AND($C28=\"S\",ORÇAMENTO.Unidade=\"\"),\"UNIDADE\",IF($X28<0,\"VALOR NEGATIVO\",IF(OR(AND(TIPOORCAMENTO=\"Proposto\",$AG28<>\"\",$AG28>0,ORÇAMENTO.CustoUnitario>$AG28),AND(TIPOORCAMENTO=\"LICITADO\",ORÇAMENTO.PrecoUnitarioLicitado>$AN28)),\"ACIMA REF.\",\"\")))))","v":""},{"$f":"IF(C28<=CRONO.NivelExibicao,MAX($AD$15:OFFSET(AD28,-1,0))+IF($C28<>1,1,MAX(1,COUNTIF(QCI!$A$13:$A$24,OFFSET($E28,-1,0)))),\"\")","v":4},{"$f":"IF(AND($C28=\"S\",ORÇAMENTO.CodBarra<>\"\"),IF(ORÇAMENTO.Fonte=\"\",ORÇAMENTO.CodBarra,CONCATENATE(ORÇAMENTO.Fonte,\" \",ORÇAMENTO.CodBarra)))","v":false},{"$f":"IF(ISERROR(INDIRECT(ORÇAMENTO.BancoRef)),\"(abra o arquivo 'Referência \"&Excel_BuiltIn_Database&\".xlsm)\",IF(OR($C28<>\"S\",ORÇAMENTO.CodBarra=\"\"),\"(Sem Código)\",IF(ISERROR(MATCH($AE28,INDIRECT(ORÇAMENTO.BancoRef),0)),\"(Código não identificado nas referências)\",MATCH($AE28,INDIRECT(ORÇAMENTO.BancoRef),0))))","v":"(Sem Código)"},{"$f":"ROUND(IF(DESONERACAO=\"sim\",REFERENCIA.Desonerado,REFERENCIA.NaoDesonerado),2)","v":0},{"$f":"ROUND(IF(ISNUMBER(ORÇAMENTO.OpcaoBDI),ORÇAMENTO.OpcaoBDI,IF(LEFT(ORÇAMENTO.OpcaoBDI,3)=\"BDI\",HLOOKUP(ORÇAMENTO.OpcaoBDI,$F$4:$H$5,2,FALSE),0)),15-11*$AF$9)","v":0.25},null,null,null,null,1827.65,{"$f":"ROUND(ORÇAMENTO.CustoUnitario*(1+$AH28),2)","v":0}]
["S",2,"S",0,{"$f":"IF($C29=1,OFFSET(E29,-1,0)+MAX(1,COUNTIF(QCI!$A$13:$A$24,OFFSET(ORÇAMENTO!E29,-1,0))),OFFSET(E29,-1,0))","v":1},3,0,0,1,{"$f":"IF(OR($C29=\"S\",$C29=0),0,MATCH(0,OFFSET($D29,1,$C29,ROW($C$34)-ROW($C29)),0))","v":0},{"$f":"IF(OR($C29=\"S\",$C29=0),0,MATCH(OFFSET($D29,0,$C29)+IF($C29<>1,1,COUNTIF(QCI!$A$13:$A$24,ORÇAMENTO!E29)),OFFSET($D29,1,$C29,ROW($C$34)-ROW($C29)),0))","v":0},"F","Serviço","Serviço","1.3.1.","SINAPI","98504",{"$f":"IF($C29=\"S\",REFERENCIA.Descricao,\"(digite a descrição aqui)\")","v":"PLANTIO DE GRAMA BATATAIS EM PLACAS. AF_07/2024"},{"$f":"REFERENCIA.Unidade","v":"M2"},{"$f":"OFFSET(CÁLCULO!H$15,ROW($T29)-ROW(T$15),0)","v":65.319999999999993},22.38,"BDI 1",{"$f":"IF($C29=\"S\",ROUND(IF(TIPOORCAMENTO=\"Proposto\",ORÇAMENTO.CustoUnitario*(1+$AH29),ORÇAMENTO.PrecoUnitarioLicitado),15-13*$AF$10),0)","v":27.98},{"$f":"IF($C29=\"S\",IF(Import.TipoArredondamento<>\"TransfereGOV\",VTOTAL1,SUM(OFFSET(CÁLCULO!$AA$15,ROW($X29)-ROW($X$15),1):OFFSET(CÁLCULO!$AL$15,ROW($X29)-ROW($X$15),-1))),IF($C29=0,0,ROUND(SomaAgrup,15-13*$AF$11)))","v":1827.65},"RA","RA",{"$f":"IF($C29=\"S\",IF($Z29=\"CP\",$X29,IF($Z29=\"RA\",(($X29)*QCI!$AA$3),0)),SomaAgrup)","v":1827.65},0,{"$f":"IF($N29=\"\",\"\",IF(ORÇAMENTO.Descricao=\"\",\"DESCRIÇÃO\",IF(AND($C29=\"S\",ORÇAMENTO.Unidade=\"\"),\"UNIDADE\",IF($X29<0,\"VALOR NEGATIVO\",IF(OR(AND(TIPOORCAMENTO=\"Proposto\",$AG29<>\"\",$AG29>0,ORÇAMENTO.CustoUnitario>$AG29),AND(TIPOORCAMENTO=\"LICITADO\",ORÇAMENTO.PrecoUnitarioLicitado>$AN29)),\"ACIMA REF.\",\"\")))))","v":""},{"$f":"IF(C29<=CRONO.NivelExibicao,MAX($AD$15:OFFSET(AD29,-1,0))+IF($C29<>1,1,MAX(1,COUNTIF(QCI!$A$13:$A$24,OFFSET($E29,-1,0)))),\"\")","v":""},{"$f":"IF(AND($C29=\"S\",ORÇAMENTO.CodBarra<>\"\"),IF(ORÇAMENTO.Fonte=\"\",ORÇAMENTO.CodBarra,CONCATENATE(ORÇAMENTO.Fonte,\" \",ORÇAMENTO.CodBarra)))","v":"SINAPI 98504"},{"$f":"IF(ISERROR(INDIRECT(ORÇAMENTO.BancoRef)),\"(abra o arquivo 'Referência \"&Excel_BuiltIn_Database&\".xlsm)\",IF(OR($C29<>\"S\",ORÇAMENTO.CodBarra=\"\"),\"(Sem Código)\",IF(ISERROR(MATCH($AE29,INDIRECT(ORÇAMENTO.BancoRef),0)),\"(Código não identificado nas referências)\",MATCH($AE29,INDIRECT(ORÇAMENTO.BancoRef),0))))","v":7434},{"$f":"ROUND(IF(DESONERACAO=\"sim\",REFERENCIA.Desonerado,REFERENCIA.NaoDesonerado),2)","v":22.38},0.25,null,65.319999999999993,null,null,1827.65,27.98]
[{"$f":"CHOOSE(1+LOG(1+2*(ORÇAMENTO.Nivel=\"Meta\")+4*(ORÇAMENTO.Nivel=\"Nível 2\")+8*(ORÇAMENTO.Nivel=\"Nível 3\")+16*(ORÇAMENTO.Nivel=\"Nível 4\")+32*(ORÇAMENTO.Nivel=\"Serviço\"),2),0,1,2,3,4,\"S\")","v":2},{"$f":"IF(OR(C30=\"s\",C30=0),OFFSET(B30,-1,0),C30)","v":2},{"$f":"IF(OFFSET(C30,-1,0)=\"L\",1,IF(OFFSET(C30,-1,0)=1,2,IF(OR(A30=\"s\",A30=0),\"S\",IF(AND(OFFSET(C30,-1,0)=2,A30=4),3,IF(AND(OR(OFFSET(C30,-1,0)=\"s\",OFFSET(C30,-1,0)=0),A30<>\"s\",A30>OFFSET(B30,-1,0)),OFFSET(B30,-1,0),A30)))))","v":2},{"$f":"IF(OR(C30=\"S\",C30=0),0,IF(ISERROR(K30),J30,SMALL(J30:K30,1)))","v":4},{"$f":"IF($C30=1,OFFSET(E30,-1,0)+MAX(1,COUNTIF(QCI!$A$13:$A$24,OFFSET(ORÇAMENTO!E30,-1,0))),OFFSET(E30,-1,0))","v":1},{"$f":"IF($C30=1,0,IF($C30=2,OFFSET(F30,-1,0)+1,OFFSET(F30,-1,0)))","v":4},{"$f":"IF(AND($C30<=2,$C30<>0),0,IF($C30=3,OFFSET(G30,-1,0)+1,OFFSET(G30,-1,0)))","v":0},{"$f":"IF(AND($C30<=3,$C30<>0),0,IF($C30=4,OFFSET(H30,-1,0)+1,OFFSET(H30,-1,0)))","v":0},{"$f":"IF(AND($C30<=4,$C30<>0),0,IF(AND($C30=\"S\",$X30>0),OFFSET(I30,-1,0)+1,OFFSET(I30,-1,0)))","v":0},{"$f":"IF(OR($C30=\"S\",$C30=0),0,MATCH(0,OFFSET($D30,1,$C30,ROW($C$34)-ROW($C30)),0))","v":4},{"$f":"IF(OR($C30=\"S\",$C30=0),0,MATCH(OFFSET($D30,0,$C30)+IF($C30<>1,1,COUNTIF(QCI!$A$13:$A$24,ORÇAMENTO!E30)),OFFSET($D30,1,$C30,ROW($C$34)-ROW($C30)),0))","v":{"$error":"#N/A"}},{"$f":"IF(OR($X30>0,$C30=1,$C30=2,$C30=3,$C30=4),\"F\",\"\")","v":"F"},"Nível 2",{"$f":"CHOOSE(1+LOG(1+2*(C30=1)+4*(C30=2)+8*(C30=3)+16*(C30=4)+32*(C30=\"S\"),2),\"\",\"Meta\",\"Nível 2\",\"Nível 3\",\"Nível 4\",\"Serviço\")","v":"Nível 2"},{"$f":"IF(OR($C30=0,$L30=\"\"),\"-\",CONCATENATE(E30&\".\",IF(AND($A$5>=2,$C30>=2),F30&\".\",\"\"),IF(AND($A$5>=3,$C30>=3),G30&\".\",\"\"),IF(AND($A$5>=4,$C30>=4),H30&\".\",\"\"),IF($C30=\"S\",I30&\".\",\"\")))","v":"1.4."},"SINAPI",null,"LIMPEZA DA OBRA",{"$f":"REFERENCIA.Unidade","v":"-"},{"$f":"OFFSET(CÁLCULO!H$15,ROW($T30)-ROW(T$15),0)","v":0},null,"BDI 1",{"$f":"IF($C30=\"S\",ROUND(IF(TIPOORCAMENTO=\"Proposto\",ORÇAMENTO.CustoUnitario*(1+$AH30),ORÇAMENTO.PrecoUnitarioLicitado),15-13*$AF$10),0)","v":0},{"$f":"IF($C30=\"S\",IF(Import.TipoArredondamento<>\"TransfereGOV\",VTOTAL1,SUM(OFFSET(CÁLCULO!$AA$15,ROW($X30)-ROW($X$15),1):OFFSET(CÁLCULO!$AL$15,ROW($X30)-ROW($X$15),-1))),IF($C30=0,0,ROUND(SomaAgrup,15-13*$AF$11)))","v":7924.5},"RA",{"$f":"IF(AND($C30=\"S\",$X30>0),IF(ISBLANK($Y30),\"RA\",LEFT($Y30,2)),\"\")","v":""},{"$f":"IF($C30=\"S\",IF($Z30=\"CP\",$X30,IF($Z30=\"RA\",(($X30)*QCI!$AA$3),0)),SomaAgrup)","v":7924.5},{"$f":"IF($C30=\"S\",IF($Z30=\"OU\",ROUND($X30,2),0),SomaAgrup)","v":0},{"$f":"IF($N30=\"\",\"\",IF(ORÇAMENTO.Descricao=\"\",\"DESCRIÇÃO\",IF(AND($C30=\"S\",ORÇAMENTO.Unidade=\"\"),\"UNIDADE\",IF($X30<0,\"VALOR NEGATIVO\",IF(OR(AND(TIPOORCAMENTO=\"Proposto\",$AG30<>\"\",$AG30>0,ORÇAMENTO.CustoUnitario>$AG30),AND(TIPOORCAMENTO=\"LICITADO\",ORÇAMENTO.PrecoUnitarioLicitado>$AN30)),\"ACIMA REF.\",\"\")))))","v":""},{"$f":"IF(C30<=CRONO.NivelExibicao,MAX($AD$15:OFFSET(AD30,-1,0))+IF($C30<>1,1,MAX(1,COUNTIF(QCI!$A$13:$A$24,OFFSET($E30,-1,0)))),\"\")","v":5},{"$f":"IF(AND($C30=\"S\",ORÇAMENTO.CodBarra<>\"\"),IF(ORÇAMENTO.Fonte=\"\",ORÇAMENTO.CodBarra,CONCATENATE(ORÇAMENTO.Fonte,\" \",ORÇAMENTO.CodBarra)))","v":false},{"$f":"IF(ISERROR(INDIRECT(ORÇAMENTO.BancoRef)),\"(abra o arquivo 'Referência \"&Excel_BuiltIn_Database&\".xlsm)\",IF(OR($C30<>\"S\",ORÇAMENTO.CodBarra=\"\"),\"(Sem Código)\",IF(ISERROR(MATCH($AE30,INDIRECT(ORÇAMENTO.BancoRef),0)),\"(Código não identificado nas referências)\",MATCH($AE30,INDIRECT(ORÇAMENTO.BancoRef),0))))","v":"(Sem Código)"},{"$f":"ROUND(IF(DESONERACAO=\"sim\",REFERENCIA.Desonerado,REFERENCIA.NaoDesonerado),2)","v":0},{"$f":"ROUND(IF(ISNUMBER(ORÇAMENTO.OpcaoBDI),ORÇAMENTO.OpcaoBDI,IF(LEFT(ORÇAMENTO.OpcaoBDI,3)=\"BDI\",HLOOKUP(ORÇAMENTO.OpcaoBDI,$F$4:$H$5,2,FALSE),0)),15-11*$AF$9)","v":0.25},null,null,null,null,7924.5,{"$f":"ROUND(ORÇAMENTO.CustoUnitario*(1+$AH30),2)","v":0}]
["S",2,"S",0,{"$f":"IF($C31=1,OFFSET(E31,-1,0)+MAX(1,COUNTIF(QCI!$A$13:$A$24,OFFSET(ORÇAMENTO!E31,-1,0))),OFFSET(E31,-1,0))","v":1},4,0,0,1,{"$f":"IF(OR($C31=\"S\",$C31=0),0,MATCH(0,OFFSET($D31,1,$C31,ROW($C$34)-ROW($C31)),0))","v":0},{"$f":"IF(OR($C31=\"S\",$C31=0),0,MATCH(OFFSET($D31,0,$C31)+IF($C31<>1,1,COUNTIF(QCI!$A$13:$A$24,ORÇAMENTO!E31)),OFFSET($D31,1,$C31,ROW($C$34)-ROW($C31)),0))","v":0},"F","Serviço","Serviço","1.4.1.","SINAPI","100981",{"$f":"IF($C31=\"S\",REFERENCIA.Descricao,\"(digite a descrição aqui)\")","v":"CARGA, MANOBRA E DESCARGA DE ENTULHO EM CAMINHÃO BASCULANTE 6 M³ - CARGA COM ESCAVADEIRA HIDRÁULICA  (CAÇAMBA DE 0,80 M³ / 111 HP) E DESCARGA LIVRE (UNIDADE: M3). AF_07/2020"},{"$f":"REFERENCIA.Unidade","v":"M3"},{"$f":"OFFSET(CÁLCULO!H$15,ROW($T31)-ROW(T$15),0)","v":45},10.08,"BDI 1",{"$f":"IF($C31=\"S\",ROUND(IF(TIPOORCAMENTO=\"Proposto\",ORÇAMENTO.CustoUnitario*(1+$AH31),ORÇAMENTO.PrecoUnitarioLicitado),15-13*$AF$10),0)","v":12.6},{"$f":"IF($C31=\"S\",IF(Import.TipoArredondamento<>\"TransfereGOV\",VTOTAL1,SUM(OFFSET(CÁLCULO!$AA$15,ROW($X31)-ROW($X$15),1):OFFSET(CÁLCULO!$AL$15,ROW($X31)-ROW($X$15),-1))),IF($C31=0,0,ROUND(SomaAgrup,15-13*$AF$11)))","v":567},"RA","RA",{"$f":"IF($C31=\"S\",IF($Z31=\"CP\",$X31,IF($Z31=\"RA\",(($X31)*QCI!$AA$3),0)),SomaAgrup)","v":567},0,{"$f":"IF($N31=\"\",\"\",IF(ORÇAMENTO.Descricao=\"\",\"DESCRIÇÃO\",IF(AND($C31=\"S\",ORÇAMENTO.Unidade=\"\"),\"UNIDADE\",IF($X31<0,\"VALOR NEGATIVO\",IF(OR(AND(TIPOORCAMENTO=\"Proposto\",$AG31<>\"\",$AG31>0,ORÇAMENTO.CustoUnitario>$AG31),AND(TIPOORCAMENTO=\"LICITADO\",ORÇAMENTO.PrecoUnitarioLicitado>$AN31)),\"ACIMA REF.\",\"\")))))","v":""},{"$f":"IF(C31<=CRONO.NivelExibicao,MAX($AD$15:OFFSET(AD31,-1,0))+IF($C31<>1,1,MAX(1,COUNTIF(QCI!$A$13:$A$24,OFFSET($E31,-1,0)))),\"\")","v":""},{"$f":"IF(AND($C31=\"S\",ORÇAMENTO.CodBarra<>\"\"),IF(ORÇAMENTO.Fonte=\"\",ORÇAMENTO.CodBarra,CONCATENATE(ORÇAMENTO.Fonte,\" \",ORÇAMENTO.CodBarra)))","v":"SINAPI 100981"},{"$f":"IF(ISERROR(INDIRECT(ORÇAMENTO.BancoRef)),\"(abra o arquivo 'Referência \"&Excel_BuiltIn_Database&\".xlsm)\",IF(OR($C31<>\"S\",ORÇAMENTO.CodBarra=\"\"),\"(Sem Código)\",IF(ISERROR(MATCH($AE31,INDIRECT(ORÇAMENTO.BancoRef),0)),\"(Código não identificado nas referências)\",MATCH($AE31,INDIRECT(ORÇAMENTO.BancoRef),0))))","v":7343},{"$f":"ROUND(IF(DESONERACAO=\"sim\",REFERENCIA.Desonerado,REFERENCIA.NaoDesonerado),2)","v":10.08},0.25,null,45,null,null,567,12.6]
["S",2,"S",0,{"$f":"IF($C32=1,OFFSET(E32,-1,0)+MAX(1,COUNTIF(QCI!$A$13:$A$24,OFFSET(ORÇAMENTO!E32,-1,0))),OFFSET(E32,-1,0))","v":1},4,0,0,2,0,{"$f":"IF(OR($C32=\"S\",$C32=0),0,MATCH(OFFSET($D32,0,$C32)+IF($C32<>1,1,COUNTIF(QCI!$A$13:$A$24,ORÇAMENTO!E32)),OFFSET($D32,1,$C32,ROW($C$34)-ROW($C32)),0))","v":0},"F","Serviço","Serviço","1.4.2.","SINAPI","97914",{"$f":"IF($C32=\"S\",REFERENCIA.Descricao,\"(digite a descrição aqui)\")","v":"TRANSPORTE COM CAMINHÃO BASCULANTE DE 6 M³, EM VIA URBANA PAVIMENTADA, DMT ATÉ 30 KM (UNIDADE: M3XKM). AF_07/2020"},{"$f":"REFERENCIA.Unidade","v":"M3XKM"},{"$f":"OFFSET(CÁLCULO!H$15,ROW($T32)-ROW(T$15),0)","v":1350},3.11,"BDI 1",{"$f":"IF($C32=\"S\",ROUND(IF(TIPOORCAMENTO=\"Proposto\",ORÇAMENTO.CustoUnitario*(1+$AH32),ORÇAMENTO.PrecoUnitarioLicitado),15-13*$AF$10),0)","v":3.89},{"$f":"IF($C32=\"S\",IF(Import.TipoArredondamento<>\"TransfereGOV\",VTOTAL1,SUM(OFFSET(CÁLCULO!$AA$15,ROW($X32)-ROW($X$15),1):OFFSET(CÁLCULO!$AL$15,ROW($X32)-ROW($X$15),-1))),IF($C32=0,0,ROUND(SomaAgrup,15-13*$AF$11)))","v":5251.5},"RA","RA",{"$f":"IF($C32=\"S\",IF($Z32=\"CP\",$X32,IF($Z32=\"RA\",(($X32)*QCI!$AA$3),0)),SomaAgrup)","v":5251.5},0,{"$f":"IF($N32=\"\",\"\",IF(ORÇAMENTO.Descricao=\"\",\"DESCRIÇÃO\",IF(AND($C32=\"S\",ORÇAMENTO.Unidade=\"\"),\"UNIDADE\",IF($X32<0,\"VALOR NEGATIVO\",IF(OR(AND(TIPOORCAMENTO=\"Proposto\",$AG32<>\"\",$AG32>0,ORÇAMENTO.CustoUnitario>$AG32),AND(TIPOORCAMENTO=\"LICITADO\",ORÇAMENTO.PrecoUnitarioLicitado>$AN32)),\"ACIMA REF.\",\"\")))))","v":""},{"$f":"IF(C32<=CRONO.NivelExibicao,MAX($AD$15:OFFSET(AD32,-1,0))+IF($C32<>1,1,MAX(1,COUNTIF(QCI!$A$13:$A$24,OFFSET($E32,-1,0)))),\"\")","v":""},{"$f":"IF(AND($C32=\"S\",ORÇAMENTO.CodBarra<>\"\"),IF(ORÇAMENTO.Fonte=\"\",ORÇAMENTO.CodBarra,CONCATENATE(ORÇAMENTO.Fonte,\" \",ORÇAMENTO.CodBarra)))","v":"SINAPI 97914"},{"$f":"IF(ISERROR(INDIRECT(ORÇAMENTO.BancoRef)),\"(abra o arquivo 'Referência \"&Excel_BuiltIn_Database&\".xlsm)\",IF(OR($C32<>\"S\",ORÇAMENTO.CodBarra=\"\"),\"(Sem Código)\",IF(ISERROR(MATCH($AE32,INDIRECT(ORÇAMENTO.BancoRef),0)),\"(Código não identificado nas referências)\",MATCH($AE32,INDIRECT(ORÇAMENTO.BancoRef),0))))","v":7294},{"$f":"ROUND(IF(DESONERACAO=\"sim\",REFERENCIA.Desonerado,REFERENCIA.NaoDesonerado),2)","v":3.11},0.25,null,1350,null,null,5251.5,3.89]
["S",2,"S",0,{"$f":"IF($C33=1,OFFSET(E33,-1,0)+MAX(1,COUNTIF(QCI!$A$13:$A$24,OFFSET(ORÇAMENTO!E33,-1,0))),OFFSET(E33,-1,0))","v":1},4,0,0,3,0,{"$f":"IF(OR($C33=\"S\",$C33=0),0,MATCH(OFFSET($D33,0,$C33)+IF($C33<>1,1,COUNTIF(QCI!$A$13:$A$24,ORÇAMENTO!E33)),OFFSET($D33,1,$C33,ROW($C$34)-ROW($C33)),0))","v":0},"F","Serviço","Serviço","1.4.3.","SINAPI","97915",{"$f":"IF($C33=\"S\",REFERENCIA.Descricao,\"(digite a descrição aqui)\")","v":"TRANSPORTE COM CAMINHÃO BASCULANTE DE 6 M³, EM VIA URBANA PAVIMENTADA, ADICIONAL PARA DMT EXCEDENTE A 30 KM (UNIDADE: M3XKM). AF_07/2020"},{"$f":"REFERENCIA.Unidade","v":"M3XKM"},{"$f":"OFFSET(CÁLCULO!H$15,ROW($T33)-ROW(T$15),0)","v":1350},1.25,"BDI 1",{"$f":"IF($C33=\"S\",ROUND(IF(TIPOORCAMENTO=\"Proposto\",ORÇAMENTO.CustoUnitario*(1+$AH33),ORÇAMENTO.PrecoUnitarioLicitado),15-13*$AF$10),0)","v":1.56},{"$f":"IF($C33=\"S\",IF(Import.TipoArredondamento<>\"TransfereGOV\",VTOTAL1,SUM(OFFSET(CÁLCULO!$AA$15,ROW($X33)-ROW($X$15),1):OFFSET(CÁLCULO!$AL$15,ROW($X33)-ROW($X$15),-1))),IF($C33=0,0,ROUND(SomaAgrup,15-13*$AF$11)))","v":2106},"RA","RA",{"$f":"IF($C33=\"S\",IF($Z33=\"CP\",$X33,IF($Z33=\"RA\",(($X33)*QCI!$AA$3),0)),SomaAgrup)","v":2106},0,{"$f":"IF($N33=\"\",\"\",IF(ORÇAMENTO.Descricao=\"\",\"DESCRIÇÃO\",IF(AND($C33=\"S\",ORÇAMENTO.Unidade=\"\"),\"UNIDADE\",IF($X33<0,\"VALOR NEGATIVO\",IF(OR(AND(TIPOORCAMENTO=\"Proposto\",$AG33<>\"\",$AG33>0,ORÇAMENTO.CustoUnitario>$AG33),AND(TIPOORCAMENTO=\"LICITADO\",ORÇAMENTO.PrecoUnitarioLicitado>$AN33)),\"ACIMA REF.\",\"\")))))","v":""},{"$f":"IF(C33<=CRONO.NivelExibicao,MAX($AD$15:OFFSET(AD33,-1,0))+IF($C33<>1,1,MAX(1,COUNTIF(QCI!$A$13:$A$24,OFFSET($E33,-1,0)))),\"\")","v":""},{"$f":"IF(AND($C33=\"S\",ORÇAMENTO.CodBarra<>\"\"),IF(ORÇAMENTO.Fonte=\"\",ORÇAMENTO.CodBarra,CONCATENATE(ORÇAMENTO.Fonte,\" \",ORÇAMENTO.CodBarra)))","v":"SINAPI 97915"},{"$f":"IF(ISERROR(INDIRECT(ORÇAMENTO.BancoRef)),\"(abra o arquivo 'Referência \"&Excel_BuiltIn_Database&\".xlsm)\",IF(OR($C33<>\"S\",ORÇAMENTO.CodBarra=\"\"),\"(Sem Código)\",IF(ISERROR(MATCH($AE33,INDIRECT(ORÇAMENTO.BancoRef),0)),\"(Código não identificado nas referências)\",MATCH($AE33,INDIRECT(ORÇAMENTO.BancoRef),0))))","v":7295},{"$f":"ROUND(IF(DESONERACAO=\"sim\",REFERENCIA.Desonerado,REFERENCIA.NaoDesonerado),2)","v":1.25},0.25,null,1350,null,null,2106,1.56]
[-1,null,-1,null,0,0,0,0,0,null,null,"F"]
[]
[]
[null,null,null,null,null,null,null,null,null,null,null,null,null,null,"Encargos sociais:",null,"Para elaboração deste orçamento, foram utilizados os encargos sociais do SINAPI para a Unidade da Federação indicada."]
[]
[null,null,null,null,null,null,null,null,null,null,null,null,null,null,"Observações:"]
[]
[]
[]
[]
[null,null,null,null,null,null,null,null,null,null,null,null,null,null,{"$f":"IF(AND($AF$7=FALSE,$AF$8=FALSE,$AF$9=FALSE,$AF$10=FALSE,$AF$11=FALSE),\"Não foi considerado arredondamento nos valores da planilha.\",CONCATENATE(\"Foi considerado arredondamento de duas casas decimais para \",IF($AF$7=TRUE,\"Quantidade; \",\"\"),IF($AF$8=TRUE,\"Custo Unitário; \",\"\"),IF($AF$9=TRUE,\"BDI; \",\"\"),IF($AF$10=TRUE,\"Preço Unitário; \",\"\"),IF($AF$11=TRUE,\"Preço Total.\",\"\")))","v":"Foi considerado arredondamento de duas casas decimais para Quantidade; Custo Unitário; BDI; Preço Unitário; Preço Total."}]
[null,null,null,null,null,null,null,null,null,null,null,null,null,null,"Siglas da Composição do Investimento: RA - Rateio proporcional entre Repasse e Contrapartida; RP - 100% Repasse; CP - 100% Contrapartida; OU - 100% Outros."]
[]
[null,null,null,null,null,null,null,null,null,null,null,null,null,null,{"$f":"Import.Município","v":"TRAMANDAÍ/RS"}]
[null,null,null,null,null,null,null,null,null,null,null,null,null,null,"Local",null,null,null,"Responsável Técnico"]
[null,null,null,null,null,null,null,null,null,null,null,null,null,null,null,null,null,null,"Nome:",{"$f":"Import.RespOrçamento","v":"PAULO RICARDO VIEGAS ALVES"}]
[null,null,null,null,null,null,null,null,null,null,null,null,null,null,{"$f":"DADOS!$F$25","v":"2025-03-14"},null,null,null,"CREA/CAU:","A86.107-3"]
[null,null,null,null,null,null,null,null,null,null,null,null,null,null,"Data",null,null,null,"ART/RRT:","RRT 15101062"]

{"sheet":"CÁLCULO","index":5,"n_rows":42,"n_cols":59,"rows_kept":42,"cut":false,"hidden":false,"merged":[[0,5,0,7],[0,16,0,17],[0,24,0,25],[1,5,1,7],[1,16,1,17],[1,24,1,25],[14,4,14,7],[3,4,3,5],[3,6,3,7],[3,18,3,19],[3,20,3,25],[4,4,4,5],[4,6,4,7],[4,18,4,19],[4,20,4,25]]}
[null,null,null,null,null,{"$f":"IF(ACOMPANHAMENTO=\"BM\",\"MEMÓRIA DE CÁLCULO\",\"PLQ - PLANILHA DE LEVANTAMENTO DE QUANTIDADES\")","v":"MEMÓRIA DE CÁLCULO"},null,null,null,null,null,null,null,null,null,null,"Grau de Sigilo",null,null,null,null,null,null,null,"Grau de Sigilo"]
[null,null,null,null,null,{"$f":"IF(ACOMPANHAMENTO=\"BM\",\"\",\"Memória de Cálculo\")&\" - \"&import.recurso","v":" - OGU"},null,null,null,null,null,null,null,null,null,null,"#PUBLICO",null,null,null,null,null,null,null,"#PUBLICO"]
[null,null,null,null,null,null,null,null,null,null,null,null,null,null,null,null,null,null,null,null,null,null,null,null,null,null,null,{"$f":"ROUND(ROUND(OFFSET(#REF!,0,AB$13),15-13*ORÇAMENTO!$AF$7)*OFFSET(ORÇAMENTO!$W$15,ROW(#REF!)-ROW(AB$15),0),15-13*ORÇAMENTO!$AF$11)","v":{"$error":"#REF!"}},{"$f":"ROUND(ROUND(OFFSET(#REF!,0,AC$13),15-13*ORÇAMENTO!$AF$7)*OFFSET(ORÇAMENTO!$W$15,ROW(#REF!)-ROW(AC$15),0),15-13*ORÇAMENTO!$AF$11)","v":{"$error":"#REF!"}},{"$f":"ROUND(ROUND(OFFSET(#REF!,0,AD$13),15-13*ORÇAMENTO!$AF$7)*OFFSET(ORÇAMENTO!$W$15,ROW(#REF!)-ROW(AD$15),0),15-13*ORÇAMENTO!$AF$11)","v":{"$error":"#REF!"}},{"$f":"SUM(AB3:AD3)-SUM(#REF!)","v":{"$error":"#REF!"}}]
[null,null,null,null,"APELIDO DO EMPREENDIMENTO",null,"Nº TransfereGOV",null,"Nº OPERAÇÃO",null,"PROPONENTE / TOMADOR",null,null,null,null,null,null,null,"Nº OPERAÇÃO",null,"PROPONENTE / TOMADOR"]
[null,null,null,null,{"$f":"Import.Apelido","v":"INFRAESTRUTURA EMEI PORTAL DAS FLORES"},null,{"$f":"Import.TransfereGOV","v":"02829/2024"},null,{"$f":"Import.CR","v":"109437911"},null,{"$f":"Import.Proponente","v":"PREFEITURA MUNICIPAL DE TRAMANDAÍ "},null,null,null,null,null,null,null,{"$f":"Import.CR","v":"109437911"},null,{"$f":"Import.Proponente","v":"PREFEITURA MUNICIPAL DE TRAMANDAÍ "}]
[null,null,null,null,null,null,null,null,null,null,null,null,null,null,null,null,null,null,null,{"$f":"AE3","v":{"$error":"#REF!"}},null,null,null,null,null,null,null,"Preços dos serviços por frente",null,null,null,null,null,null,null,null,null,null,"Mês do cronograma",null,null,null,null,null,null,null,null,null,null,"Número da Medição"]
[]
[]
[]
[]
[]
[{"$f":"IF(OFFSET(EVENTOS!$C$5,1,0)=\"Automática, conforme os agrupadores Nível 4 do Orçamento\",4,IF(OFFSET(EVENTOS!$C$5,1,0)=\"Automática, conforme os agrupadores Nível 3 do Orçamento\",3,IF(OFFSET(EVENTOS!$C$5,1,0)=\"Definir Manualmente\",\"Manual\",2)))","v":2},"Empty",null,null,null,null,null,null,null,".","Nº AGRUPADOR DE EVENTOS",".",{"$f":"IF(ACOMPANHAMENTO=\"BM\",0,COUNTIF(M15:M34,0))","v":0},"FRENTES DE OBRA:",null,".",null,null,null,null,null,null,null,null,null,null,".",{"$f":"OFFSET($P$12,0,AB$13)","v":0},{"$f":"OFFSET($P$12,0,AC$13)","v":0},0,0,0,0,0,0,0,0,null,{"$f":"OFFSET($P$12,0,AM$13)","v":0},{"$f":"OFFSET($P$12,0,AN$13)","v":0},0,0,0,0,0,0,0,0,null,{"$f":"OFFSET($P$12,0,AX$13)","v":0},{"$f":"OFFSET($P$12,0,AY$13)","v":0},0,0,0,0,0,0,0,0]
["AUTOEVENTO","Empty",null,"Nível","Item","Descrição","Unidade","Quantidade","Memória de Cálculo",null,"Nº",null,"# Evento","Agrupador de Eventos",{"$f":"OFFSET(O13,0,-1)+1","v":{"$error":"#VALUE!"}},null,{"$f":"OFFSET(Q13,0,-1)+1","v":1},2,3,4,5,6,7,8,9,10,null,{"$f":"OFFSET(AB13,0,-1)+1","v":1},2,3,4,5,6,7,8,9,10,null,1,2,3,4,5,6,7,8,9,10,null,1,2,3,4,5,6,7,8,9,10]
[{"$f":"IF(AUTOEVENTO=\"Manual\",IF(K14<>\"\",MIN(VALUE(LEFT(K14,FIND(\".\",K14)-1)),COUNTA(EVENTOS.Lista)),0),IF(OR($B14>AUTOEVENTO,$B14=\"S\",$B14=0),SUBSTITUTE(OFFSET($A14,-1,0),IF($D14=\"Serviço\",\".\",\"\"),\"\"),ROW(A14)-ROW($A$15)&\".\"))","v":"AUTOEVENTO"},{"$f":"OFFSET(ORÇAMENTO!C$15,ROW(B14)-ROW(B$15),0)","v":"S"},{"$f":"OFFSET(ORÇAMENTO!L$15,ROW(C14)-ROW(C$15),0)","v":""},{"$f":"OFFSET(ORÇAMENTO!N$15,ROW(D14)-ROW(D$15),0)","v":"Serviço"},{"$f":"OFFSET(ORÇAMENTO!O$15,ROW(E14)-ROW(E$15),0)","v":"-"},{"$f":"OFFSET(ORÇAMENTO!R$15,ROW(F14)-ROW(F$15),0)","v":"(Sem Código)"},{"$f":"IF($D14<>\"Serviço\",\"\",OFFSET(ORÇAMENTO!S$15,ROW(G14)-ROW(G$15),0))","v":"-"},{"$f":"IF($D14<>\"Serviço\",0,IF(ACOMPANHAMENTO=\"BM\",ROUND(OFFSET(ORÇAMENTO!AJ$15,ROW(H14)-ROW(H$15),0),15-13*ORÇAMENTO!$AF$7),SUMPRODUCT(($Q$12:$AA$12<>\"\")*ROUND($Q14:$AA14,15-13*ORÇAMENTO!$AF$7))))","v":0},null,null,null,".",{"$f":"IF($D14<>\"Serviço\",\"\",IF(AUTOEVENTO=\"manual\",$A14,IF(ISERROR(MATCH($A14,$A$15:OFFSET($A14,-1,0),0)),MAX($M$15:OFFSET(M14,-1,0))+1,INDEX($M$15:OFFSET(M14,-1,0),MATCH($A14,$A$15:OFFSET($A14,-1,0),0)))))","v":"# Evento"},{"$f":"IF($D14<>\"Serviço\",\"\",IF(AUTOEVENTO=\"Manual\",IF($A14=0,\"<-- defina o número do agrupador\",OFFSET(EVENTOS!$D$14,$A14,0)),OFFSET($F$15,$A14,0)))","v":{"$error":"#VALUE!"}},null,null,null,null,null,null,null,null,null,null,null,null,null,{"$f":"IF(AND($D14=\"Serviço\",AB$12<>0,$H14>0,OR(AUTOEVENTO<>\"manual\",$M14<>1)),\nIF(Import.TipoArredondamento<>\"TransfereGOV\",\nROUND(OFFSET($P14,0,AB$13),15-13*ORÇAMENTO!$AF$7)/$H14*OFFSET(ORÇAMENTO!$X$15,ROW(AB14)-ROW(AB$15),0),\nROUND(ROUND(OFFSET($P14,0,AB$13),15-13*ORÇAMENTO!$AF$7)*OFFSET(ORÇAMENTO!$W$15,ROW(AB14)-ROW(AB$15),0),15-13*ORÇAMENTO!$AF$11)),0)","v":0},{"$f":"IF(AND($D14=\"Serviço\",AC$12<>0,$H14>0,OR(AUTOEVENTO<>\"manual\",$M14<>1)),\nIF(Import.TipoArredondamento<>\"TransfereGOV\",\nROUND(OFFSET($P14,0,AC$13),15-13*ORÇAMENTO!$AF$7)/$H14*OFFSET(ORÇAMENTO!$X$15,ROW(AC14)-ROW(AC$15),0),\nROUND(ROUND(OFFSET($P14,0,AC$13),15-13*ORÇAMENTO!$AF$7)*OFFSET(ORÇAMENTO!$W$15,ROW(AC14)-ROW(AC$15),0),15-13*ORÇAMENTO!$AF$11)),0)","v":0},{"$f":"IF(AND($D14=\"Serviço\",AD$12<>0,$H14>0,OR(AUTOEVENTO<>\"manual\",$M14<>1)),\nIF(Import.TipoArredondamento<>\"TransfereGOV\",\nROUND(OFFSET($P14,0,AD$13),15-13*ORÇAMENTO!$AF$7)/$H14*OFFSET(ORÇAMENTO!$X$15,ROW(AD14)-ROW(AD$15),0),\nROUND(ROUND(OFFSET($P14,0,AD$13),15-13*ORÇAMENTO!$AF$7)*OFFSET(ORÇAMENTO!$W$15,ROW(AD14)-ROW(AD$15),0),15-13*ORÇAMENTO!$AF$11)),0)","v":0},{"$f":"IF(AND($D14=\"Serviço\",AE$12<>0,$H14>0,OR(AUTOEVENTO<>\"manual\",$M14<>1)),\nIF(Import.TipoArredondamento<>\"TransfereGOV\",\nROUND(OFFSET($P14,0,AE$13),15-13*ORÇAMENTO!$AF$7)/$H14*OFFSET(ORÇAMENTO!$X$15,ROW(AE14)-ROW(AE$15),0),\nROUND(ROUND(OFFSET($P14,0,AE$13),15-13*ORÇAMENTO!$AF$7)*OFFSET(ORÇAMENTO!$W$15,ROW(AE14)-ROW(AE$15),0),15-13*ORÇAMENTO!$AF$11)),0)","v":0},{"$f":"IF(AND($D14=\"Serviço\",AF$12<>0,$H14>0,OR(AUTOEVENTO<>\"manual\",$M14<>1)),\nIF(Import.TipoArredondamento<>\"TransfereGOV\",\nROUND(OFFSET($P14,0,AF$13),15-13*ORÇAMENTO!$AF$7)/$H14*OFFSET(ORÇAMENTO!$X$15,ROW(AF14)-ROW(AF$15),0),\nROUND(ROUND(OFFSET($P14,0,AF$13),15-13*ORÇAMENTO!$AF$7)*OFFSET(ORÇAMENTO!$W$15,ROW(AF14)-ROW(AF$15),0),15-13*ORÇAMENTO!$AF$11)),0)","v":0},{"$f":"IF(AND($D14=\"Serviço\",AG$12<>0,$H14>0,OR(AUTOEVENTO<>\"manual\",$M14<>1)),\nIF(Import.TipoArredondamento<>\"TransfereGOV\",\nROUND(OFFSET($P14,0,AG$13),15-13*ORÇAMENTO!$AF$7)/$H14*OFFSET(ORÇAMENTO!$X$15,ROW(AG14)-ROW(AG$15),0),\nROUND(ROUND(OFFSET($P14,0,AG$13),15-13*ORÇAMENTO!$AF$7)*OFFSET(ORÇAMENTO!$W$15,ROW(AG14)-ROW(AG$15),0),15-13*ORÇAMENTO!$AF$11)),0)","v":0},{"$f":"IF(AND($D14=\"Serviço\",AH$12<>0,$H14>0,OR(AUTOEVENTO<>\"manual\",$M14<>1)),\nIF(Import.TipoArredondamento<>\"TransfereGOV\",\nROUND(OFFSET($P14,0,AH$13),15-13*ORÇAMENTO!$AF$7)/$H14*OFFSET(ORÇAMENTO!$X$15,ROW(AH14)-ROW(AH$15),0),\nROUND(ROUND(OFFSET($P14,0,AH$13),15-13*ORÇAMENTO!$AF$7)*OFFSET(ORÇAMENTO!$W$15,ROW(AH14)-ROW(AH$15),0),15-13*ORÇAMENTO!$AF$11)),0)","v":0},{"$f":"IF(AND($D14=\"Serviço\",AI$12<>0,$H14>0,OR(AUTOEVENTO<>\"manual\",$M14<>1)),\nIF(Import.TipoArredondamento<>\"TransfereGOV\",\nROUND(OFFSET($P14,0,AI$13),15-13*ORÇAMENTO!$AF$7)/$H14*OFFSET(ORÇAMENTO!$X$15,ROW(AI14)-ROW(AI$15),0),\nROUND(ROUND(OFFSET($P14,0,AI$13),15-13*ORÇAMENTO!$AF$7)*OFFSET(ORÇAMENTO!$W$15,ROW(AI14)-ROW(AI$15),0),15-13*ORÇAMENTO!$AF$11)),0)","v":0},{"$f":"IF(AND($D14=\"Serviço\",AJ$12<>0,$H14>0,OR(AUTOEVENTO<>\"manual\",$M14<>1)),\nIF(Import.TipoArredondamento<>\"TransfereGOV\",\nROUND(OFFSET($P14,0,AJ$13),15-13*ORÇAMENTO!$AF$7)/$H14*OFFSET(ORÇAMENTO!$X$15,ROW(AJ14)-ROW(AJ$15),0),\nROUND(ROUND(OFFSET($P14,0,AJ$13),15-13*ORÇAMENTO!$AF$7)*OFFSET(ORÇAMENTO!$W$15,ROW(AJ14)-ROW(AJ$15),0),15-13*ORÇAMENTO!$AF$11)),0)","v":0},{"$f":"IF(AND($D14=\"Serviço\",AK$12<>0,$H14>0,OR(AUTOEVENTO<>\"manual\",$M14<>1)),\nIF(Import.TipoArredondamento<>\"TransfereGOV\",\nROUND(OFFSET($P14,0,AK$13),15-13*ORÇAMENTO!$AF$7)/$H14*OFFSET(ORÇAMENTO!$X$15,ROW(AK14)-ROW(AK$15),0),\nROUND(ROUND(OFFSET($P14,0,AK$13),15-13*ORÇAMENTO!$AF$7)*OFFSET(ORÇAMENTO!$W$15,ROW(AK14)-ROW(AK$15),0),15-13*ORÇAMENTO!$AF$11)),0)","v":0},null,{"$f":"IF($D14<>\"Serviço\",0,IF(AND(AUTOEVENTO=\"Manual\",$M14=1),0,IF(OFFSET(CRONOPLE!$F$14,$M14,AM$13)=\"\",10^12,OFFSET(CRONOPLE!$F$14,$M14,AM$13))))","v":{"$error":"#VALUE!"}},{"$f":"IF($D14<>\"Serviço\",0,IF(AND(AUTOEVENTO=\"Manual\",$M14=1),0,IF(OFFSET(CRONOPLE!$F$14,$M14,AN$13)=\"\",10^12,OFFSET(CRONOPLE!$F$14,$M14,AN$13))))","v":{"$error":"#VALUE!"}},{"$f":"IF($D14<>\"Serviço\",0,IF(AND(AUTOEVENTO=\"Manual\",$M14=1),0,IF(OFFSET(CRONOPLE!$F$14,$M14,AO$13)=\"\",10^12,OFFSET(CRONOPLE!$F$14,$M14,AO$13))))","v":{"$error":"#VALUE!"}},{"$f":"IF($D14<>\"Serviço\",0,IF(AND(AUTOEVENTO=\"Manual\",$M14=1),0,IF(OFFSET(CRONOPLE!$F$14,$M14,AP$13)=\"\",10^12,OFFSET(CRONOPLE!$F$14,$M14,AP$13))))","v":{"$error":"#VALUE!"}},{"$f":"IF($D14<>\"Serviço\",0,IF(AND(AUTOEVENTO=\"Manual\",$M14=1),0,IF(OFFSET(CRONOPLE!$F$14,$M14,AQ$13)=\"\",10^12,OFFSET(CRONOPLE!$F$14,$M14,AQ$13))))","v":{"$error":"#VALUE!"}},{"$f":"IF($D14<>\"Serviço\",0,IF(AND(AUTOEVENTO=\"Manual\",$M14=1),0,IF(OFFSET(CRONOPLE!$F$14,$M14,AR$13)=\"\",10^12,OFFSET(CRONOPLE!$F$14,$M14,AR$13))))","v":{"$error":"#VALUE!"}},{"$f":"IF($D14<>\"Serviço\",0,IF(AND(AUTOEVENTO=\"Manual\",$M14=1),0,IF(OFFSET(CRONOPLE!$F$14,$M14,AS$13)=\"\",10^12,OFFSET(CRONOPLE!$F$14,$M14,AS$13))))","v":{"$error":"#VALUE!"}},{"$f":"IF($D14<>\"Serviço\",0,IF(AND(AUTOEVENTO=\"Manual\",$M14=1),0,IF(OFFSET(CRONOPLE!$F$14,$M14,AT$13)=\"\",10^12,OFFSET(CRONOPLE!$F$14,$M14,AT$13))))","v":{"$error":"#VALUE!"}},{"$f":"IF($D14<>\"Serviço\",0,IF(AND(AUTOEVENTO=\"Manual\",$M14=1),0,IF(OFFSET(CRONOPLE!$F$14,$M14,AU$13)=\"\",10^12,OFFSET(CRONOPLE!$F$14,$M14,AU$13))))","v":{"$error":"#VALUE!"}},{"$f":"IF($D14<>\"Serviço\",0,IF(AND(AUTOEVENTO=\"Manual\",$M14=1),0,IF(OFFSET(CRONOPLE!$F$14,$M14,AV$13)=\"\",10^12,OFFSET(CRONOPLE!$F$14,$M14,AV$13))))","v":{"$error":"#VALUE!"}},null,{"$f":"IF($D14<>\"Serviço\",0,IF(OR(AND(AUTOEVENTO=\"Manual\",$M14=1),$M14>(ROW(PLE.lastrow)-ROW(PLE.firstrow))),0,IF(OFFSET(PLE!$G$14,$M14,AX$13)=\"\",10^12,OFFSET(PLE!$G$14,$M14,AX$13))))","v":0},{"$f":"IF($D14<>\"Serviço\",0,IF(OR(AND(AUTOEVENTO=\"Manual\",$M14=1),$M14>(ROW(PLE.lastrow)-ROW(PLE.firstrow))),0,IF(OFFSET(PLE!$G$14,$M14,AY$13)=\"\",10^12,OFFSET(PLE!$G$14,$M14,AY$13))))","v":0},{"$f":"IF($D14<>\"Serviço\",0,IF(OR(AND(AUTOEVENTO=\"Manual\",$M14=1),$M14>(ROW(PLE.lastrow)-ROW(PLE.firstrow))),0,IF(OFFSET(PLE!$G$14,$M14,AZ$13)=\"\",10^12,OFFSET(PLE!$G$14,$M14,AZ$13))))","v":0},{"$f":"IF($D14<>\"Serviço\",0,IF(OR(AND(AUTOEVENTO=\"Manual\",$M14=1),$M14>(ROW(PLE.lastrow)-ROW(PLE.firstrow))),0,IF(OFFSET(PLE!$G$14,$M14,BA$13)=\"\",10^12,OFFSET(PLE!$G$14,$M14,BA$13))))","v":0},{"$f":"IF($D14<>\"Serviço\",0,IF(OR(AND(AUTOEVENTO=\"Manual\",$M14=1),$M14>(ROW(PLE.lastrow)-ROW(PLE.firstrow))),0,IF(OFFSET(PLE!$G$14,$M14,BB$13)=\"\",10^12,OFFSET(PLE!$G$14,$M14,BB$13))))","v":0},{"$f":"IF($D14<>\"Serviço\",0,IF(OR(AND(AUTOEVENTO=\"Manual\",$M14=1),$M14>(ROW(PLE.lastrow)-ROW(PLE.firstrow))),0,IF(OFFSET(PLE!$G$14,$M14,BC$13)=\"\",10^12,OFFSET(PLE!$G$14,$M14,BC$13))))","v":0},{"$f":"IF($D14<>\"Serviço\",0,IF(OR(AND(AUTOEVENTO=\"Manual\",$M14=1),$M14>(ROW(PLE.lastrow)-ROW(PLE.firstrow))),0,IF(OFFSET(PLE!$G$14,$M14,BD$13)=\"\",10^12,OFFSET(PLE!$G$14,$M14,BD$13))))","v":0},{"$f":"IF($D14<>\"Serviço\",0,IF(OR(AND(AUTOEVENTO=\"Manual\",$M14=1),$M14>(ROW(PLE.lastrow)-ROW(PLE.firstrow))),0,IF(OFFSET(PLE!$G$14,$M14,BE$13)=\"\",10^12,OFFSET(PLE!$G$14,$M14,BE$13))))","v":0},{"$f":"IF($D14<>\"Serviço\",0,IF(OR(AND(AUTOEVENTO=\"Manual\",$M14=1),$M14>(ROW(PLE.lastrow)-ROW(PLE.firstrow))),0,IF(OFFSET(PLE!$G$14,$M14,BF$13)=\"\",10^12,OFFSET(PLE!$G$14,$M14,BF$13))))","v":0},{"$f":"IF($D14<>\"Serviço\",0,IF(OR(AND(AUTOEVENTO=\"Manual\",$M14=1),$M14>(ROW(PLE.lastrow)-ROW(PLE.firstrow))),0,IF(OFFSET(PLE!$G$14,$M14,BG$13)=\"\",10^12,OFFSET(PLE!$G$14,$M14,BG$13))))","v":0}]
[null,{"$f":"OFFSET(ORÇAMENTO!C$15,ROW(B15)-ROW(B$15),0)","v":"L"},{"$f":"OFFSET(ORÇAMENTO!L$15,ROW(C15)-ROW(C$15),0)","v":"F"},{"$f":"IF(TIPOORCAMENTO=\"LICITADO\",\"CTEF\",\"LOTE\")","v":"LOTE"},{"$f":"Import.DescLote","v":"CONSTRUÇÃO DA EMEI PORTAL DAS FLORES"},null,null,null,null,null,null,".",{"$f":"IF(AUTOEVENTO=\"MANUAL\",0,1)","v":1},"TOTAL FINANC. POR FRENTE (R$):",{"$f":"OFFSET($AA$15,0,O$13)","v":{"$error":"#VALUE!"}},null,{"$f":"OFFSET($AA$15,0,Q$13)","v":0},0,0,0,0,0,0,0,0,0,null,{"$f":"ROUND(SUM(OFFSET(AB$15,1,0):AB$34),2)","v":0},{"$f":"SUM(OFFSET(AC$15,1,0):AC$34)","v":0},{"$f":"SUM(OFFSET(AD$15,1,0):AD$34)","v":0},{"$f":"SUM(OFFSET(AE$15,1,0):AE$34)","v":0},{"$f":"SUM(OFFSET(AF$15,1,0):AF$34)","v":0},{"$f":"SUM(OFFSET(AG$15,1,0):AG$34)","v":0},{"$f":"SUM(OFFSET(AH$15,1,0):AH$34)","v":0},{"$f":"SUM(OFFSET(AI$15,1,0):AI$34)","v":0},{"$f":"SUM(OFFSET(AJ$15,1,0):AJ$34)","v":0},{"$f":"SUM(OFFSET(AK$15,1,0):AK$34)","v":0},null,{"$f":"10^12","v":1000000000000},{"$f":"10^12","v":1000000000000},1000000000000,1000000000000,1000000000000,1000000000000,1000000000000,1000000000000,1000000000000,1000000000000,null,{"$f":"10^12","v":1000000000000},1000000000000,1000000000000,1000000000000,1000000000000,1000000000000,1000000000000,1000000000000,1000000000000,1000000000000]
[{"$f":"IF(AUTOEVENTO=\"Manual\",IF(K16<>\"\",MIN(VALUE(LEFT(K16,FIND(\".\",K16)-1)),COUNTA(EVENTOS.Lista)),0),IF(OR($B16>AUTOEVENTO,$B16=\"S\",$B16=0),SUBSTITUTE(OFFSET($A16,-1,0),IF($D16=\"Serviço\",\".\",\"\"),\"\"),ROW(A16)-ROW($A$15)&\".\"))","v":"1."},{"$f":"OFFSET(ORÇAMENTO!C$15,ROW(B16)-ROW(B$15),0)","v":1},{"$f":"OFFSET(ORÇAMENTO!L$15,ROW(C16)-ROW(C$15),0)","v":"F"},{"$f":"OFFSET(ORÇAMENTO!N$15,ROW(D16)-ROW(D$15),0)","v":"Meta"},{"$f":"OFFSET(ORÇAMENTO!O$15,ROW(E16)-ROW(E$15),0)","v":"1."},{"$f":"OFFSET(ORÇAMENTO!R$15,ROW(F16)-ROW(F$15),0)","v":"PAVIMENTAÇÃO E PAISAGISMO ENTORNO EMEI  PORTAL DAS FLORES"},{"$f":"IF($D16<>\"Serviço\",\"\",OFFSET(ORÇAMENTO!S$15,ROW(G16)-ROW(G$15),0))","v":""},{"$f":"IF($D16<>\"Serviço\",0,IF(ACOMPANHAMENTO=\"BM\",ROUND(OFFSET(ORÇAMENTO!AJ$15,ROW(H16)-ROW(H$15),0),15-13*ORÇAMENTO!$AF$7),SUMPRODUCT(($Q$12:$AA$12<>\"\")*ROUND($Q16:$AA16,15-13*ORÇAMENTO!$AF$7))))","v":0},null,null,null,".",{"$f":"IF($D16<>\"Serviço\",\"\",IF(AUTOEVENTO=\"manual\",$A16,IF(ISERROR(MATCH($A16,$A$15:OFFSET($A16,-1,0),0)),MAX($M$15:OFFSET(M16,-1,0))+1,INDEX($M$15:OFFSET(M16,-1,0),MATCH($A16,$A$15:OFFSET($A16,-1,0),0)))))","v":""},{"$f":"IF($D16<>\"Serviço\",\"\",IF(AUTOEVENTO=\"Manual\",IF($A16=0,\"<-- defina o número do agrupador\",OFFSET(EVENTOS!$D$14,$A16,0)),OFFSET($F$15,$A16,0)))","v":""},null,null,null,null,null,null,null,null,null,null,null,null,null,{"$f":"IF(AND($D16=\"Serviço\",AB$12<>0,$H16>0,OR(AUTOEVENTO<>\"manual\",$M16<>1)),\nIF(Import.TipoArredondamento<>\"TransfereGOV\",\nROUND(OFFSET($P16,0,AB$13),15-13*ORÇAMENTO!$AF$7)/$H16*OFFSET(ORÇAMENTO!$X$15,ROW(AB16)-ROW(AB$15),0),\nROUND(ROUND(OFFSET($P16,0,AB$13),15-13*ORÇAMENTO!$AF$7)*OFFSET(ORÇAMENTO!$W$15,ROW(AB16)-ROW(AB$15),0),15-13*ORÇAMENTO!$AF$11)),0)","v":0},{"$f":"IF(AND($D16=\"Serviço\",AC$12<>0,$H16>0,OR(AUTOEVENTO<>\"manual\",$M16<>1)),\nIF(Import.TipoArredondamento<>\"TransfereGOV\",\nROUND(OFFSET($P16,0,AC$13),15-13*ORÇAMENTO!$AF$7)/$H16*OFFSET(ORÇAMENTO!$X$15,ROW(AC16)-ROW(AC$15),0),\nROUND(ROUND(OFFSET($P16,0,AC$13),15-13*ORÇAMENTO!$AF$7)*OFFSET(ORÇAMENTO!$W$15,ROW(AC16)-ROW(AC$15),0),15-13*ORÇAMENTO!$AF$11)),0)","v":0},{"$f":"IF(AND($D16=\"Serviço\",AD$12<>0,$H16>0,OR(AUTOEVENTO<>\"manual\",$M16<>1)),\nIF(Import.TipoArredondamento<>\"TransfereGOV\",\nROUND(OFFSET($P16,0,AD$13),15-13*ORÇAMENTO!$AF$7)/$H16*OFFSET(ORÇAMENTO!$X$15,ROW(AD16)-ROW(AD$15),0),\nROUND(ROUND(OFFSET($P16,0,AD$13),15-13*ORÇAMENTO!$AF$7)*OFFSET(ORÇAMENTO!$W$15,ROW(AD16)-ROW(AD$15),0),15-13*ORÇAMENTO!$AF$11)),0)","v":0},{"$f":"IF(AND($D16=\"Serviço\",AE$12<>0,$H16>0,OR(AUTOEVENTO<>\"manual\",$M16<>1)),\nIF(Import.TipoArredondamento<>\"TransfereGOV\",\nROUND(OFFSET($P16,0,AE$13),15-13*ORÇAMENTO!$AF$7)/$H16*OFFSET(ORÇAMENTO!$X$15,ROW(AE16)-ROW(AE$15),0),\nROUND(ROUND(OFFSET($P16,0,AE$13),15-13*ORÇAMENTO!$AF$7)*OFFSET(ORÇAMENTO!$W$15,ROW(AE16)-ROW(AE$15),0),15-13*ORÇAMENTO!$AF$11)),0)","v":0},{"$f":"IF(AND($D16=\"Serviço\",AF$12<>0,$H16>0,OR(AUTOEVENTO<>\"manual\",$M16<>1)),\nIF(Import.TipoArredondamento<>\"TransfereGOV\",\nROUND(OFFSET($P16,0,AF$13),15-13*ORÇAMENTO!$AF$7)/$H16*OFFSET(ORÇAMENTO!$X$15,ROW(AF16)-ROW(AF$15),0),\nROUND(ROUND(OFFSET($P16,0,AF$13),15-13*ORÇAMENTO!$AF$7)*OFFSET(ORÇAMENTO!$W$15,ROW(AF16)-ROW(AF$15),0),15-13*ORÇAMENTO!$AF$11)),0)","v":0},{"$f":"IF(AND($D16=\"Serviço\",AG$12<>0,$H16>0,OR(AUTOEVENTO<>\"manual\",$M16<>1)),\nIF(Import.TipoArredondamento<>\"TransfereGOV\",\nROUND(OFFSET($P16,0,AG$13),15-13*ORÇAMENTO!$AF$7)/$H16*OFFSET(ORÇAMENTO!$X$15,ROW(AG16)-ROW(AG$15),0),\nROUND(ROUND(OFFSET($P16,0,AG$13),15-13*ORÇAMENTO!$AF$7)*OFFSET(ORÇAMENTO!$W$15,ROW(AG16)-ROW(AG$15),0),15-13*ORÇAMENTO!$AF$11)),0)","v":0},{"$f":"IF(AND($D16=\"Serviço\",AH$12<>0,$H16>0,OR(AUTOEVENTO<>\"manual\",$M16<>1)),\nIF(Import.TipoArredondamento<>\"TransfereGOV\",\nROUND(OFFSET($P16,0,AH$13),15-13*ORÇAMENTO!$AF$7)/$H16*OFFSET(ORÇAMENTO!$X$15,ROW(AH16)-ROW(AH$15),0),\nROUND(ROUND(OFFSET($P16,0,AH$13),15-13*ORÇAMENTO!$AF$7)*OFFSET(ORÇAMENTO!$W$15,ROW(AH16)-ROW(AH$15),0),15-13*ORÇAMENTO!$AF$11)),0)","v":0},{"$f":"IF(AND($D16=\"Serviço\",AI$12<>0,$H16>0,OR(AUTOEVENTO<>\"manual\",$M16<>1)),\nIF(Import.TipoArredondamento<>\"TransfereGOV\",\nROUND(OFFSET($P16,0,AI$13),15-13*ORÇAMENTO!$AF$7)/$H16*OFFSET(ORÇAMENTO!$X$15,ROW(AI16)-ROW(AI$15),0),\nROUND(ROUND(OFFSET($P16,0,AI$13),15-13*ORÇAMENTO!$AF$7)*OFFSET(ORÇAMENTO!$W$15,ROW(AI16)-ROW(AI$15),0),15-13*ORÇAMENTO!$AF$11)),0)","v":0},{"$f":"IF(AND($D16=\"Serviço\",AJ$12<>0,$H16>0,OR(AUTOEVENTO<>\"manual\",$M16<>1)),\nIF(Import.TipoArredondamento<>\"TransfereGOV\",\nROUND(OFFSET($P16,0,AJ$13),15-13*ORÇAMENTO!$AF$7)/$H16*OFFSET(ORÇAMENTO!$X$15,ROW(AJ16)-ROW(AJ$15),0),\nROUND(ROUND(OFFSET($P16,0,AJ$13),15-13*ORÇAMENTO!$AF$7)*OFFSET(ORÇAMENTO!$W$15,ROW(AJ16)-ROW(AJ$15),0),15-13*ORÇAMENTO!$AF$11)),0)","v":0},{"$f":"IF(AND($D16=\"Serviço\",AK$12<>0,$H16>0,OR(AUTOEVENTO<>\"manual\",$M16<>1)),\nIF(Import.TipoArredondamento<>\"TransfereGOV\",\nROUND(OFFSET($P16,0,AK$13),15-13*ORÇAMENTO!$AF$7)/$H16*OFFSET(ORÇAMENTO!$X$15,ROW(AK16)-ROW(AK$15),0),\nROUND(ROUND(OFFSET($P16,0,AK$13),15-13*ORÇAMENTO!$AF$7)*OFFSET(ORÇAMENTO!$W$15,ROW(AK16)-ROW(AK$15),0),15-13*ORÇAMENTO!$AF$11)),0)","v":0},null,{"$f":"IF($D16<>\"Serviço\",0,IF(AND(AUTOEVENTO=\"Manual\",$M16=1),0,IF(OFFSET(CRONOPLE!$F$14,$M16,AM$13)=\"\",10^12,OFFSET(CRONOPLE!$F$14,$M16,AM$13))))","v":0},{"$f":"IF($D16<>\"Serviço\",0,IF(AND(AUTOEVENTO=\"Manual\",$M16=1),0,IF(OFFSET(CRONOPLE!$F$14,$M16,AN$13)=\"\",10^12,OFFSET(CRONOPLE!$F$14,$M16,AN$13))))","v":0},{"$f":"IF($D16<>\"Serviço\",0,IF(AND(AUTOEVENTO=\"Manual\",$M16=1),0,IF(OFFSET(CRONOPLE!$F$14,$M16,AO$13)=\"\",10^12,OFFSET(CRONOPLE!$F$14,$M16,AO$13))))","v":0},{"$f":"IF($D16<>\"Serviço\",0,IF(AND(AUTOEVENTO=\"Manual\",$M16=1),0,IF(OFFSET(CRONOPLE!$F$14,$M16,AP$13)=\"\",10^12,OFFSET(CRONOPLE!$F$14,$M16,AP$13))))","v":0},{"$f":"IF($D16<>\"Serviço\",0,IF(AND(AUTOEVENTO=\"Manual\",$M16=1),0,IF(OFFSET(CRONOPLE!$F$14,$M16,AQ$13)=\"\",10^12,OFFSET(CRONOPLE!$F$14,$M16,AQ$13))))","v":0},{"$f":"IF($D16<>\"Serviço\",0,IF(AND(AUTOEVENTO=\"Manual\",$M16=1),0,IF(OFFSET(CRONOPLE!$F$14,$M16,AR$13)=\"\",10^12,OFFSET(CRONOPLE!$F$14,$M16,AR$13))))","v":0},{"$f":"IF($D16<>\"Serviço\",0,IF(AND(AUTOEVENTO=\"Manual\",$M16=1),0,IF(OFFSET(CRONOPLE!$F$14,$M16,AS$13)=\"\",10^12,OFFSET(CRONOPLE!$F$14,$M16,AS$13))))","v":0},{"$f":"IF($D16<>\"Serviço\",0,IF(AND(AUTOEVENTO=\"Manual\",$M16=1),0,IF(OFFSET(CRONOPLE!$F$14,$M16,AT$13)=\"\",10^12,OFFSET(CRONOPLE!$F$14,$M16,AT$13))))","v":0},{"$f":"IF($D16<>\"Serviço\",0,IF(AND(AUTOEVENTO=\"Manual\",$M16=1),0,IF(OFFSET(CRONOPLE!$F$14,$M16,AU$13)=\"\",10^12,OFFSET(CRONOPLE!$F$14,$M16,AU$13))))","v":0},{"$f":"IF($D16<>\"Serviço\",0,IF(AND(AUTOEVENTO=\"Manual\",$M16=1),0,IF(OFFSET(CRONOPLE!$F$14,$M16,AV$13)=\"\",10^12,OFFSET(CRONOPLE!$F$14,$M16,AV$13))))","v":0},null,{"$f":"IF($D16<>\"Serviço\",0,IF(OR(AND(AUTOEVENTO=\"Manual\",$M16=1),$M16>(ROW(PLE.lastrow)-ROW(PLE.firstrow))),0,IF(OFFSET(PLE!$G$14,$M16,AX$13)=\"\",10^12,OFFSET(PLE!$G$14,$M16,AX$13))))","v":0},{"$f":"IF($D16<>\"Serviço\",0,IF(OR(AND(AUTOEVENTO=\"Manual\",$M16=1),$M16>(ROW(PLE.lastrow)-ROW(PLE.firstrow))),0,IF(OFFSET(PLE!$G$14,$M16,AY$13)=\"\",10^12,OFFSET(PLE!$G$14,$M16,AY$13))))","v":0},{"$f":"IF($D16<>\"Serviço\",0,IF(OR(AND(AUTOEVENTO=\"Manual\",$M16=1),$M16>(ROW(PLE.lastrow)-ROW(PLE.firstrow))),0,IF(OFFSET(PLE!$G$14,$M16,AZ$13)=\"\",10^12,OFFSET(PLE!$G$14,$M16,AZ$13))))","v":0},{"$f":"IF($D16<>\"Serviço\",0,IF(OR(AND(AUTOEVENTO=\"Manual\",$M16=1),$M16>(ROW(PLE.lastrow)-ROW(PLE.firstrow))),0,IF(OFFSET(PLE!$G$14,$M16,BA$13)=\"\",10^12,OFFSET(PLE!$G$14,$M16,BA$13))))","v":0},{"$f":"IF($D16<>\"Serviço\",0,IF(OR(AND(AUTOEVENTO=\"Manual\",$M16=1),$M16>(ROW(PLE.lastrow)-ROW(PLE.firstrow))),0,IF(OFFSET(PLE!$G$14,$M16,BB$13)=\"\",10^12,OFFSET(PLE!$G$14,$M16,BB$13))))","v":0},{"$f":"IF($D16<>\"Serviço\",0,IF(OR(AND(AUTOEVENTO=\"Manual\",$M16=1),$M16>(ROW(PLE.lastrow)-ROW(PLE.firstrow))),0,IF(OFFSET(PLE!$G$14,$M16,BC$13)=\"\",10^12,OFFSET(PLE!$G$14,$M16,BC$13))))","v":0},{"$f":"IF($D16<>\"Serviço\",0,IF(OR(AND(AUTOEVENTO=\"Manual\",$M16=1),$M16>(ROW(PLE.lastrow)-ROW(PLE.firstrow))),0,IF(OFFSET(PLE!$G$14,$M16,BD$13)=\"\",10^12,OFFSET(PLE!$G$14,$M16,BD$13))))","v":0},{"$f":"IF($D16<>\"Serviço\",0,IF(OR(AND(AUTOEVENTO=\"Manual\",$M16=1),$M16>(ROW(PLE.lastrow)-ROW(PLE.firstrow))),0,IF(OFFSET(PLE!$G$14,$M16,BE$13)=\"\",10^12,OFFSET(PLE!$G$14,$M16,BE$13))))","v":0},{"$f":"IF($D16<>\"Serviço\",0,IF(OR(AND(AUTOEVENTO=\"Manual\",$M16=1),$M16>(ROW(PLE.lastrow)-ROW(PLE.firstrow))),0,IF(OFFSET(PLE!$G$14,$M16,BF$13)=\"\",10^12,OFFSET(PLE!$G$14,$M16,BF$13))))","v":0},{"$f":"IF($D16<>\"Serviço\",0,IF(OR(AND(AUTOEVENTO=\"Manual\",$M16=1),$M16>(ROW(PLE.lastrow)-ROW(PLE.firstrow))),0,IF(OFFSET(PLE!$G$14,$M16,BG$13)=\"\",10^12,OFFSET(PLE!$G$14,$M16,BG$13))))","v":0}]
["2.",{"$f":"OFFSET(ORÇAMENTO!C$15,ROW(B17)-ROW(B$15),0)","v":2},{"$f":"OFFSET(ORÇAMENTO!L$15,ROW(C17)-ROW(C$15),0)","v":"F"},{"$f":"OFFSET(ORÇAMENTO!N$15,ROW(D17)-ROW(D$15),0)","v":"Nível 2"},{"$f":"OFFSET(ORÇAMENTO!O$15,ROW(E17)-ROW(E$15),0)","v":"1.1."},{"$f":"OFFSET(ORÇAMENTO!R$15,ROW(F17)-ROW(F$15),0)","v":"SERVIÇOS PRELIMINARES"},{"$f":"IF($D17<>\"Serviço\",\"\",OFFSET(ORÇAMENTO!S$15,ROW(G17)-ROW(G$15),0))","v":""},{"$f":"IF($D17<>\"Serviço\",0,IF(ACOMPANHAMENTO=\"BM\",ROUND(OFFSET(ORÇAMENTO!AJ$15,ROW(H17)-ROW(H$15),0),15-13*ORÇAMENTO!$AF$7),SUMPRODUCT(($Q$12:$AA$12<>\"\")*ROUND($Q17:$AA17,15-13*ORÇAMENTO!$AF$7))))","v":0},null,null,null,".",{"$f":"IF($D17<>\"Serviço\",\"\",IF(AUTOEVENTO=\"manual\",$A17,IF(ISERROR(MATCH($A17,$A$15:OFFSET($A17,-1,0),0)),MAX($M$15:OFFSET(M17,-1,0))+1,INDEX($M$15:OFFSET(M17,-1,0),MATCH($A17,$A$15:OFFSET($A17,-1,0),0)))))","v":""},{"$f":"IF($D17<>\"Serviço\",\"\",IF(AUTOEVENTO=\"Manual\",IF($A17=0,\"<-- defina o número do agrupador\",OFFSET(EVENTOS!$D$14,$A17,0)),OFFSET($F$15,$A17,0)))","v":""},null,null,null,null,null,null,null,null,null,null,null,null,null,{"$f":"IF(AND($D17=\"Serviço\",AB$12<>0,$H17>0,OR(AUTOEVENTO<>\"manual\",$M17<>1)),\nIF(Import.TipoArredondamento<>\"TransfereGOV\",\nROUND(OFFSET($P17,0,AB$13),15-13*ORÇAMENTO!$AF$7)/$H17*OFFSET(ORÇAMENTO!$X$15,ROW(AB17)-ROW(AB$15),0),\nROUND(ROUND(OFFSET($P17,0,AB$13),15-13*ORÇAMENTO!$AF$7)*OFFSET(ORÇAMENTO!$W$15,ROW(AB17)-ROW(AB$15),0),15-13*ORÇAMENTO!$AF$11)),0)","v":0},{"$f":"IF(AND($D17=\"Serviço\",AC$12<>0,$H17>0,OR(AUTOEVENTO<>\"manual\",$M17<>1)),\nIF(Import.TipoArredondamento<>\"TransfereGOV\",\nROUND(OFFSET($P17,0,AC$13),15-13*ORÇAMENTO!$AF$7)/$H17*OFFSET(ORÇAMENTO!$X$15,ROW(AC17)-ROW(AC$15),0),\nROUND(ROUND(OFFSET($P17,0,AC$13),15-13*ORÇAMENTO!$AF$7)*OFFSET(ORÇAMENTO!$W$15,ROW(AC17)-ROW(AC$15),0),15-13*ORÇAMENTO!$AF$11)),0)","v":0},{"$f":"IF(AND($D17=\"Serviço\",AD$12<>0,$H17>0,OR(AUTOEVENTO<>\"manual\",$M17<>1)),\nIF(Import.TipoArredondamento<>\"TransfereGOV\",\nROUND(OFFSET($P17,0,AD$13),15-13*ORÇAMENTO!$AF$7)/$H17*OFFSET(ORÇAMENTO!$X$15,ROW(AD17)-ROW(AD$15),0),\nROUND(ROUND(OFFSET($P17,0,AD$13),15-13*ORÇAMENTO!$AF$7)*OFFSET(ORÇAMENTO!$W$15,ROW(AD17)-ROW(AD$15),0),15-13*ORÇAMENTO!$AF$11)),0)","v":0},{"$f":"IF(AND($D17=\"Serviço\",AE$12<>0,$H17>0,OR(AUTOEVENTO<>\"manual\",$M17<>1)),\nIF(Import.TipoArredondamento<>\"TransfereGOV\",\nROUND(OFFSET($P17,0,AE$13),15-13*ORÇAMENTO!$AF$7)/$H17*OFFSET(ORÇAMENTO!$X$15,ROW(AE17)-ROW(AE$15),0),\nROUND(ROUND(OFFSET($P17,0,AE$13),15-13*ORÇAMENTO!$AF$7)*OFFSET(ORÇAMENTO!$W$15,ROW(AE17)-ROW(AE$15),0),15-13*ORÇAMENTO!$AF$11)),0)","v":0},{"$f":"IF(AND($D17=\"Serviço\",AF$12<>0,$H17>0,OR(AUTOEVENTO<>\"manual\",$M17<>1)),\nIF(Import.TipoArredondamento<>\"TransfereGOV\",\nROUND(OFFSET($P17,0,AF$13),15-13*ORÇAMENTO!$AF$7)/$H17*OFFSET(ORÇAMENTO!$X$15,ROW(AF17)-ROW(AF$15),0),\nROUND(ROUND(OFFSET($P17,0,AF$13),15-13*ORÇAMENTO!$AF$7)*OFFSET(ORÇAMENTO!$W$15,ROW(AF17)-ROW(AF$15),0),15-13*ORÇAMENTO!$AF$11)),0)","v":0},{"$f":"IF(AND($D17=\"Serviço\",AG$12<>0,$H17>0,OR(AUTOEVENTO<>\"manual\",$M17<>1)),\nIF(Import.TipoArredondamento<>\"TransfereGOV\",\nROUND(OFFSET($P17,0,AG$13),15-13*ORÇAMENTO!$AF$7)/$H17*OFFSET(ORÇAMENTO!$X$15,ROW(AG17)-ROW(AG$15),0),\nROUND(ROUND(OFFSET($P17,0,AG$13),15-13*ORÇAMENTO!$AF$7)*OFFSET(ORÇAMENTO!$W$15,ROW(AG17)-ROW(AG$15),0),15-13*ORÇAMENTO!$AF$11)),0)","v":0},{"$f":"IF(AND($D17=\"Serviço\",AH$12<>0,$H17>0,OR(AUTOEVENTO<>\"manual\",$M17<>1)),\nIF(Import.TipoArredondamento<>\"TransfereGOV\",\nROUND(OFFSET($P17,0,AH$13),15-13*ORÇAMENTO!$AF$7)/$H17*OFFSET(ORÇAMENTO!$X$15,ROW(AH17)-ROW(AH$15),0),\nROUND(ROUND(OFFSET($P17,0,AH$13),15-13*ORÇAMENTO!$AF$7)*OFFSET(ORÇAMENTO!$W$15,ROW(AH17)-ROW(AH$15),0),15-13*ORÇAMENTO!$AF$11)),0)","v":0},{"$f":"IF(AND($D17=\"Serviço\",AI$12<>0,$H17>0,OR(AUTOEVENTO<>\"manual\",$M17<>1)),\nIF(Import.TipoArredondamento<>\"TransfereGOV\",\nROUND(OFFSET($P17,0,AI$13),15-13*ORÇAMENTO!$AF$7)/$H17*OFFSET(ORÇAMENTO!$X$15,ROW(AI17)-ROW(AI$15),0),\nROUND(ROUND(OFFSET($P17,0,AI$13),15-13*ORÇAMENTO!$AF$7)*OFFSET(ORÇAMENTO!$W$15,ROW(AI17)-ROW(AI$15),0),15-13*ORÇAMENTO!$AF$11)),0)","v":0},{"$f":"IF(AND($D17=\"Serviço\",AJ$12<>0,$H17>0,OR(AUTOEVENTO<>\"manual\",$M17<>1)),\nIF(Import.TipoArredondamento<>\"TransfereGOV\",\nROUND(OFFSET($P17,0,AJ$13),15-13*ORÇAMENTO!$AF$7)/$H17*OFFSET(ORÇAMENTO!$X$15,ROW(AJ17)-ROW(AJ$15),0),\nROUND(ROUND(OFFSET($P17,0,AJ$13),15-13*ORÇAMENTO!$AF$7)*OFFSET(ORÇAMENTO!$W$15,ROW(AJ17)-ROW(AJ$15),0),15-13*ORÇAMENTO!$AF$11)),0)","v":0},{"$f":"IF(AND($D17=\"Serviço\",AK$12<>0,$H17>0,OR(AUTOEVENTO<>\"manual\",$M17<>1)),\nIF(Import.TipoArredondamento<>\"TransfereGOV\",\nROUND(OFFSET($P17,0,AK$13),15-13*ORÇAMENTO!$AF$7)/$H17*OFFSET(ORÇAMENTO!$X$15,ROW(AK17)-ROW(AK$15),0),\nROUND(ROUND(OFFSET($P17,0,AK$13),15-13*ORÇAMENTO!$AF$7)*OFFSET(ORÇAMENTO!$W$15,ROW(AK17)-ROW(AK$15),0),15-13*ORÇAMENTO!$AF$11)),0)","v":0},null,{"$f":"IF($D17<>\"Serviço\",0,IF(AND(AUTOEVENTO=\"Manual\",$M17=1),0,IF(OFFSET(CRONOPLE!$F$14,$M17,AM$13)=\"\",10^12,OFFSET(CRONOPLE!$F$14,$M17,AM$13))))","v":0},{"$f":"IF($D17<>\"Serviço\",0,IF(AND(AUTOEVENTO=\"Manual\",$M17=1),0,IF(OFFSET(CRONOPLE!$F$14,$M17,AN$13)=\"\",10^12,OFFSET(CRONOPLE!$F$14,$M17,AN$13))))","v":0},{"$f":"IF($D17<>\"Serviço\",0,IF(AND(AUTOEVENTO=\"Manual\",$M17=1),0,IF(OFFSET(CRONOPLE!$F$14,$M17,AO$13)=\"\",10^12,OFFSET(CRONOPLE!$F$14,$M17,AO$13))))","v":0},{"$f":"IF($D17<>\"Serviço\",0,IF(AND(AUTOEVENTO=\"Manual\",$M17=1),0,IF(OFFSET(CRONOPLE!$F$14,$M17,AP$13)=\"\",10^12,OFFSET(CRONOPLE!$F$14,$M17,AP$13))))","v":0},{"$f":"IF($D17<>\"Serviço\",0,IF(AND(AUTOEVENTO=\"Manual\",$M17=1),0,IF(OFFSET(CRONOPLE!$F$14,$M17,AQ$13)=\"\",10^12,OFFSET(CRONOPLE!$F$14,$M17,AQ$13))))","v":0},{"$f":"IF($D17<>\"Serviço\",0,IF(AND(AUTOEVENTO=\"Manual\",$M17=1),0,IF(OFFSET(CRONOPLE!$F$14,$M17,AR$13)=\"\",10^12,OFFSET(CRONOPLE!$F$14,$M17,AR$13))))","v":0},{"$f":"IF($D17<>\"Serviço\",0,IF(AND(AUTOEVENTO=\"Manual\",$M17=1),0,IF(OFFSET(CRONOPLE!$F$14,$M17,AS$13)=\"\",10^12,OFFSET(CRONOPLE!$F$14,$M17,AS$13))))","v":0},{"$f":"IF($D17<>\"Serviço\",0,IF(AND(AUTOEVENTO=\"Manual\",$M17=1),0,IF(OFFSET(CRONOPLE!$F$14,$M17,AT$13)=\"\",10^12,OFFSET(CRONOPLE!$F$14,$M17,AT$13))))","v":0},{"$f":"IF($D17<>\"Serviço\",0,IF(AND(AUTOEVENTO=\"Manual\",$M17=1),0,IF(OFFSET(CRONOPLE!$F$14,$M17,AU$13)=\"\",10^12,OFFSET(CRONOPLE!$F$14,$M17,AU$13))))","v":0},{"$f":"IF($D17<>\"Serviço\",0,IF(AND(AUTOEVENTO=\"Manual\",$M17=1),0,IF(OFFSET(CRONOPLE!$F$14,$M17,AV$13)=\"\",10^12,OFFSET(CRONOPLE!$F$14,$M17,AV$13))))","v":0},null,{"$f":"IF($D17<>\"Serviço\",0,IF(OR(AND(AUTOEVENTO=\"Manual\",$M17=1),$M17>(ROW(PLE.lastrow)-ROW(PLE.firstrow))),0,IF(OFFSET(PLE!$G$14,$M17,AX$13)=\"\",10^12,OFFSET(PLE!$G$14,$M17,AX$13))))","v":0},{"$f":"IF($D17<>\"Serviço\",0,IF(OR(AND(AUTOEVENTO=\"Manual\",$M17=1),$M17>(ROW(PLE.lastrow)-ROW(PLE.firstrow))),0,IF(OFFSET(PLE!$G$14,$M17,AY$13)=\"\",10^12,OFFSET(PLE!$G$14,$M17,AY$13))))","v":0},{"$f":"IF($D17<>\"Serviço\",0,IF(OR(AND(AUTOEVENTO=\"Manual\",$M17=1),$M17>(ROW(PLE.lastrow)-ROW(PLE.firstrow))),0,IF(OFFSET(PLE!$G$14,$M17,AZ$13)=\"\",10^12,OFFSET(PLE!$G$14,$M17,AZ$13))))","v":0},{"$f":"IF($D17<>\"Serviço\",0,IF(OR(AND(AUTOEVENTO=\"Manual\",$M17=1),$M17>(ROW(PLE.lastrow)-ROW(PLE.firstrow))),0,IF(OFFSET(PLE!$G$14,$M17,BA$13)=\"\",10^12,OFFSET(PLE!$G$14,$M17,BA$13))))","v":0},{"$f":"IF($D17<>\"Serviço\",0,IF(OR(AND(AUTOEVENTO=\"Manual\",$M17=1),$M17>(ROW(PLE.lastrow)-ROW(PLE.firstrow))),0,IF(OFFSET(PLE!$G$14,$M17,BB$13)=\"\",10^12,OFFSET(PLE!$G$14,$M17,BB$13))))","v":0},{"$f":"IF($D17<>\"Serviço\",0,IF(OR(AND(AUTOEVENTO=\"Manual\",$M17=1),$M17>(ROW(PLE.lastrow)-ROW(PLE.firstrow))),0,IF(OFFSET(PLE!$G$14,$M17,BC$13)=\"\",10^12,OFFSET(PLE!$G$14,$M17,BC$13))))","v":0},{"$f":"IF($D17<>\"Serviço\",0,IF(OR(AND(AUTOEVENTO=\"Manual\",$M17=1),$M17>(ROW(PLE.lastrow)-ROW(PLE.firstrow))),0,IF(OFFSET(PLE!$G$14,$M17,BD$13)=\"\",10^12,OFFSET(PLE!$G$14,$M17,BD$13))))","v":0},{"$f":"IF($D17<>\"Serviço\",0,IF(OR(AND(AUTOEVENTO=\"Manual\",$M17=1),$M17>(ROW(PLE.lastrow)-ROW(PLE.firstrow))),0,IF(OFFSET(PLE!$G$14,$M17,BE$13)=\"\",10^12,OFFSET(PLE!$G$14,$M17,BE$13))))","v":0},{"$f":"IF($D17<>\"Serviço\",0,IF(OR(AND(AUTOEVENTO=\"Manual\",$M17=1),$M17>(ROW(PLE.lastrow)-ROW(PLE.firstrow))),0,IF(OFFSET(PLE!$G$14,$M17,BF$13)=\"\",10^12,OFFSET(PLE!$G$14,$M17,BF$13))))","v":0},{"$f":"IF($D17<>\"Serviço\",0,IF(OR(AND(AUTOEVENTO=\"Manual\",$M17=1),$M17>(ROW(PLE.lastrow)-ROW(PLE.firstrow))),0,IF(OFFSET(PLE!$G$14,$M17,BG$13)=\"\",10^12,OFFSET(PLE!$G$14,$M17,BG$13))))","v":0}]
["2",{"$f":"OFFSET(ORÇAMENTO!C$15,ROW(B18)-ROW(B$15),0)","v":"S"},{"$f":"OFFSET(ORÇAMENTO!L$15,ROW(C18)-ROW(C$15),0)","v":"F"},{"$f":"OFFSET(ORÇAMENTO!N$15,ROW(D18)-ROW(D$15),0)","v":"Serviço"},{"$f":"OFFSET(ORÇAMENTO!O$15,ROW(E18)-ROW(E$15),0)","v":"1.1.1."},{"$f":"OFFSET(ORÇAMENTO!R$15,ROW(F18)-ROW(F$15),0)","v":"LIMPEZA MECANIZADA DE CAMADA VEGETAL, VEGETAÇÃO E PEQUENAS ÁRVORES (DIÂMETRO DE TRONCO MENOR QUE 0,20 M), COM TRATOR DE ESTEIRAS. AF_03/2024"},{"$f":"IF($D18<>\"Serviço\",\"\",OFFSET(ORÇAMENTO!S$15,ROW(G18)-ROW(G$15),0))","v":"M2"},{"$f":"IF($D18<>\"Serviço\",0,IF(ACOMPANHAMENTO=\"BM\",ROUND(OFFSET(ORÇAMENTO!AJ$15,ROW(H18)-ROW(H$15),0),15-13*ORÇAMENTO!$AF$7),SUMPRODUCT(($Q$12:$AA$12<>\"\")*ROUND($Q18:$AA18,15-13*ORÇAMENTO!$AF$7))))","v":1674.27},null,null,null,".",{"$f":"IF($D18<>\"Serviço\",\"\",IF(AUTOEVENTO=\"manual\",$A18,IF(ISERROR(MATCH($A18,$A$15:OFFSET($A18,-1,0),0)),MAX($M$15:OFFSET(M18,-1,0))+1,INDEX($M$15:OFFSET(M18,-1,0),MATCH($A18,$A$15:OFFSET($A18,-1,0),0)))))","v":2},{"$f":"IF($D18<>\"Serviço\",\"\",IF(AUTOEVENTO=\"Manual\",IF($A18=0,\"<-- defina o número do agrupador\",OFFSET(EVENTOS!$D$14,$A18,0)),OFFSET($F$15,$A18,0)))","v":"SERVIÇOS PRELIMINARES"},null,null,null,null,null,null,null,null,null,null,null,null,null,{"$f":"IF(AND($D18=\"Serviço\",AB$12<>0,$H18>0,OR(AUTOEVENTO<>\"manual\",$M18<>1)),\nIF(Import.TipoArredondamento<>\"TransfereGOV\",\nROUND(OFFSET($P18,0,AB$13),15-13*ORÇAMENTO!$AF$7)/$H18*OFFSET(ORÇAMENTO!$X$15,ROW(AB18)-ROW(AB$15),0),\nROUND(ROUND(OFFSET($P18,0,AB$13),15-13*ORÇAMENTO!$AF$7)*OFFSET(ORÇAMENTO!$W$15,ROW(AB18)-ROW(AB$15),0),15-13*ORÇAMENTO!$AF$11)),0)","v":0},{"$f":"IF(AND($D18=\"Serviço\",AC$12<>0,$H18>0,OR(AUTOEVENTO<>\"manual\",$M18<>1)),\nIF(Import.TipoArredondamento<>\"TransfereGOV\",\nROUND(OFFSET($P18,0,AC$13),15-13*ORÇAMENTO!$AF$7)/$H18*OFFSET(ORÇAMENTO!$X$15,ROW(AC18)-ROW(AC$15),0),\nROUND(ROUND(OFFSET($P18,0,AC$13),15-13*ORÇAMENTO!$AF$7)*OFFSET(ORÇAMENTO!$W$15,ROW(AC18)-ROW(AC$15),0),15-13*ORÇAMENTO!$AF$11)),0)","v":0},{"$f":"IF(AND($D18=\"Serviço\",AD$12<>0,$H18>0,OR(AUTOEVENTO<>\"manual\",$M18<>1)),\nIF(Import.TipoArredondamento<>\"TransfereGOV\",\nROUND(OFFSET($P18,0,AD$13),15-13*ORÇAMENTO!$AF$7)/$H18*OFFSET(ORÇAMENTO!$X$15,ROW(AD18)-ROW(AD$15),0),\nROUND(ROUND(OFFSET($P18,0,AD$13),15-13*ORÇAMENTO!$AF$7)*OFFSET(ORÇAMENTO!$W$15,ROW(AD18)-ROW(AD$15),0),15-13*ORÇAMENTO!$AF$11)),0)","v":0},{"$f":"IF(AND($D18=\"Serviço\",AE$12<>0,$H18>0,OR(AUTOEVENTO<>\"manual\",$M18<>1)),\nIF(Import.TipoArredondamento<>\"TransfereGOV\",\nROUND(OFFSET($P18,0,AE$13),15-13*ORÇAMENTO!$AF$7)/$H18*OFFSET(ORÇAMENTO!$X$15,ROW(AE18)-ROW(AE$15),0),\nROUND(ROUND(OFFSET($P18,0,AE$13),15-13*ORÇAMENTO!$AF$7)*OFFSET(ORÇAMENTO!$W$15,ROW(AE18)-ROW(AE$15),0),15-13*ORÇAMENTO!$AF$11)),0)","v":0},{"$f":"IF(AND($D18=\"Serviço\",AF$12<>0,$H18>0,OR(AUTOEVENTO<>\"manual\",$M18<>1)),\nIF(Import.TipoArredondamento<>\"TransfereGOV\",\nROUND(OFFSET($P18,0,AF$13),15-13*ORÇAMENTO!$AF$7)/$H18*OFFSET(ORÇAMENTO!$X$15,ROW(AF18)-ROW(AF$15),0),\nROUND(ROUND(OFFSET($P18,0,AF$13),15-13*ORÇAMENTO!$AF$7)*OFFSET(ORÇAMENTO!$W$15,ROW(AF18)-ROW(AF$15),0),15-13*ORÇAMENTO!$AF$11)),0)","v":0},{"$f":"IF(AND($D18=\"Serviço\",AG$12<>0,$H18>0,OR(AUTOEVENTO<>\"manual\",$M18<>1)),\nIF(Import.TipoArredondamento<>\"TransfereGOV\",\nROUND(OFFSET($P18,0,AG$13),15-13*ORÇAMENTO!$AF$7)/$H18*OFFSET(ORÇAMENTO!$X$15,ROW(AG18)-ROW(AG$15),0),\nROUND(ROUND(OFFSET($P18,0,AG$13),15-13*ORÇAMENTO!$AF$7)*OFFSET(ORÇAMENTO!$W$15,ROW(AG18)-ROW(AG$15),0),15-13*ORÇAMENTO!$AF$11)),0)","v":0},{"$f":"IF(AND($D18=\"Serviço\",AH$12<>0,$H18>0,OR(AUTOEVENTO<>\"manual\",$M18<>1)),\nIF(Import.TipoArredondamento<>\"TransfereGOV\",\nROUND(OFFSET($P18,0,AH$13),15-13*ORÇAMENTO!$AF$7)/$H18*OFFSET(ORÇAMENTO!$X$15,ROW(AH18)-ROW(AH$15),0),\nROUND(ROUND(OFFSET($P18,0,AH$13),15-13*ORÇAMENTO!$AF$7)*OFFSET(ORÇAMENTO!$W$15,ROW(AH18)-ROW(AH$15),0),15-13*ORÇAMENTO!$AF$11)),0)","v":0},{"$f":"IF(AND($D18=\"Serviço\",AI$12<>0,$H18>0,OR(AUTOEVENTO<>\"manual\",$M18<>1)),\nIF(Import.TipoArredondamento<>\"TransfereGOV\",\nROUND(OFFSET($P18,0,AI$13),15-13*ORÇAMENTO!$AF$7)/$H18*OFFSET(ORÇAMENTO!$X$15,ROW(AI18)-ROW(AI$15),0),\nROUND(ROUND(OFFSET($P18,0,AI$13),15-13*ORÇAMENTO!$AF$7)*OFFSET(ORÇAMENTO!$W$15,ROW(AI18)-ROW(AI$15),0),15-13*ORÇAMENTO!$AF$11)),0)","v":0},{"$f":"IF(AND($D18=\"Serviço\",AJ$12<>0,$H18>0,OR(AUTOEVENTO<>\"manual\",$M18<>1)),\nIF(Import.TipoArredondamento<>\"TransfereGOV\",\nROUND(OFFSET($P18,0,AJ$13),15-13*ORÇAMENTO!$AF$7)/$H18*OFFSET(ORÇAMENTO!$X$15,ROW(AJ18)-ROW(AJ$15),0),\nROUND(ROUND(OFFSET($P18,0,AJ$13),15-13*ORÇAMENTO!$AF$7)*OFFSET(ORÇAMENTO!$W$15,ROW(AJ18)-ROW(AJ$15),0),15-13*ORÇAMENTO!$AF$11)),0)","v":0},{"$f":"IF(AND($D18=\"Serviço\",AK$12<>0,$H18>0,OR(AUTOEVENTO<>\"manual\",$M18<>1)),\nIF(Import.TipoArredondamento<>\"TransfereGOV\",\nROUND(OFFSET($P18,0,AK$13),15-13*ORÇAMENTO!$AF$7)/$H18*OFFSET(ORÇAMENTO!$X$15,ROW(AK18)-ROW(AK$15),0),\nROUND(ROUND(OFFSET($P18,0,AK$13),15-13*ORÇAMENTO!$AF$7)*OFFSET(ORÇAMENTO!$W$15,ROW(AK18)-ROW(AK$15),0),15-13*ORÇAMENTO!$AF$11)),0)","v":0},null,{"$f":"IF($D18<>\"Serviço\",0,IF(AND(AUTOEVENTO=\"Manual\",$M18=1),0,IF(OFFSET(CRONOPLE!$F$14,$M18,AM$13)=\"\",10^12,OFFSET(CRONOPLE!$F$14,$M18,AM$13))))","v":1000000000000},{"$f":"IF($D18<>\"Serviço\",0,IF(AND(AUTOEVENTO=\"Manual\",$M18=1),0,IF(OFFSET(CRONOPLE!$F$14,$M18,AN$13)=\"\",10^12,OFFSET(CRONOPLE!$F$14,$M18,AN$13))))","v":1000000000000},{"$f":"IF($D18<>\"Serviço\",0,IF(AND(AUTOEVENTO=\"Manual\",$M18=1),0,IF(OFFSET(CRONOPLE!$F$14,$M18,AO$13)=\"\",10^12,OFFSET(CRONOPLE!$F$14,$M18,AO$13))))","v":1000000000000},{"$f":"IF($D18<>\"Serviço\",0,IF(AND(AUTOEVENTO=\"Manual\",$M18=1),0,IF(OFFSET(CRONOPLE!$F$14,$M18,AP$13)=\"\",10^12,OFFSET(CRONOPLE!$F$14,$M18,AP$13))))","v":1000000000000},{"$f":"IF($D18<>\"Serviço\",0,IF(AND(AUTOEVENTO=\"Manual\",$M18=1),0,IF(OFFSET(CRONOPLE!$F$14,$M18,AQ$13)=\"\",10^12,OFFSET(CRONOPLE!$F$14,$M18,AQ$13))))","v":1000000000000},{"$f":"IF($D18<>\"Serviço\",0,IF(AND(AUTOEVENTO=\"Manual\",$M18=1),0,IF(OFFSET(CRONOPLE!$F$14,$M18,AR$13)=\"\",10^12,OFFSET(CRONOPLE!$F$14,$M18,AR$13))))","v":1000000000000},{"$f":"IF($D18<>\"Serviço\",0,IF(AND(AUTOEVENTO=\"Manual\",$M18=1),0,IF(OFFSET(CRONOPLE!$F$14,$M18,AS$13)=\"\",10^12,OFFSET(CRONOPLE!$F$14,$M18,AS$13))))","v":1000000000000},{"$f":"IF($D18<>\"Serviço\",0,IF(AND(AUTOEVENTO=\"Manual\",$M18=1),0,IF(OFFSET(CRONOPLE!$F$14,$M18,AT$13)=\"\",10^12,OFFSET(CRONOPLE!$F$14,$M18,AT$13))))","v":1000000000000},{"$f":"IF($D18<>\"Serviço\",0,IF(AND(AUTOEVENTO=\"Manual\",$M18=1),0,IF(OFFSET(CRONOPLE!$F$14,$M18,AU$13)=\"\",10^12,OFFSET(CRONOPLE!$F$14,$M18,AU$13))))","v":1000000000000},{"$f":"IF($D18<>\"Serviço\",0,IF(AND(AUTOEVENTO=\"Manual\",$M18=1),0,IF(OFFSET(CRONOPLE!$F$14,$M18,AV$13)=\"\",10^12,OFFSET(CRONOPLE!$F$14,$M18,AV$13))))","v":1000000000000},null,{"$f":"IF($D18<>\"Serviço\",0,IF(OR(AND(AUTOEVENTO=\"Manual\",$M18=1),$M18>(ROW(PLE.lastrow)-ROW(PLE.firstrow))),0,IF(OFFSET(PLE!$G$14,$M18,AX$13)=\"\",10^12,OFFSET(PLE!$G$14,$M18,AX$13))))","v":1000000000000},{"$f":"IF($D18<>\"Serviço\",0,IF(OR(AND(AUTOEVENTO=\"Manual\",$M18=1),$M18>(ROW(PLE.lastrow)-ROW(PLE.firstrow))),0,IF(OFFSET(PLE!$G$14,$M18,AY$13)=\"\",10^12,OFFSET(PLE!$G$14,$M18,AY$13))))","v":1000000000000},{"$f":"IF($D18<>\"Serviço\",0,IF(OR(AND(AUTOEVENTO=\"Manual\",$M18=1),$M18>(ROW(PLE.lastrow)-ROW(PLE.firstrow))),0,IF(OFFSET(PLE!$G$14,$M18,AZ$13)=\"\",10^12,OFFSET(PLE!$G$14,$M18,AZ$13))))","v":1000000000000},{"$f":"IF($D18<>\"Serviço\",0,IF(OR(AND(AUTOEVENTO=\"Manual\",$M18=1),$M18>(ROW(PLE.lastrow)-ROW(PLE.firstrow))),0,IF(OFFSET(PLE!$G$14,$M18,BA$13)=\"\",10^12,OFFSET(PLE!$G$14,$M18,BA$13))))","v":1000000000000},{"$f":"IF($D18<>\"Serviço\",0,IF(OR(AND(AUTOEVENTO=\"Manual\",$M18=1),$M18>(ROW(PLE.lastrow)-ROW(PLE.firstrow))),0,IF(OFFSET(PLE!$G$14,$M18,BB$13)=\"\",10^12,OFFSET(PLE!$G$14,$M18,BB$13))))","v":1000000000000},{"$f":"IF($D18<>\"Serviço\",0,IF(OR(AND(AUTOEVENTO=\"Manual\",$M18=1),$M18>(ROW(PLE.lastrow)-ROW(PLE.firstrow))),0,IF(OFFSET(PLE!$G$14,$M18,BC$13)=\"\",10^12,OFFSET(PLE!$G$14,$M18,BC$13))))","v":1000000000000},{"$f":"IF($D18<>\"Serviço\",0,IF(OR(AND(AUTOEVENTO=\"Manual\",$M18=1),$M18>(ROW(PLE.lastrow)-ROW(PLE.firstrow))),0,IF(OFFSET(PLE!$G$14,$M18,BD$13)=\"\",10^12,OFFSET(PLE!$G$14,$M18,BD$13))))","v":1000000000000},{"$f":"IF($D18<>\"Serviço\",0,IF(OR(AND(AUTOEVENTO=\"Manual\",$M18=1),$M18>(ROW(PLE.lastrow)-ROW(PLE.firstrow))),0,IF(OFFSET(PLE!$G$14,$M18,BE$13)=\"\",10^12,OFFSET(PLE!$G$14,$M18,BE$13))))","v":1000000000000},{"$f":"IF($D18<>\"Serviço\",0,IF(OR(AND(AUTOEVENTO=\"Manual\",$M18=1),$M18>(ROW(PLE.lastrow)-ROW(PLE.firstrow))),0,IF(OFFSET(PLE!$G$14,$M18,BF$13)=\"\",10^12,OFFSET(PLE!$G$14,$M18,BF$13))))","v":1000000000000},{"$f":"IF($D18<>\"Serviço\",0,IF(OR(AND(AUTOEVENTO=\"Manual\",$M18=1),$M18>(ROW(PLE.lastrow)-ROW(PLE.firstrow))),0,IF(OFFSET(PLE!$G$14,$M18,BG$13)=\"\",10^12,OFFSET(PLE!$G$14,$M18,BG$13))))","v":1000000000000}]
["2",{"$f":"OFFSET(ORÇAMENTO!C$15,ROW(B19)-ROW(B$15),0)","v":"S"},{"$f":"OFFSET(ORÇAMENTO!L$15,ROW(C19)-ROW(C$15),0)","v":"F"},{"$f":"OFFSET(ORÇAMENTO!N$15,ROW(D19)-ROW(D$15),0)","v":"Serviço"},{"$f":"OFFSET(ORÇAMENTO!O$15,ROW(E19)-ROW(E$15),0)","v":"1.1.2."},{"$f":"OFFSET(ORÇAMENTO!R$15,ROW(F19)-ROW(F$15),0)","v":"ESCAVAÇÃO MECANIZADA DE VALA COM PROF. ATÉ 1,5 M (MÉDIA MONTANTE E JUSANTE/UMA COMPOSIÇÃO POR TRECHO), ESCAVADEIRA (0,8 M3), LARG. DE 1,5 M A 2,5 M, EM SOLO DE 1A CATEGORIA, LOCAIS COM BAIXO NÍVEL DE INTERFERÊNCIA. AF_09/2024"},{"$f":"IF($D19<>\"Serviço\",\"\",OFFSET(ORÇAMENTO!S$15,ROW(G19)-ROW(G$15),0))","v":"M3"},{"$f":"IF($D19<>\"Serviço\",0,IF(ACOMPANHAMENTO=\"BM\",ROUND(OFFSET(ORÇAMENTO!AJ$15,ROW(H19)-ROW(H$15),0),15-13*ORÇAMENTO!$AF$7),SUMPRODUCT(($Q$12:$AA$12<>\"\")*ROUND($Q19:$AA19,15-13*ORÇAMENTO!$AF$7))))","v":409.59},null,null,null,".",{"$f":"IF($D19<>\"Serviço\",\"\",IF(AUTOEVENTO=\"manual\",$A19,IF(ISERROR(MATCH($A19,$A$15:OFFSET($A19,-1,0),0)),MAX($M$15:OFFSET(M19,-1,0))+1,INDEX($M$15:OFFSET(M19,-1,0),MATCH($A19,$A$15:OFFSET($A19,-1,0),0)))))","v":2},{"$f":"IF($D19<>\"Serviço\",\"\",IF(AUTOEVENTO=\"Manual\",IF($A19=0,\"<-- defina o número do agrupador\",OFFSET(EVENTOS!$D$14,$A19,0)),OFFSET($F$15,$A19,0)))","v":"SERVIÇOS PRELIMINARES"},null,null,null,null,null,null,null,null,null,null,null,null,null,{"$f":"IF(AND($D19=\"Serviço\",AB$12<>0,$H19>0,OR(AUTOEVENTO<>\"manual\",$M19<>1)),\nIF(Import.TipoArredondamento<>\"TransfereGOV\",\nROUND(OFFSET($P19,0,AB$13),15-13*ORÇAMENTO!$AF$7)/$H19*OFFSET(ORÇAMENTO!$X$15,ROW(AB19)-ROW(AB$15),0),\nROUND(ROUND(OFFSET($P19,0,AB$13),15-13*ORÇAMENTO!$AF$7)*OFFSET(ORÇAMENTO!$W$15,ROW(AB19)-ROW(AB$15),0),15-13*ORÇAMENTO!$AF$11)),0)","v":0},{"$f":"IF(AND($D19=\"Serviço\",AC$12<>0,$H19>0,OR(AUTOEVENTO<>\"manual\",$M19<>1)),\nIF(Import.TipoArredondamento<>\"TransfereGOV\",\nROUND(OFFSET($P19,0,AC$13),15-13*ORÇAMENTO!$AF$7)/$H19*OFFSET(ORÇAMENTO!$X$15,ROW(AC19)-ROW(AC$15),0),\nROUND(ROUND(OFFSET($P19,0,AC$13),15-13*ORÇAMENTO!$AF$7)*OFFSET(ORÇAMENTO!$W$15,ROW(AC19)-ROW(AC$15),0),15-13*ORÇAMENTO!$AF$11)),0)","v":0},{"$f":"IF(AND($D19=\"Serviço\",AD$12<>0,$H19>0,OR(AUTOEVENTO<>\"manual\",$M19<>1)),\nIF(Import.TipoArredondamento<>\"TransfereGOV\",\nROUND(OFFSET($P19,0,AD$13),15-13*ORÇAMENTO!$AF$7)/$H19*OFFSET(ORÇAMENTO!$X$15,ROW(AD19)-ROW(AD$15),0),\nROUND(ROUND(OFFSET($P19,0,AD$13),15-13*ORÇAMENTO!$AF$7)*OFFSET(ORÇAMENTO!$W$15,ROW(AD19)-ROW(AD$15),0),15-13*ORÇAMENTO!$AF$11)),0)","v":0},{"$f":"IF(AND($D19=\"Serviço\",AE$12<>0,$H19>0,OR(AUTOEVENTO<>\"manual\",$M19<>1)),\nIF(Import.TipoArredondamento<>\"TransfereGOV\",\nROUND(OFFSET($P19,0,AE$13),15-13*ORÇAMENTO!$AF$7)/$H19*OFFSET(ORÇAMENTO!$X$15,ROW(AE19)-ROW(AE$15),0),\nROUND(ROUND(OFFSET($P19,0,AE$13),15-13*ORÇAMENTO!$AF$7)*OFFSET(ORÇAMENTO!$W$15,ROW(AE19)-ROW(AE$15),0),15-13*ORÇAMENTO!$AF$11)),0)","v":0},{"$f":"IF(AND($D19=\"Serviço\",AF$12<>0,$H19>0,OR(AUTOEVENTO<>\"manual\",$M19<>1)),\nIF(Import.TipoArredondamento<>\"TransfereGOV\",\nROUND(OFFSET($P19,0,AF$13),15-13*ORÇAMENTO!$AF$7)/$H19*OFFSET(ORÇAMENTO!$X$15,ROW(AF19)-ROW(AF$15),0),\nROUND(ROUND(OFFSET($P19,0,AF$13),15-13*ORÇAMENTO!$AF$7)*OFFSET(ORÇAMENTO!$W$15,ROW(AF19)-ROW(AF$15),0),15-13*ORÇAMENTO!$AF$11)),0)","v":0},{"$f":"IF(AND($D19=\"Serviço\",AG$12<>0,$H19>0,OR(AUTOEVENTO<>\"manual\",$M19<>1)),\nIF(Import.TipoArredondamento<>\"TransfereGOV\",\nROUND(OFFSET($P19,0,AG$13),15-13*ORÇAMENTO!$AF$7)/$H19*OFFSET(ORÇAMENTO!$X$15,ROW(AG19)-ROW(AG$15),0),\nROUND(ROUND(OFFSET($P19,0,AG$13),15-13*ORÇAMENTO!$AF$7)*OFFSET(ORÇAMENTO!$W$15,ROW(AG19)-ROW(AG$15),0),15-13*ORÇAMENTO!$AF$11)),0)","v":0},{"$f":"IF(AND($D19=\"Serviço\",AH$12<>0,$H19>0,OR(AUTOEVENTO<>\"manual\",$M19<>1)),\nIF(Import.TipoArredondamento<>\"TransfereGOV\",\nROUND(OFFSET($P19,0,AH$13),15-13*ORÇAMENTO!$AF$7)/$H19*OFFSET(ORÇAMENTO!$X$15,ROW(AH19)-ROW(AH$15),0),\nROUND(ROUND(OFFSET($P19,0,AH$13),15-13*ORÇAMENTO!$AF$7)*OFFSET(ORÇAMENTO!$W$15,ROW(AH19)-ROW(AH$15),0),15-13*ORÇAMENTO!$AF$11)),0)","v":0},{"$f":"IF(AND($D19=\"Serviço\",AI$12<>0,$H19>0,OR(AUTOEVENTO<>\"manual\",$M19<>1)),\nIF(Import.TipoArredondamento<>\"TransfereGOV\",\nROUND(OFFSET($P19,0,AI$13),15-13*ORÇAMENTO!$AF$7)/$H19*OFFSET(ORÇAMENTO!$X$15,ROW(AI19)-ROW(AI$15),0),\nROUND(ROUND(OFFSET($P19,0,AI$13),15-13*ORÇAMENTO!$AF$7)*OFFSET(ORÇAMENTO!$W$15,ROW(AI19)-ROW(AI$15),0),15-13*ORÇAMENTO!$AF$11)),0)","v":0},{"$f":"IF(AND($D19=\"Serviço\",AJ$12<>0,$H19>0,OR(AUTOEVENTO<>\"manual\",$M19<>1)),\nIF(Import.TipoArredondamento<>\"TransfereGOV\",\nROUND(OFFSET($P19,0,AJ$13),15-13*ORÇAMENTO!$AF$7)/$H19*OFFSET(ORÇAMENTO!$X$15,ROW(AJ19)-ROW(AJ$15),0),\nROUND(ROUND(OFFSET($P19,0,AJ$13),15-13*ORÇAMENTO!$AF$7)*OFFSET(ORÇAMENTO!$W$15,ROW(AJ19)-ROW(AJ$15),0),15-13*ORÇAMENTO!$AF$11)),0)","v":0},{"$f":"IF(AND($D19=\"Serviço\",AK$12<>0,$H19>0,OR(AUTOEVENTO<>\"manual\",$M19<>1)),\nIF(Import.TipoArredondamento<>\"TransfereGOV\",\nROUND(OFFSET($P19,0,AK$13),15-13*ORÇAMENTO!$AF$7)/$H19*OFFSET(ORÇAMENTO!$X$15,ROW(AK19)-ROW(AK$15),0),\nROUND(ROUND(OFFSET($P19,0,AK$13),15-13*ORÇAMENTO!$AF$7)*OFFSET(ORÇAMENTO!$W$15,ROW(AK19)-ROW(AK$15),0),15-13*ORÇAMENTO!$AF$11)),0)","v":0},null,{"$f":"IF($D19<>\"Serviço\",0,IF(AND(AUTOEVENTO=\"Manual\",$M19=1),0,IF(OFFSET(CRONOPLE!$F$14,$M19,AM$13)=\"\",10^12,OFFSET(CRONOPLE!$F$14,$M19,AM$13))))","v":1000000000000},{"$f":"IF($D19<>\"Serviço\",0,IF(AND(AUTOEVENTO=\"Manual\",$M19=1),0,IF(OFFSET(CRONOPLE!$F$14,$M19,AN$13)=\"\",10^12,OFFSET(CRONOPLE!$F$14,$M19,AN$13))))","v":1000000000000},{"$f":"IF($D19<>\"Serviço\",0,IF(AND(AUTOEVENTO=\"Manual\",$M19=1),0,IF(OFFSET(CRONOPLE!$F$14,$M19,AO$13)=\"\",10^12,OFFSET(CRONOPLE!$F$14,$M19,AO$13))))","v":1000000000000},{"$f":"IF($D19<>\"Serviço\",0,IF(AND(AUTOEVENTO=\"Manual\",$M19=1),0,IF(OFFSET(CRONOPLE!$F$14,$M19,AP$13)=\"\",10^12,OFFSET(CRONOPLE!$F$14,$M19,AP$13))))","v":1000000000000},{"$f":"IF($D19<>\"Serviço\",0,IF(AND(AUTOEVENTO=\"Manual\",$M19=1),0,IF(OFFSET(CRONOPLE!$F$14,$M19,AQ$13)=\"\",10^12,OFFSET(CRONOPLE!$F$14,$M19,AQ$13))))","v":1000000000000},{"$f":"IF($D19<>\"Serviço\",0,IF(AND(AUTOEVENTO=\"Manual\",$M19=1),0,IF(OFFSET(CRONOPLE!$F$14,$M19,AR$13)=\"\",10^12,OFFSET(CRONOPLE!$F$14,$M19,AR$13))))","v":1000000000000},{"$f":"IF($D19<>\"Serviço\",0,IF(AND(AUTOEVENTO=\"Manual\",$M19=1),0,IF(OFFSET(CRONOPLE!$F$14,$M19,AS$13)=\"\",10^12,OFFSET(CRONOPLE!$F$14,$M19,AS$13))))","v":1000000000000},{"$f":"IF($D19<>\"Serviço\",0,IF(AND(AUTOEVENTO=\"Manual\",$M19=1),0,IF(OFFSET(CRONOPLE!$F$14,$M19,AT$13)=\"\",10^12,OFFSET(CRONOPLE!$F$14,$M19,AT$13))))","v":1000000000000},{"$f":"IF($D19<>\"Serviço\",0,IF(AND(AUTOEVENTO=\"Manual\",$M19=1),0,IF(OFFSET(CRONOPLE!$F$14,$M19,AU$13)=\"\",10^12,OFFSET(CRONOPLE!$F$14,$M19,AU$13))))","v":1000000000000},{"$f":"IF($D19<>\"Serviço\",0,IF(AND(AUTOEVENTO=\"Manual\",$M19=1),0,IF(OFFSET(CRONOPLE!$F$14,$M19,AV$13)=\"\",10^12,OFFSET(CRONOPLE!$F$14,$M19,AV$13))))","v":1000000000000},null,{"$f":"IF($D19<>\"Serviço\",0,IF(OR(AND(AUTOEVENTO=\"Manual\",$M19=1),$M19>(ROW(PLE.lastrow)-ROW(PLE.firstrow))),0,IF(OFFSET(PLE!$G$14,$M19,AX$13)=\"\",10^12,OFFSET(PLE!$G$14,$M19,AX$13))))","v":1000000000000},{"$f":"IF($D19<>\"Serviço\",0,IF(OR(AND(AUTOEVENTO=\"Manual\",$M19=1),$M19>(ROW(PLE.lastrow)-ROW(PLE.firstrow))),0,IF(OFFSET(PLE!$G$14,$M19,AY$13)=\"\",10^12,OFFSET(PLE!$G$14,$M19,AY$13))))","v":1000000000000},{"$f":"IF($D19<>\"Serviço\",0,IF(OR(AND(AUTOEVENTO=\"Manual\",$M19=1),$M19>(ROW(PLE.lastrow)-ROW(PLE.firstrow))),0,IF(OFFSET(PLE!$G$14,$M19,AZ$13)=\"\",10^12,OFFSET(PLE!$G$14,$M19,AZ$13))))","v":1000000000000},{"$f":"IF($D19<>\"Serviço\",0,IF(OR(AND(AUTOEVENTO=\"Manual\",$M19=1),$M19>(ROW(PLE.lastrow)-ROW(PLE.firstrow))),0,IF(OFFSET(PLE!$G$14,$M19,BA$13)=\"\",10^12,OFFSET(PLE!$G$14,$M19,BA$13))))","v":1000000000000},{"$f":"IF($D19<>\"Serviço\",0,IF(OR(AND(AUTOEVENTO=\"Manual\",$M19=1),$M19>(ROW(PLE.lastrow)-ROW(PLE.firstrow))),0,IF(OFFSET(PLE!$G$14,$M19,BB$13)=\"\",10^12,OFFSET(PLE!$G$14,$M19,BB$13))))","v":1000000000000},{"$f":"IF($D19<>\"Serviço\",0,IF(OR(AND(AUTOEVENTO=\"Manual\",$M19=1),$M19>(ROW(PLE.lastrow)-ROW(PLE.firstrow))),0,IF(OFFSET(PLE!$G$14,$M19,BC$13)=\"\",10^12,OFFSET(PLE!$G$14,$M19,BC$13))))","v":1000000000000},{"$f":"IF($D19<>\"Serviço\",0,IF(OR(AND(AUTOEVENTO=\"Manual\",$M19=1),$M19>(ROW(PLE.lastrow)-ROW(PLE.firstrow))),0,IF(OFFSET(PLE!$G$14,$M19,BD$13)=\"\",10^12,OFFSET(PLE!$G$14,$M19,BD$13))))","v":1000000000000},{"$f":"IF($D19<>\"Serviço\",0,IF(OR(AND(AUTOEVENTO=\"Manual\",$M19=1),$M19>(ROW(PLE.lastrow)-ROW(PLE.firstrow))),0,IF(OFFSET(PLE!$G$14,$M19,BE$13)=\"\",10^12,OFFSET(PLE!$G$14,$M19,BE$13))))","v":1000000000000},{"$f":"IF($D19<>\"Serviço\",0,IF(OR(AND(AUTOEVENTO=\"Manual\",$M19=1),$M19>(ROW(PLE.lastrow)-ROW(PLE.firstrow))),0,IF(OFFSET(PLE!$G$14,$M19,BF$13)=\"\",10^12,OFFSET(PLE!$G$14,$M19,BF$13))))","v":1000000000000},{"$f":"IF($D19<>\"Serviço\",0,IF(OR(AND(AUTOEVENTO=\"Manual\",$M19=1),$M19>(ROW(PLE.lastrow)-ROW(PLE.firstrow))),0,IF(OFFSET(PLE!$G$14,$M19,BG$13)=\"\",10^12,OFFSET(PLE!$G$14,$M19,BG$13))))","v":1000000000000}]
["2",{"$f":"OFFSET(ORÇAMENTO!C$15,ROW(B20)-ROW(B$15),0)","v":"S"},{"$f":"OFFSET(ORÇAMENTO!L$15,ROW(C20)-ROW(C$15),0)","v":"F"},{"$f":"OFFSET(ORÇAMENTO!N$15,ROW(D20)-ROW(D$15),0)","v":"Serviço"},{"$f":"OFFSET(ORÇAMENTO!O$15,ROW(E20)-ROW(E$15),0)","v":"1.1.3."},{"$f":"OFFSET(ORÇAMENTO!R$15,ROW(F20)-ROW(F$15),0)","v":"COMPACTAÇÃO MECÂNICA DE SOLO PARA EXECUÇÃO DE RADIER, PISO DE CONCRETO OU LAJE SOBRE SOLO, COM COMPACTADOR DE SOLOS TIPO PLACA VIBRATÓRIA. AF_09/2021"},{"$f":"IF($D20<>\"Serviço\",\"\",OFFSET(ORÇAMENTO!S$15,ROW(G20)-ROW(G$15),0))","v":"M2"},{"$f":"IF($D20<>\"Serviço\",0,IF(ACOMPANHAMENTO=\"BM\",ROUND(OFFSET(ORÇAMENTO!AJ$15,ROW(H20)-ROW(H$15),0),15-13*ORÇAMENTO!$AF$7),SUMPRODUCT(($Q$12:$AA$12<>\"\")*ROUND($Q20:$AA20,15-13*ORÇAMENTO!$AF$7))))","v":935.22},null,null,null,".",{"$f":"IF($D20<>\"Serviço\",\"\",IF(AUTOEVENTO=\"manual\",$A20,IF(ISERROR(MATCH($A20,$A$15:OFFSET($A20,-1,0),0)),MAX($M$15:OFFSET(M20,-1,0))+1,INDEX($M$15:OFFSET(M20,-1,0),MATCH($A20,$A$15:OFFSET($A20,-1,0),0)))))","v":2},{"$f":"IF($D20<>\"Serviço\",\"\",IF(AUTOEVENTO=\"Manual\",IF($A20=0,\"<-- defina o número do agrupador\",OFFSET(EVENTOS!$D$14,$A20,0)),OFFSET($F$15,$A20,0)))","v":"SERVIÇOS PRELIMINARES"},null,null,null,null,null,null,null,null,null,null,null,null,null,{"$f":"IF(AND($D20=\"Serviço\",AB$12<>0,$H20>0,OR(AUTOEVENTO<>\"manual\",$M20<>1)),\nIF(Import.TipoArredondamento<>\"TransfereGOV\",\nROUND(OFFSET($P20,0,AB$13),15-13*ORÇAMENTO!$AF$7)/$H20*OFFSET(ORÇAMENTO!$X$15,ROW(AB20)-ROW(AB$15),0),\nROUND(ROUND(OFFSET($P20,0,AB$13),15-13*ORÇAMENTO!$AF$7)*OFFSET(ORÇAMENTO!$W$15,ROW(AB20)-ROW(AB$15),0),15-13*ORÇAMENTO!$AF$11)),0)","v":0},{"$f":"IF(AND($D20=\"Serviço\",AC$12<>0,$H20>0,OR(AUTOEVENTO<>\"manual\",$M20<>1)),\nIF(Import.TipoArredondamento<>\"TransfereGOV\",\nROUND(OFFSET($P20,0,AC$13),15-13*ORÇAMENTO!$AF$7)/$H20*OFFSET(ORÇAMENTO!$X$15,ROW(AC20)-ROW(AC$15),0),\nROUND(ROUND(OFFSET($P20,0,AC$13),15-13*ORÇAMENTO!$AF$7)*OFFSET(ORÇAMENTO!$W$15,ROW(AC20)-ROW(AC$15),0),15-13*ORÇAMENTO!$AF$11)),0)","v":0},{"$f":"IF(AND($D20=\"Serviço\",AD$12<>0,$H20>0,OR(AUTOEVENTO<>\"manual\",$M20<>1)),\nIF(Import.TipoArredondamento<>\"TransfereGOV\",\nROUND(OFFSET($P20,0,AD$13),15-13*ORÇAMENTO!$AF$7)/$H20*OFFSET(ORÇAMENTO!$X$15,ROW(AD20)-ROW(AD$15),0),\nROUND(ROUND(OFFSET($P20,0,AD$13),15-13*ORÇAMENTO!$AF$7)*OFFSET(ORÇAMENTO!$W$15,ROW(AD20)-ROW(AD$15),0),15-13*ORÇAMENTO!$AF$11)),0)","v":0},{"$f":"IF(AND($D20=\"Serviço\",AE$12<>0,$H20>0,OR(AUTOEVENTO<>\"manual\",$M20<>1)),\nIF(Import.TipoArredondamento<>\"TransfereGOV\",\nROUND(OFFSET($P20,0,AE$13),15-13*ORÇAMENTO!$AF$7)/$H20*OFFSET(ORÇAMENTO!$X$15,ROW(AE20)-ROW(AE$15),0),\nROUND(ROUND(OFFSET($P20,0,AE$13),15-13*ORÇAMENTO!$AF$7)*OFFSET(ORÇAMENTO!$W$15,ROW(AE20)-ROW(AE$15),0),15-13*ORÇAMENTO!$AF$11)),0)","v":0},{"$f":"IF(AND($D20=\"Serviço\",AF$12<>0,$H20>0,OR(AUTOEVENTO<>\"manual\",$M20<>1)),\nIF(Import.TipoArredondamento<>\"TransfereGOV\",\nROUND(OFFSET($P20,0,AF$13),15-13*ORÇAMENTO!$AF$7)/$H20*OFFSET(ORÇAMENTO!$X$15,ROW(AF20)-ROW(AF$15),0),\nROUND(ROUND(OFFSET($P20,0,AF$13),15-13*ORÇAMENTO!$AF$7)*OFFSET(ORÇAMENTO!$W$15,ROW(AF20)-ROW(AF$15),0),15-13*ORÇAMENTO!$AF$11)),0)","v":0},{"$f":"IF(AND($D20=\"Serviço\",AG$12<>0,$H20>0,OR(AUTOEVENTO<>\"manual\",$M20<>1)),\nIF(Import.TipoArredondamento<>\"TransfereGOV\",\nROUND(OFFSET($P20,0,AG$13),15-13*ORÇAMENTO!$AF$7)/$H20*OFFSET(ORÇAMENTO!$X$15,ROW(AG20)-ROW(AG$15),0),\nROUND(ROUND(OFFSET($P20,0,AG$13),15-13*ORÇAMENTO!$AF$7)*OFFSET(ORÇAMENTO!$W$15,ROW(AG20)-ROW(AG$15),0),15-13*ORÇAMENTO!$AF$11)),0)","v":0},{"$f":"IF(AND($D20=\"Serviço\",AH$12<>0,$H20>0,OR(AUTOEVENTO<>\"manual\",$M20<>1)),\nIF(Import.TipoArredondamento<>\"TransfereGOV\",\nROUND(OFFSET($P20,0,AH$13),15-13*ORÇAMENTO!$AF$7)/$H20*OFFSET(ORÇAMENTO!$X$15,ROW(AH20)-ROW(AH$15),0),\nROUND(ROUND(OFFSET($P20,0,AH$13),15-13*ORÇAMENTO!$AF$7)*OFFSET(ORÇAMENTO!$W$15,ROW(AH20)-ROW(AH$15),0),15-13*ORÇAMENTO!$AF$11)),0)","v":0},{"$f":"IF(AND($D20=\"Serviço\",AI$12<>0,$H20>0,OR(AUTOEVENTO<>\"manual\",$M20<>1)),\nIF(Import.TipoArredondamento<>\"TransfereGOV\",\nROUND(OFFSET($P20,0,AI$13),15-13*ORÇAMENTO!$AF$7)/$H20*OFFSET(ORÇAMENTO!$X$15,ROW(AI20)-ROW(AI$15),0),\nROUND(ROUND(OFFSET($P20,0,AI$13),15-13*ORÇAMENTO!$AF$7)*OFFSET(ORÇAMENTO!$W$15,ROW(AI20)-ROW(AI$15),0),15-13*ORÇAMENTO!$AF$11)),0)","v":0},{"$f":"IF(AND($D20=\"Serviço\",AJ$12<>0,$H20>0,OR(AUTOEVENTO<>\"manual\",$M20<>1)),\nIF(Import.TipoArredondamento<>\"TransfereGOV\",\nROUND(OFFSET($P20,0,AJ$13),15-13*ORÇAMENTO!$AF$7)/$H20*OFFSET(ORÇAMENTO!$X$15,ROW(AJ20)-ROW(AJ$15),0),\nROUND(ROUND(OFFSET($P20,0,AJ$13),15-13*ORÇAMENTO!$AF$7)*OFFSET(ORÇAMENTO!$W$15,ROW(AJ20)-ROW(AJ$15),0),15-13*ORÇAMENTO!$AF$11)),0)","v":0},{"$f":"IF(AND($D20=\"Serviço\",AK$12<>0,$H20>0,OR(AUTOEVENTO<>\"manual\",$M20<>1)),\nIF(Import.TipoArredondamento<>\"TransfereGOV\",\nROUND(OFFSET($P20,0,AK$13),15-13*ORÇAMENTO!$AF$7)/$H20*OFFSET(ORÇAMENTO!$X$15,ROW(AK20)-ROW(AK$15),0),\nROUND(ROUND(OFFSET($P20,0,AK$13),15-13*ORÇAMENTO!$AF$7)*OFFSET(ORÇAMENTO!$W$15,ROW(AK20)-ROW(AK$15),0),15-13*ORÇAMENTO!$AF$11)),0)","v":0},null,{"$f":"IF($D20<>\"Serviço\",0,IF(AND(AUTOEVENTO=\"Manual\",$M20=1),0,IF(OFFSET(CRONOPLE!$F$14,$M20,AM$13)=\"\",10^12,OFFSET(CRONOPLE!$F$14,$M20,AM$13))))","v":1000000000000},{"$f":"IF($D20<>\"Serviço\",0,IF(AND(AUTOEVENTO=\"Manual\",$M20=1),0,IF(OFFSET(CRONOPLE!$F$14,$M20,AN$13)=\"\",10^12,OFFSET(CRONOPLE!$F$14,$M20,AN$13))))","v":1000000000000},{"$f":"IF($D20<>\"Serviço\",0,IF(AND(AUTOEVENTO=\"Manual\",$M20=1),0,IF(OFFSET(CRONOPLE!$F$14,$M20,AO$13)=\"\",10^12,OFFSET(CRONOPLE!$F$14,$M20,AO$13))))","v":1000000000000},{"$f":"IF($D20<>\"Serviço\",0,IF(AND(AUTOEVENTO=\"Manual\",$M20=1),0,IF(OFFSET(CRONOPLE!$F$14,$M20,AP$13)=\"\",10^12,OFFSET(CRONOPLE!$F$14,$M20,AP$13))))","v":1000000000000},{"$f":"IF($D20<>\"Serviço\",0,IF(AND(AUTOEVENTO=\"Manual\",$M20=1),0,IF(OFFSET(CRONOPLE!$F$14,$M20,AQ$13)=\"\",10^12,OFFSET(CRONOPLE!$F$14,$M20,AQ$13))))","v":1000000000000},{"$f":"IF($D20<>\"Serviço\",0,IF(AND(AUTOEVENTO=\"Manual\",$M20=1),0,IF(OFFSET(CRONOPLE!$F$14,$M20,AR$13)=\"\",10^12,OFFSET(CRONOPLE!$F$14,$M20,AR$13))))","v":1000000000000},{"$f":"IF($D20<>\"Serviço\",0,IF(AND(AUTOEVENTO=\"Manual\",$M20=1),0,IF(OFFSET(CRONOPLE!$F$14,$M20,AS$13)=\"\",10^12,OFFSET(CRONOPLE!$F$14,$M20,AS$13))))","v":1000000000000},{"$f":"IF($D20<>\"Serviço\",0,IF(AND(AUTOEVENTO=\"Manual\",$M20=1),0,IF(OFFSET(CRONOPLE!$F$14,$M20,AT$13)=\"\",10^12,OFFSET(CRONOPLE!$F$14,$M20,AT$13))))","v":1000000000000},{"$f":"IF($D20<>\"Serviço\",0,IF(AND(AUTOEVENTO=\"Manual\",$M20=1),0,IF(OFFSET(CRONOPLE!$F$14,$M20,AU$13)=\"\",10^12,OFFSET(CRONOPLE!$F$14,$M20,AU$13))))","v":1000000000000},{"$f":"IF($D20<>\"Serviço\",0,IF(AND(AUTOEVENTO=\"Manual\",$M20=1),0,IF(OFFSET(CRONOPLE!$F$14,$M20,AV$13)=\"\",10^12,OFFSET(CRONOPLE!$F$14,$M20,AV$13))))","v":1000000000000},null,{"$f":"IF($D20<>\"Serviço\",0,IF(OR(AND(AUTOEVENTO=\"Manual\",$M20=1),$M20>(ROW(PLE.lastrow)-ROW(PLE.firstrow))),0,IF(OFFSET(PLE!$G$14,$M20,AX$13)=\"\",10^12,OFFSET(PLE!$G$14,$M20,AX$13))))","v":1000000000000},{"$f":"IF($D20<>\"Serviço\",0,IF(OR(AND(AUTOEVENTO=\"Manual\",$M20=1),$M20>(ROW(PLE.lastrow)-ROW(PLE.firstrow))),0,IF(OFFSET(PLE!$G$14,$M20,AY$13)=\"\",10^12,OFFSET(PLE!$G$14,$M20,AY$13))))","v":1000000000000},{"$f":"IF($D20<>\"Serviço\",0,IF(OR(AND(AUTOEVENTO=\"Manual\",$M20=1),$M20>(ROW(PLE.lastrow)-ROW(PLE.firstrow))),0,IF(OFFSET(PLE!$G$14,$M20,AZ$13)=\"\",10^12,OFFSET(PLE!$G$14,$M20,AZ$13))))","v":1000000000000},{"$f":"IF($D20<>\"Serviço\",0,IF(OR(AND(AUTOEVENTO=\"Manual\",$M20=1),$M20>(ROW(PLE.lastrow)-ROW(PLE.firstrow))),0,IF(OFFSET(PLE!$G$14,$M20,BA$13)=\"\",10^12,OFFSET(PLE!$G$14,$M20,BA$13))))","v":1000000000000},{"$f":"IF($D20<>\"Serviço\",0,IF(OR(AND(AUTOEVENTO=\"Manual\",$M20=1),$M20>(ROW(PLE.lastrow)-ROW(PLE.firstrow))),0,IF(OFFSET(PLE!$G$14,$M20,BB$13)=\"\",10^12,OFFSET(PLE!$G$14,$M20,BB$13))))","v":1000000000000},{"$f":"IF($D20<>\"Serviço\",0,IF(OR(AND(AUTOEVENTO=\"Manual\",$M20=1),$M20>(ROW(PLE.lastrow)-ROW(PLE.firstrow))),0,IF(OFFSET(PLE!$G$14,$M20,BC$13)=\"\",10^12,OFFSET(PLE!$G$14,$M20,BC$13))))","v":1000000000000},{"$f":"IF($D20<>\"Serviço\",0,IF(OR(AND(AUTOEVENTO=\"Manual\",$M20=1),$M20>(ROW(PLE.lastrow)-ROW(PLE.firstrow))),0,IF(OFFSET(PLE!$G$14,$M20,BD$13)=\"\",10^12,OFFSET(PLE!$G$14,$M20,BD$13))))","v":1000000000000},{"$f":"IF($D20<>\"Serviço\",0,IF(OR(AND(AUTOEVENTO=\"Manual\",$M20=1),$M20>(ROW(PLE.lastrow)-ROW(PLE.firstrow))),0,IF(OFFSET(PLE!$G$14,$M20,BE$13)=\"\",10^12,OFFSET(PLE!$G$14,$M20,BE$13))))","v":1000000000000},{"$f":"IF($D20<>\"Serviço\",0,IF(OR(AND(AUTOEVENTO=\"Manual\",$M20=1),$M20>(ROW(PLE.lastrow)-ROW(PLE.firstrow))),0,IF(OFFSET(PLE!$G$14,$M20,BF$13)=\"\",10^12,OFFSET(PLE!$G$14,$M20,BF$13))))","v":1000000000000},{"$f":"IF($D20<>\"Serviço\",0,IF(OR(AND(AUTOEVENTO=\"Manual\",$M20=1),$M20>(ROW(PLE.lastrow)-ROW(PLE.firstrow))),0,IF(OFFSET(PLE!$G$14,$M20,BG$13)=\"\",10^12,OFFSET(PLE!$G$14,$M20,BG$13))))","v":1000000000000}]
[{"$f":"IF(AUTOEVENTO=\"Manual\",IF(K21<>\"\",MIN(VALUE(LEFT(K21,FIND(\".\",K21)-1)),COUNTA(EVENTOS.Lista)),0),IF(OR($B21>AUTOEVENTO,$B21=\"S\",$B21=0),SUBSTITUTE(OFFSET($A21,-1,0),IF($D21=\"Serviço\",\".\",\"\"),\"\"),ROW(A21)-ROW($A$15)&\".\"))","v":"6."},{"$f":"OFFSET(ORÇAMENTO!C$15,ROW(B21)-ROW(B$15),0)","v":2},{"$f":"OFFSET(ORÇAMENTO!L$15,ROW(C21)-ROW(C$15),0)","v":"F"},{"$f":"OFFSET(ORÇAMENTO!N$15,ROW(D21)-ROW(D$15),0)","v":"Nível 2"},{"$f":"OFFSET(ORÇAMENTO!O$15,ROW(E21)-ROW(E$15),0)","v":"1.2."},{"$f":"OFFSET(ORÇAMENTO!R$15,ROW(F21)-ROW(F$15),0)","v":"PAVIMENTAÇÃO"},{"$f":"IF($D21<>\"Serviço\",\"\",OFFSET(ORÇAMENTO!S$15,ROW(G21)-ROW(G$15),0))","v":""},{"$f":"IF($D21<>\"Serviço\",0,IF(ACOMPANHAMENTO=\"BM\",ROUND(OFFSET(ORÇAMENTO!AJ$15,ROW(H21)-ROW(H$15),0),15-13*ORÇAMENTO!$AF$7),SUMPRODUCT(($Q$12:$AA$12<>\"\")*ROUND($Q21:$AA21,15-13*ORÇAMENTO!$AF$7))))","v":0},null,null,null,".",{"$f":"IF($D21<>\"Serviço\",\"\",IF(AUTOEVENTO=\"manual\",$A21,IF(ISERROR(MATCH($A21,$A$15:OFFSET($A21,-1,0),0)),MAX($M$15:OFFSET(M21,-1,0))+1,INDEX($M$15:OFFSET(M21,-1,0),MATCH($A21,$A$15:OFFSET($A21,-1,0),0)))))","v":""},{"$f":"IF($D21<>\"Serviço\",\"\",IF(AUTOEVENTO=\"Manual\",IF($A21=0,\"<-- defina o número do agrupador\",OFFSET(EVENTOS!$D$14,$A21,0)),OFFSET($F$15,$A21,0)))","v":""},null,null,null,null,null,null,null,null,null,null,null,null,null,{"$f":"IF(AND($D21=\"Serviço\",AB$12<>0,$H21>0,OR(AUTOEVENTO<>\"manual\",$M21<>1)),\nIF(Import.TipoArredondamento<>\"TransfereGOV\",\nROUND(OFFSET($P21,0,AB$13),15-13*ORÇAMENTO!$AF$7)/$H21*OFFSET(ORÇAMENTO!$X$15,ROW(AB21)-ROW(AB$15),0),\nROUND(ROUND(OFFSET($P21,0,AB$13),15-13*ORÇAMENTO!$AF$7)*OFFSET(ORÇAMENTO!$W$15,ROW(AB21)-ROW(AB$15),0),15-13*ORÇAMENTO!$AF$11)),0)","v":0},{"$f":"IF(AND($D21=\"Serviço\",AC$12<>0,$H21>0,OR(AUTOEVENTO<>\"manual\",$M21<>1)),\nIF(Import.TipoArredondamento<>\"TransfereGOV\",\nROUND(OFFSET($P21,0,AC$13),15-13*ORÇAMENTO!$AF$7)/$H21*OFFSET(ORÇAMENTO!$X$15,ROW(AC21)-ROW(AC$15),0),\nROUND(ROUND(OFFSET($P21,0,AC$13),15-13*ORÇAMENTO!$AF$7)*OFFSET(ORÇAMENTO!$W$15,ROW(AC21)-ROW(AC$15),0),15-13*ORÇAMENTO!$AF$11)),0)","v":0},{"$f":"IF(AND($D21=\"Serviço\",AD$12<>0,$H21>0,OR(AUTOEVENTO<>\"manual\",$M21<>1)),\nIF(Import.TipoArredondamento<>\"TransfereGOV\",\nROUND(OFFSET($P21,0,AD$13),15-13*ORÇAMENTO!$AF$7)/$H21*OFFSET(ORÇAMENTO!$X$15,ROW(AD21)-ROW(AD$15),0),\nROUND(ROUND(OFFSET($P21,0,AD$13),15-13*ORÇAMENTO!$AF$7)*OFFSET(ORÇAMENTO!$W$15,ROW(AD21)-ROW(AD$15),0),15-13*ORÇAMENTO!$AF$11)),0)","v":0},{"$f":"IF(AND($D21=\"Serviço\",AE$12<>0,$H21>0,OR(AUTOEVENTO<>\"manual\",$M21<>1)),\nIF(Import.TipoArredondamento<>\"TransfereGOV\",\nROUND(OFFSET($P21,0,AE$13),15-13*ORÇAMENTO!$AF$7)/$H21*OFFSET(ORÇAMENTO!$X$15,ROW(AE21)-ROW(AE$15),0),\nROUND(ROUND(OFFSET($P21,0,AE$13),15-13*ORÇAMENTO!$AF$7)*OFFSET(ORÇAMENTO!$W$15,ROW(AE21)-ROW(AE$15),0),15-13*ORÇAMENTO!$AF$11)),0)","v":0},{"$f":"IF(AND($D21=\"Serviço\",AF$12<>0,$H21>0,OR(AUTOEVENTO<>\"manual\",$M21<>1)),\nIF(Import.TipoArredondamento<>\"TransfereGOV\",\nROUND(OFFSET($P21,0,AF$13),15-13*ORÇAMENTO!$AF$7)/$H21*OFFSET(ORÇAMENTO!$X$15,ROW(AF21)-ROW(AF$15),0),\nROUND(ROUND(OFFSET($P21,0,AF$13),15-13*ORÇAMENTO!$AF$7)*OFFSET(ORÇAMENTO!$W$15,ROW(AF21)-ROW(AF$15),0),15-13*ORÇAMENTO!$AF$11)),0)","v":0},{"$f":"IF(AND($D21=\"Serviço\",AG$12<>0,$H21>0,OR(AUTOEVENTO<>\"manual\",$M21<>1)),\nIF(Import.TipoArredondamento<>\"TransfereGOV\",\nROUND(OFFSET($P21,0,AG$13),15-13*ORÇAMENTO!$AF$7)/$H21*OFFSET(ORÇAMENTO!$X$15,ROW(AG21)-ROW(AG$15),0),\nROUND(ROUND(OFFSET($P21,0,AG$13),15-13*ORÇAMENTO!$AF$7)*OFFSET(ORÇAMENTO!$W$15,ROW(AG21)-ROW(AG$15),0),15-13*ORÇAMENTO!$AF$11)),0)","v":0},{"$f":"IF(AND($D21=\"Serviço\",AH$12<>0,$H21>0,OR(AUTOEVENTO<>\"manual\",$M21<>1)),\nIF(Import.TipoArredondamento<>\"TransfereGOV\",\nROUND(OFFSET($P21,0,AH$13),15-13*ORÇAMENTO!$AF$7)/$H21*OFFSET(ORÇAMENTO!$X$15,ROW(AH21)-ROW(AH$15),0),\nROUND(ROUND(OFFSET($P21,0,AH$13),15-13*ORÇAMENTO!$AF$7)*OFFSET(ORÇAMENTO!$W$15,ROW(AH21)-ROW(AH$15),0),15-13*ORÇAMENTO!$AF$11)),0)","v":0},{"$f":"IF(AND($D21=\"Serviço\",AI$12<>0,$H21>0,OR(AUTOEVENTO<>\"manual\",$M21<>1)),\nIF(Import.TipoArredondamento<>\"TransfereGOV\",\nROUND(OFFSET($P21,0,AI$13),15-13*ORÇAMENTO!$AF$7)/$H21*OFFSET(ORÇAMENTO!$X$15,ROW(AI21)-ROW(AI$15),0),\nROUND(ROUND(OFFSET($P21,0,AI$13),15-13*ORÇAMENTO!$AF$7)*OFFSET(ORÇAMENTO!$W$15,ROW(AI21)-ROW(AI$15),0),15-13*ORÇAMENTO!$AF$11)),0)","v":0},{"$f":"IF(AND($D21=\"Serviço\",AJ$12<>0,$H21>0,OR(AUTOEVENTO<>\"manual\",$M21<>1)),\nIF(Import.TipoArredondamento<>\"TransfereGOV\",\nROUND(OFFSET($P21,0,AJ$13),15-13*ORÇAMENTO!$AF$7)/$H21*OFFSET(ORÇAMENTO!$X$15,ROW(AJ21)-ROW(AJ$15),0),\nROUND(ROUND(OFFSET($P21,0,AJ$13),15-13*ORÇAMENTO!$AF$7)*OFFSET(ORÇAMENTO!$W$15,ROW(AJ21)-ROW(AJ$15),0),15-13*ORÇAMENTO!$AF$11)),0)","v":0},{"$f":"IF(AND($D21=\"Serviço\",AK$12<>0,$H21>0,OR(AUTOEVENTO<>\"manual\",$M21<>1)),\nIF(Import.TipoArredondamento<>\"TransfereGOV\",\nROUND(OFFSET($P21,0,AK$13),15-13*ORÇAMENTO!$AF$7)/$H21*OFFSET(ORÇAMENTO!$X$15,ROW(AK21)-ROW(AK$15),0),\nROUND(ROUND(OFFSET($P21,0,AK$13),15-13*ORÇAMENTO!$AF$7)*OFFSET(ORÇAMENTO!$W$15,ROW(AK21)-ROW(AK$15),0),15-13*ORÇAMENTO!$AF$11)),0)","v":0},null,{"$f":"IF($D21<>\"Serviço\",0,IF(AND(AUTOEVENTO=\"Manual\",$M21=1),0,IF(OFFSET(CRONOPLE!$F$14,$M21,AM$13)=\"\",10^12,OFFSET(CRONOPLE!$F$14,$M21,AM$13))))","v":0},{"$f":"IF($D21<>\"Serviço\",0,IF(AND(AUTOEVENTO=\"Manual\",$M21=1),0,IF(OFFSET(CRONOPLE!$F$14,$M21,AN$13)=\"\",10^12,OFFSET(CRONOPLE!$F$14,$M21,AN$13))))","v":0},{"$f":"IF($D21<>\"Serviço\",0,IF(AND(AUTOEVENTO=\"Manual\",$M21=1),0,IF(OFFSET(CRONOPLE!$F$14,$M21,AO$13)=\"\",10^12,OFFSET(CRONOPLE!$F$14,$M21,AO$13))))","v":0},{"$f":"IF($D21<>\"Serviço\",0,IF(AND(AUTOEVENTO=\"Manual\",$M21=1),0,IF(OFFSET(CRONOPLE!$F$14,$M21,AP$13)=\"\",10^12,OFFSET(CRONOPLE!$F$14,$M21,AP$13))))","v":0},{"$f":"IF($D21<>\"Serviço\",0,IF(AND(AUTOEVENTO=\"Manual\",$M21=1),0,IF(OFFSET(CRONOPLE!$F$14,$M21,AQ$13)=\"\",10^12,OFFSET(CRONOPLE!$F$14,$M21,AQ$13))))","v":0},{"$f":"IF($D21<>\"Serviço\",0,IF(AND(AUTOEVENTO=\"Manual\",$M21=1),0,IF(OFFSET(CRONOPLE!$F$14,$M21,AR$13)=\"\",10^12,OFFSET(CRONOPLE!$F$14,$M21,AR$13))))","v":0},{"$f":"IF($D21<>\"Serviço\",0,IF(AND(AUTOEVENTO=\"Manual\",$M21=1),0,IF(OFFSET(CRONOPLE!$F$14,$M21,AS$13)=\"\",10^12,OFFSET(CRONOPLE!$F$14,$M21,AS$13))))","v":0},{"$f":"IF($D21<>\"Serviço\",0,IF(AND(AUTOEVENTO=\"Manual\",$M21=1),0,IF(OFFSET(CRONOPLE!$F$14,$M21,AT$13)=\"\",10^12,OFFSET(CRONOPLE!$F$14,$M21,AT$13))))","v":0},{"$f":"IF($D21<>\"Serviço\",0,IF(AND(AUTOEVENTO=\"Manual\",$M21=1),0,IF(OFFSET(CRONOPLE!$F$14,$M21,AU$13)=\"\",10^12,OFFSET(CRONOPLE!$F$14,$M21,AU$13))))","v":0},{"$f":"IF($D21<>\"Serviço\",0,IF(AND(AUTOEVENTO=\"Manual\",$M21=1),0,IF(OFFSET(CRONOPLE!$F$14,$M21,AV$13)=\"\",10^12,OFFSET(CRONOPLE!$F$14,$M21,AV$13))))","v":0},null,{"$f":"IF($D21<>\"Serviço\",0,IF(OR(AND(AUTOEVENTO=\"Manual\",$M21=1),$M21>(ROW(PLE.lastrow)-ROW(PLE.firstrow))),0,IF(OFFSET(PLE!$G$14,$M21,AX$13)=\"\",10^12,OFFSET(PLE!$G$14,$M21,AX$13))))","v":0},{"$f":"IF($D21<>\"Serviço\",0,IF(OR(AND(AUTOEVENTO=\"Manual\",$M21=1),$M21>(ROW(PLE.lastrow)-ROW(PLE.firstrow))),0,IF(OFFSET(PLE!$G$14,$M21,AY$13)=\"\",10^12,OFFSET(PLE!$G$14,$M21,AY$13))))","v":0},{"$f":"IF($D21<>\"Serviço\",0,IF(OR(AND(AUTOEVENTO=\"Manual\",$M21=1),$M21>(ROW(PLE.lastrow)-ROW(PLE.firstrow))),0,IF(OFFSET(PLE!$G$14,$M21,AZ$13)=\"\",10^12,OFFSET(PLE!$G$14,$M21,AZ$13))))","v":0},{"$f":"IF($D21<>\"Serviço\",0,IF(OR(AND(AUTOEVENTO=\"Manual\",$M21=1),$M21>(ROW(PLE.lastrow)-ROW(PLE.firstrow))),0,IF(OFFSET(PLE!$G$14,$M21,BA$13)=\"\",10^12,OFFSET(PLE!$G$14,$M21,BA$13))))","v":0},{"$f":"IF($D21<>\"Serviço\",0,IF(OR(AND(AUTOEVENTO=\"Manual\",$M21=1),$M21>(ROW(PLE.lastrow)-ROW(PLE.firstrow))),0,IF(OFFSET(PLE!$G$14,$M21,BB$13)=\"\",10^12,OFFSET(PLE!$G$14,$M21,BB$13))))","v":0},{"$f":"IF($D21<>\"Serviço\",0,IF(OR(AND(AUTOEVENTO=\"Manual\",$M21=1),$M21>(ROW(PLE.lastrow)-ROW(PLE.firstrow))),0,IF(OFFSET(PLE!$G$14,$M21,BC$13)=\"\",10^12,OFFSET(PLE!$G$14,$M21,BC$13))))","v":0},{"$f":"IF($D21<>\"Serviço\",0,IF(OR(AND(AUTOEVENTO=\"Manual\",$M21=1),$M21>(ROW(PLE.lastrow)-ROW(PLE.firstrow))),0,IF(OFFSET(PLE!$G$14,$M21,BD$13)=\"\",10^12,OFFSET(PLE!$G$14,$M21,BD$13))))","v":0},{"$f":"IF($D21<>\"Serviço\",0,IF(OR(AND(AUTOEVENTO=\"Manual\",$M21=1),$M21>(ROW(PLE.lastrow)-ROW(PLE.firstrow))),0,IF(OFFSET(PLE!$G$14,$M21,BE$13)=\"\",10^12,OFFSET(PLE!$G$14,$M21,BE$13))))","v":0},{"$f":"IF($D21<>\"Serviço\",0,IF(OR(AND(AUTOEVENTO=\"Manual\",$M21=1),$M21>(ROW(PLE.lastrow)-ROW(PLE.firstrow))),0,IF(OFFSET(PLE!$G$14,$M21,BF$13)=\"\",10^12,OFFSET(PLE!$G$14,$M21,BF$13))))","v":0},{"$f":"IF($D21<>\"Serviço\",0,IF(OR(AND(AUTOEVENTO=\"Manual\",$M21=1),$M21>(ROW(PLE.lastrow)-ROW(PLE.firstrow))),0,IF(OFFSET(PLE!$G$14,$M21,BG$13)=\"\",10^12,OFFSET(PLE!$G$14,$M21,BG$13))))","v":0}]
["6",{"$f":"OFFSET(ORÇAMENTO!C$15,ROW(B22)-ROW(B$15),0)","v":"S"},{"$f":"OFFSET(ORÇAMENTO!L$15,ROW(C22)-ROW(C$15),0)","v":"F"},{"$f":"OFFSET(ORÇAMENTO!N$15,ROW(D22)-ROW(D$15),0)","v":"Serviço"},{"$f":"OFFSET(ORÇAMENTO!O$15,ROW(E22)-ROW(E$15),0)","v":"1.2.1."},{"$f":"OFFSET(ORÇAMENTO!R$15,ROW(F22)-ROW(F$15),0)","v":"ASSENTAMENTO DE GUIA (MEIO-FIO) EM TRECHO CURVO, CONFECCIONADA EM CONCRETO PRÉ-FABRICADO, DIMENSÕES 100X15X13X30 CM (COMPRIMENTO X BASE INFERIOR X BASE SUPERIOR X ALTURA). AF_01/2024"},{"$f":"IF($D22<>\"Serviço\",\"\",OFFSET(ORÇAMENTO!S$15,ROW(G22)-ROW(G$15),0))","v":"M"},{"$f":"IF($D22<>\"Serviço\",0,IF(ACOMPANHAMENTO=\"BM\",ROUND(OFFSET(ORÇAMENTO!AJ$15,ROW(H22)-ROW(H$15),0),15-13*ORÇAMENTO!$AF$7),SUMPRODUCT(($Q$12:$AA$12<>\"\")*ROUND($Q22:$AA22,15-13*ORÇAMENTO!$AF$7))))","v":78.02},null,null,null,".",{"$f":"IF($D22<>\"Serviço\",\"\",IF(AUTOEVENTO=\"manual\",$A22,IF(ISERROR(MATCH($A22,$A$15:OFFSET($A22,-1,0),0)),MAX($M$15:OFFSET(M22,-1,0))+1,INDEX($M$15:OFFSET(M22,-1,0),MATCH($A22,$A$15:OFFSET($A22,-1,0),0)))))","v":3},{"$f":"IF($D22<>\"Serviço\",\"\",IF(AUTOEVENTO=\"Manual\",IF($A22=0,\"<-- defina o número do agrupador\",OFFSET(EVENTOS!$D$14,$A22,0)),OFFSET($F$15,$A22,0)))","v":"PAVIMENTAÇÃO"},null,null,null,null,null,null,null,null,null,null,null,null,null,{"$f":"IF(AND($D22=\"Serviço\",AB$12<>0,$H22>0,OR(AUTOEVENTO<>\"manual\",$M22<>1)),\nIF(Import.TipoArredondamento<>\"TransfereGOV\",\nROUND(OFFSET($P22,0,AB$13),15-13*ORÇAMENTO!$AF$7)/$H22*OFFSET(ORÇAMENTO!$X$15,ROW(AB22)-ROW(AB$15),0),\nROUND(ROUND(OFFSET($P22,0,AB$13),15-13*ORÇAMENTO!$AF$7)*OFFSET(ORÇAMENTO!$W$15,ROW(AB22)-ROW(AB$15),0),15-13*ORÇAMENTO!$AF$11)),0)","v":0},{"$f":"IF(AND($D22=\"Serviço\",AC$12<>0,$H22>0,OR(AUTOEVENTO<>\"manual\",$M22<>1)),\nIF(Import.TipoArredondamento<>\"TransfereGOV\",\nROUND(OFFSET($P22,0,AC$13),15-13*ORÇAMENTO!$AF$7)/$H22*OFFSET(ORÇAMENTO!$X$15,ROW(AC22)-ROW(AC$15),0),\nROUND(ROUND(OFFSET($P22,0,AC$13),15-13*ORÇAMENTO!$AF$7)*OFFSET(ORÇAMENTO!$W$15,ROW(AC22)-ROW(AC$15),0),15-13*ORÇAMENTO!$AF$11)),0)","v":0},{"$f":"IF(AND($D22=\"Serviço\",AD$12<>0,$H22>0,OR(AUTOEVENTO<>\"manual\",$M22<>1)),\nIF(Import.TipoArredondamento<>\"TransfereGOV\",\nROUND(OFFSET($P22,0,AD$13),15-13*ORÇAMENTO!$AF$7)/$H22*OFFSET(ORÇAMENTO!$X$15,ROW(AD22)-ROW(AD$15),0),\nROUND(ROUND(OFFSET($P22,0,AD$13),15-13*ORÇAMENTO!$AF$7)*OFFSET(ORÇAMENTO!$W$15,ROW(AD22)-ROW(AD$15),0),15-13*ORÇAMENTO!$AF$11)),0)","v":0},{"$f":"IF(AND($D22=\"Serviço\",AE$12<>0,$H22>0,OR(AUTOEVENTO<>\"manual\",$M22<>1)),\nIF(Import.TipoArredondamento<>\"TransfereGOV\",\nROUND(OFFSET($P22,0,AE$13),15-13*ORÇAMENTO!$AF$7)/$H22*OFFSET(ORÇAMENTO!$X$15,ROW(AE22)-ROW(AE$15),0),\nROUND(ROUND(OFFSET($P22,0,AE$13),15-13*ORÇAMENTO!$AF$7)*OFFSET(ORÇAMENTO!$W$15,ROW(AE22)-ROW(AE$15),0),15-13*ORÇAMENTO!$AF$11)),0)","v":0},{"$f":"IF(AND($D22=\"Serviço\",AF$12<>0,$H22>0,OR(AUTOEVENTO<>\"manual\",$M22<>1)),\nIF(Import.TipoArredondamento<>\"TransfereGOV\",\nROUND(OFFSET($P22,0,AF$13),15-13*ORÇAMENTO!$AF$7)/$H22*OFFSET(ORÇAMENTO!$X$15,ROW(AF22)-ROW(AF$15),0),\nROUND(ROUND(OFFSET($P22,0,AF$13),15-13*ORÇAMENTO!$AF$7)*OFFSET(ORÇAMENTO!$W$15,ROW(AF22)-ROW(AF$15),0),15-13*ORÇAMENTO!$AF$11)),0)","v":0},{"$f":"IF(AND($D22=\"Serviço\",AG$12<>0,$H22>0,OR(AUTOEVENTO<>\"manual\",$M22<>1)),\nIF(Import.TipoArredondamento<>\"TransfereGOV\",\nROUND(OFFSET($P22,0,AG$13),15-13*ORÇAMENTO!$AF$7)/$H22*OFFSET(ORÇAMENTO!$X$15,ROW(AG22)-ROW(AG$15),0),\nROUND(ROUND(OFFSET($P22,0,AG$13),15-13*ORÇAMENTO!$AF$7)*OFFSET(ORÇAMENTO!$W$15,ROW(AG22)-ROW(AG$15),0),15-13*ORÇAMENTO!$AF$11)),0)","v":0},{"$f":"IF(AND($D22=\"Serviço\",AH$12<>0,$H22>0,OR(AUTOEVENTO<>\"manual\",$M22<>1)),\nIF(Import.TipoArredondamento<>\"TransfereGOV\",\nROUND(OFFSET($P22,0,AH$13),15-13*ORÇAMENTO!$AF$7)/$H22*OFFSET(ORÇAMENTO!$X$15,ROW(AH22)-ROW(AH$15),0),\nROUND(ROUND(OFFSET($P22,0,AH$13),15-13*ORÇAMENTO!$AF$7)*OFFSET(ORÇAMENTO!$W$15,ROW(AH22)-ROW(AH$15),0),15-13*ORÇAMENTO!$AF$11)),0)","v":0},{"$f":"IF(AND($D22=\"Serviço\",AI$12<>0,$H22>0,OR(AUTOEVENTO<>\"manual\",$M22<>1)),\nIF(Import.TipoArredondamento<>\"TransfereGOV\",\nROUND(OFFSET($P22,0,AI$13),15-13*ORÇAMENTO!$AF$7)/$H22*OFFSET(ORÇAMENTO!$X$15,ROW(AI22)-ROW(AI$15),0),\nROUND(ROUND(OFFSET($P22,0,AI$13),15-13*ORÇAMENTO!$AF$7)*OFFSET(ORÇAMENTO!$W$15,ROW(AI22)-ROW(AI$15),0),15-13*ORÇAMENTO!$AF$11)),0)","v":0},{"$f":"IF(AND($D22=\"Serviço\",AJ$12<>0,$H22>0,OR(AUTOEVENTO<>\"manual\",$M22<>1)),\nIF(Import.TipoArredondamento<>\"TransfereGOV\",\nROUND(OFFSET($P22,0,AJ$13),15-13*ORÇAMENTO!$AF$7)/$H22*OFFSET(ORÇAMENTO!$X$15,ROW(AJ22)-ROW(AJ$15),0),\nROUND(ROUND(OFFSET($P22,0,AJ$13),15-13*ORÇAMENTO!$AF$7)*OFFSET(ORÇAMENTO!$W$15,ROW(AJ22)-ROW(AJ$15),0),15-13*ORÇAMENTO!$AF$11)),0)","v":0},{"$f":"IF(AND($D22=\"Serviço\",AK$12<>0,$H22>0,OR(AUTOEVENTO<>\"manual\",$M22<>1)),\nIF(Import.TipoArredondamento<>\"TransfereGOV\",\nROUND(OFFSET($P22,0,AK$13),15-13*ORÇAMENTO!$AF$7)/$H22*OFFSET(ORÇAMENTO!$X$15,ROW(AK22)-ROW(AK$15),0),\nROUND(ROUND(OFFSET($P22,0,AK$13),15-13*ORÇAMENTO!$AF$7)*OFFSET(ORÇAMENTO!$W$15,ROW(AK22)-ROW(AK$15),0),15-13*ORÇAMENTO!$AF$11)),0)","v":0},null,{"$f":"IF($D22<>\"Serviço\",0,IF(AND(AUTOEVENTO=\"Manual\",$M22=1),0,IF(OFFSET(CRONOPLE!$F$14,$M22,AM$13)=\"\",10^12,OFFSET(CRONOPLE!$F$14,$M22,AM$13))))","v":1000000000000},{"$f":"IF($D22<>\"Serviço\",0,IF(AND(AUTOEVENTO=\"Manual\",$M22=1),0,IF(OFFSET(CRONOPLE!$F$14,$M22,AN$13)=\"\",10^12,OFFSET(CRONOPLE!$F$14,$M22,AN$13))))","v":1000000000000},{"$f":"IF($D22<>\"Serviço\",0,IF(AND(AUTOEVENTO=\"Manual\",$M22=1),0,IF(OFFSET(CRONOPLE!$F$14,$M22,AO$13)=\"\",10^12,OFFSET(CRONOPLE!$F$14,$M22,AO$13))))","v":1000000000000},{"$f":"IF($D22<>\"Serviço\",0,IF(AND(AUTOEVENTO=\"Manual\",$M22=1),0,IF(OFFSET(CRONOPLE!$F$14,$M22,AP$13)=\"\",10^12,OFFSET(CRONOPLE!$F$14,$M22,AP$13))))","v":1000000000000},{"$f":"IF($D22<>\"Serviço\",0,IF(AND(AUTOEVENTO=\"Manual\",$M22=1),0,IF(OFFSET(CRONOPLE!$F$14,$M22,AQ$13)=\"\",10^12,OFFSET(CRONOPLE!$F$14,$M22,AQ$13))))","v":1000000000000},{"$f":"IF($D22<>\"Serviço\",0,IF(AND(AUTOEVENTO=\"Manual\",$M22=1),0,IF(OFFSET(CRONOPLE!$F$14,$M22,AR$13)=\"\",10^12,OFFSET(CRONOPLE!$F$14,$M22,AR$13))))","v":1000000000000},{"$f":"IF($D22<>\"Serviço\",0,IF(AND(AUTOEVENTO=\"Manual\",$M22=1),0,IF(OFFSET(CRONOPLE!$F$14,$M22,AS$13)=\"\",10^12,OFFSET(CRONOPLE!$F$14,$M22,AS$13))))","v":1000000000000},{"$f":"IF($D22<>\"Serviço\",0,IF(AND(AUTOEVENTO=\"Manual\",$M22=1),0,IF(OFFSET(CRONOPLE!$F$14,$M22,AT$13)=\"\",10^12,OFFSET(CRONOPLE!$F$14,$M22,AT$13))))","v":1000000000000},{"$f":"IF($D22<>\"Serviço\",0,IF(AND(AUTOEVENTO=\"Manual\",$M22=1),0,IF(OFFSET(CRONOPLE!$F$14,$M22,AU$13)=\"\",10^12,OFFSET(CRONOPLE!$F$14,$M22,AU$13))))","v":1000000000000},{"$f":"IF($D22<>\"Serviço\",0,IF(AND(AUTOEVENTO=\"Manual\",$M22=1),0,IF(OFFSET(CRONOPLE!$F$14,$M22,AV$13)=\"\",10^12,OFFSET(CRONOPLE!$F$14,$M22,AV$13))))","v":1000000000000},null,{"$f":"IF($D22<>\"Serviço\",0,IF(OR(AND(AUTOEVENTO=\"Manual\",$M22=1),$M22>(ROW(PLE.lastrow)-ROW(PLE.firstrow))),0,IF(OFFSET(PLE!$G$14,$M22,AX$13)=\"\",10^12,OFFSET(PLE!$G$14,$M22,AX$13))))","v":1000000000000},{"$f":"IF($D22<>\"Serviço\",0,IF(OR(AND(AUTOEVENTO=\"Manual\",$M22=1),$M22>(ROW(PLE.lastrow)-ROW(PLE.firstrow))),0,IF(OFFSET(PLE!$G$14,$M22,AY$13)=\"\",10^12,OFFSET(PLE!$G$14,$M22,AY$13))))","v":1000000000000},{"$f":"IF($D22<>\"Serviço\",0,IF(OR(AND(AUTOEVENTO=\"Manual\",$M22=1),$M22>(ROW(PLE.lastrow)-ROW(PLE.firstrow))),0,IF(OFFSET(PLE!$G$14,$M22,AZ$13)=\"\",10^12,OFFSET(PLE!$G$14,$M22,AZ$13))))","v":1000000000000},{"$f":"IF($D22<>\"Serviço\",0,IF(OR(AND(AUTOEVENTO=\"Manual\",$M22=1),$M22>(ROW(PLE.lastrow)-ROW(PLE.firstrow))),0,IF(OFFSET(PLE!$G$14,$M22,BA$13)=\"\",10^12,OFFSET(PLE!$G$14,$M22,BA$13))))","v":1000000000000},{"$f":"IF($D22<>\"Serviço\",0,IF(OR(AND(AUTOEVENTO=\"Manual\",$M22=1),$M22>(ROW(PLE.lastrow)-ROW(PLE.firstrow))),0,IF(OFFSET(PLE!$G$14,$M22,BB$13)=\"\",10^12,OFFSET(PLE!$G$14,$M22,BB$13))))","v":1000000000000},{"$f":"IF($D22<>\"Serviço\",0,IF(OR(AND(AUTOEVENTO=\"Manual\",$M22=1),$M22>(ROW(PLE.lastrow)-ROW(PLE.firstrow))),0,IF(OFFSET(PLE!$G$14,$M22,BC$13)=\"\",10^12,OFFSET(PLE!$G$14,$M22,BC$13))))","v":1000000000000},{"$f":"IF($D22<>\"Serviço\",0,IF(OR(AND(AUTOEVENTO=\"Manual\",$M22=1),$M22>(ROW(PLE.lastrow)-ROW(PLE.firstrow))),0,IF(OFFSET(PLE!$G$14,$M22,BD$13)=\"\",10^12,OFFSET(PLE!$G$14,$M22,BD$13))))","v":1000000000000},{"$f":"IF($D22<>\"Serviço\",0,IF(OR(AND(AUTOEVENTO=\"Manual\",$M22=1),$M22>(ROW(PLE.lastrow)-ROW(PLE.firstrow))),0,IF(OFFSET(PLE!$G$14,$M22,BE$13)=\"\",10^12,OFFSET(PLE!$G$14,$M22,BE$13))))","v":1000000000000},{"$f":"IF($D22<>\"Serviço\",0,IF(OR(AND(AUTOEVENTO=\"Manual\",$M22=1),$M22>(ROW(PLE.lastrow)-ROW(PLE.firstrow))),0,IF(OFFSET(PLE!$G$14,$M22,BF$13)=\"\",10^12,OFFSET(PLE!$G$14,$M22,BF$13))))","v":1000000000000},{"$f":"IF($D22<>\"Serviço\",0,IF(OR(AND(AUTOEVENTO=\"Manual\",$M22=1),$M22>(ROW(PLE.lastrow)-ROW(PLE.firstrow))),0,IF(OFFSET(PLE!$G$14,$M22,BG$13)=\"\",10^12,OFFSET(PLE!$G$14,$M22,BG$13))))","v":1000000000000}]
["6",{"$f":"OFFSET(ORÇAMENTO!C$15,ROW(B23)-ROW(B$15),0)","v":"S"},{"$f":"OFFSET(ORÇAMENTO!L$15,ROW(C23)-ROW(C$15),0)","v":"F"},{"$f":"OFFSET(ORÇAMENTO!N$15,ROW(D23)-ROW(D$15),0)","v":"Serviço"},{"$f":"OFFSET(ORÇAMENTO!O$15,ROW(E23)-ROW(E$15),0)","v":"1.2.2."},{"$f":"OFFSET(ORÇAMENTO!R$15,ROW(F23)-ROW(F$15),0)","v":"ASSENTAMENTO DE GUIA (MEIO-FIO) EM TRECHO RETO, CONFECCIONADA EM CONCRETO PRÉ-FABRICADO, DIMENSÕES 100X15X13X30 CM (COMPRIMENTO X BASE INFERIOR X BASE SUPERIOR X ALTURA). AF_01/2024"},{"$f":"IF($D23<>\"Serviço\",\"\",OFFSET(ORÇAMENTO!S$15,ROW(G23)-ROW(G$15),0))","v":"M"},{"$f":"IF($D23<>\"Serviço\",0,IF(ACOMPANHAMENTO=\"BM\",ROUND(OFFSET(ORÇAMENTO!AJ$15,ROW(H23)-ROW(H$15),0),15-13*ORÇAMENTO!$AF$7),SUMPRODUCT(($Q$12:$AA$12<>\"\")*ROUND($Q23:$AA23,15-13*ORÇAMENTO!$AF$7))))","v":198.57},null,null,null,".",{"$f":"IF($D23<>\"Serviço\",\"\",IF(AUTOEVENTO=\"manual\",$A23,IF(ISERROR(MATCH($A23,$A$15:OFFSET($A23,-1,0),0)),MAX($M$15:OFFSET(M23,-1,0))+1,INDEX($M$15:OFFSET(M23,-1,0),MATCH($A23,$A$15:OFFSET($A23,-1,0),0)))))","v":3},{"$f":"IF($D23<>\"Serviço\",\"\",IF(AUTOEVENTO=\"Manual\",IF($A23=0,\"<-- defina o número do agrupador\",OFFSET(EVENTOS!$D$14,$A23,0)),OFFSET($F$15,$A23,0)))","v":"PAVIMENTAÇÃO"},null,null,null,null,null,null,null,null,null,null,null,null,null,{"$f":"IF(AND($D23=\"Serviço\",AB$12<>0,$H23>0,OR(AUTOEVENTO<>\"manual\",$M23<>1)),\nIF(Import.TipoArredondamento<>\"TransfereGOV\",\nROUND(OFFSET($P23,0,AB$13),15-13*ORÇAMENTO!$AF$7)/$H23*OFFSET(ORÇAMENTO!$X$15,ROW(AB23)-ROW(AB$15),0),\nROUND(ROUND(OFFSET($P23,0,AB$13),15-13*ORÇAMENTO!$AF$7)*OFFSET(ORÇAMENTO!$W$15,ROW(AB23)-ROW(AB$15),0),15-13*ORÇAMENTO!$AF$11)),0)","v":0},{"$f":"IF(AND($D23=\"Serviço\",AC$12<>0,$H23>0,OR(AUTOEVENTO<>\"manual\",$M23<>1)),\nIF(Import.TipoArredondamento<>\"TransfereGOV\",\nROUND(OFFSET($P23,0,AC$13),15-13*ORÇAMENTO!$AF$7)/$H23*OFFSET(ORÇAMENTO!$X$15,ROW(AC23)-ROW(AC$15),0),\nROUND(ROUND(OFFSET($P23,0,AC$13),15-13*ORÇAMENTO!$AF$7)*OFFSET(ORÇAMENTO!$W$15,ROW(AC23)-ROW(AC$15),0),15-13*ORÇAMENTO!$AF$11)),0)","v":0},{"$f":"IF(AND($D23=\"Serviço\",AD$12<>0,$H23>0,OR(AUTOEVENTO<>\"manual\",$M23<>1)),\nIF(Import.TipoArredondamento<>\"TransfereGOV\",\nROUND(OFFSET($P23,0,AD$13),15-13*ORÇAMENTO!$AF$7)/$H23*OFFSET(ORÇAMENTO!$X$15,ROW(AD23)-ROW(AD$15),0),\nROUND(ROUND(OFFSET($P23,0,AD$13),15-13*ORÇAMENTO!$AF$7)*OFFSET(ORÇAMENTO!$W$15,ROW(AD23)-ROW(AD$15),0),15-13*ORÇAMENTO!$AF$11)),0)","v":0},{"$f":"IF(AND($D23=\"Serviço\",AE$12<>0,$H23>0,OR(AUTOEVENTO<>\"manual\",$M23<>1)),\nIF(Import.TipoArredondamento<>\"TransfereGOV\",\nROUND(OFFSET($P23,0,AE$13),15-13*ORÇAMENTO!$AF$7)/$H23*OFFSET(ORÇAMENTO!$X$15,ROW(AE23)-ROW(AE$15),0),\nROUND(ROUND(OFFSET($P23,0,AE$13),15-13*ORÇAMENTO!$AF$7)*OFFSET(ORÇAMENTO!$W$15,ROW(AE23)-ROW(AE$15),0),15-13*ORÇAMENTO!$AF$11)),0)","v":0},{"$f":"IF(AND($D23=\"Serviço\",AF$12<>0,$H23>0,OR(AUTOEVENTO<>\"manual\",$M23<>1)),\nIF(Import.TipoArredondamento<>\"TransfereGOV\",\nROUND(OFFSET($P23,0,AF$13),15-13*ORÇAMENTO!$AF$7)/$H23*OFFSET(ORÇAMENTO!$X$15,ROW(AF23)-ROW(AF$15),0),\nROUND(ROUND(OFFSET($P23,0,AF$13),15-13*ORÇAMENTO!$AF$7)*OFFSET(ORÇAMENTO!$W$15,ROW(AF23)-ROW(AF$15),0),15-13*ORÇAMENTO!$AF$11)),0)","v":0},{"$f":"IF(AND($D23=\"Serviço\",AG$12<>0,$H23>0,OR(AUTOEVENTO<>\"manual\",$M23<>1)),\nIF(Import.TipoArredondamento<>\"TransfereGOV\",\nROUND(OFFSET($P23,0,AG$13),15-13*ORÇAMENTO!$AF$7)/$H23*OFFSET(ORÇAMENTO!$X$15,ROW(AG23)-ROW(AG$15),0),\nROUND(ROUND(OFFSET($P23,0,AG$13),15-13*ORÇAMENTO!$AF$7)*OFFSET(ORÇAMENTO!$W$15,ROW(AG23)-ROW(AG$15),0),15-13*ORÇAMENTO!$AF$11)),0)","v":0},{"$f":"IF(AND($D23=\"Serviço\",AH$12<>0,$H23>0,OR(AUTOEVENTO<>\"manual\",$M23<>1)),\nIF(Import.TipoArredondamento<>\"TransfereGOV\",\nROUND(OFFSET($P23,0,AH$13),15-13*ORÇAMENTO!$AF$7)/$H23*OFFSET(ORÇAMENTO!$X$15,ROW(AH23)-ROW(AH$15),0),\nROUND(ROUND(OFFSET($P23,0,AH$13),15-13*ORÇAMENTO!$AF$7)*OFFSET(ORÇAMENTO!$W$15,ROW(AH23)-ROW(AH$15),0),15-13*ORÇAMENTO!$AF$11)),0)","v":0},{"$f":"IF(AND($D23=\"Serviço\",AI$12<>0,$H23>0,OR(AUTOEVENTO<>\"manual\",$M23<>1)),\nIF(Import.TipoArredondamento<>\"TransfereGOV\",\nROUND(OFFSET($P23,0,AI$13),15-13*ORÇAMENTO!$AF$7)/$H23*OFFSET(ORÇAMENTO!$X$15,ROW(AI23)-ROW(AI$15),0),\nROUND(ROUND(OFFSET($P23,0,AI$13),15-13*ORÇAMENTO!$AF$7)*OFFSET(ORÇAMENTO!$W$15,ROW(AI23)-ROW(AI$15),0),15-13*ORÇAMENTO!$AF$11)),0)","v":0},{"$f":"IF(AND($D23=\"Serviço\",AJ$12<>0,$H23>0,OR(AUTOEVENTO<>\"manual\",$M23<>1)),\nIF(Import.TipoArredondamento<>\"TransfereGOV\",\nROUND(OFFSET($P23,0,AJ$13),15-13*ORÇAMENTO!$AF$7)/$H23*OFFSET(ORÇAMENTO!$X$15,ROW(AJ23)-ROW(AJ$15),0),\nROUND(ROUND(OFFSET($P23,0,AJ$13),15-13*ORÇAMENTO!$AF$7)*OFFSET(ORÇAMENTO!$W$15,ROW(AJ23)-ROW(AJ$15),0),15-13*ORÇAMENTO!$AF$11)),0)","v":0},{"$f":"IF(AND($D23=\"Serviço\",AK$12<>0,$H23>0,OR(AUTOEVENTO<>\"manual\",$M23<>1)),\nIF(Import.TipoArredondamento<>\"TransfereGOV\",\nROUND(OFFSET($P23,0,AK$13),15-13*ORÇAMENTO!$AF$7)/$H23*OFFSET(ORÇAMENTO!$X$15,ROW(AK23)-ROW(AK$15),0),\nROUND(ROUND(OFFSET($P23,0,AK$13),15-13*ORÇAMENTO!$AF$7)*OFFSET(ORÇAMENTO!$W$15,ROW(AK23)-ROW(AK$15),0),15-13*ORÇAMENTO!$AF$11)),0)","v":0},null,{"$f":"IF($D23<>\"Serviço\",0,IF(AND(AUTOEVENTO=\"Manual\",$M23=1),0,IF(OFFSET(CRONOPLE!$F$14,$M23,AM$13)=\"\",10^12,OFFSET(CRONOPLE!$F$14,$M23,AM$13))))","v":1000000000000},{"$f":"IF($D23<>\"Serviço\",0,IF(AND(AUTOEVENTO=\"Manual\",$M23=1),0,IF(OFFSET(CRONOPLE!$F$14,$M23,AN$13)=\"\",10^12,OFFSET(CRONOPLE!$F$14,$M23,AN$13))))","v":1000000000000},{"$f":"IF($D23<>\"Serviço\",0,IF(AND(AUTOEVENTO=\"Manual\",$M23=1),0,IF(OFFSET(CRONOPLE!$F$14,$M23,AO$13)=\"\",10^12,OFFSET(CRONOPLE!$F$14,$M23,AO$13))))","v":1000000000000},{"$f":"IF($D23<>\"Serviço\",0,IF(AND(AUTOEVENTO=\"Manual\",$M23=1),0,IF(OFFSET(CRONOPLE!$F$14,$M23,AP$13)=\"\",10^12,OFFSET(CRONOPLE!$F$14,$M23,AP$13))))","v":1000000000000},{"$f":"IF($D23<>\"Serviço\",0,IF(AND(AUTOEVENTO=\"Manual\",$M23=1),0,IF(OFFSET(CRONOPLE!$F$14,$M23,AQ$13)=\"\",10^12,OFFSET(CRONOPLE!$F$14,$M23,AQ$13))))","v":1000000000000},{"$f":"IF($D23<>\"Serviço\",0,IF(AND(AUTOEVENTO=\"Manual\",$M23=1),0,IF(OFFSET(CRONOPLE!$F$14,$M23,AR$13)=\"\",10^12,OFFSET(CRONOPLE!$F$14,$M23,AR$13))))","v":1000000000000},{"$f":"IF($D23<>\"Serviço\",0,IF(AND(AUTOEVENTO=\"Manual\",$M23=1),0,IF(OFFSET(CRONOPLE!$F$14,$M23,AS$13)=\"\",10^12,OFFSET(CRONOPLE!$F$14,$M23,AS$13))))","v":1000000000000},{"$f":"IF($D23<>\"Serviço\",0,IF(AND(AUTOEVENTO=\"Manual\",$M23=1),0,IF(OFFSET(CRONOPLE!$F$14,$M23,AT$13)=\"\",10^12,OFFSET(CRONOPLE!$F$14,$M23,AT$13))))","v":1000000000000},{"$f":"IF($D23<>\"Serviço\",0,IF(AND(AUTOEVENTO=\"Manual\",$M23=1),0,IF(OFFSET(CRONOPLE!$F$14,$M23,AU$13)=\"\",10^12,OFFSET(CRONOPLE!$F$14,$M23,AU$13))))","v":1000000000000},{"$f":"IF($D23<>\"Serviço\",0,IF(AND(AUTOEVENTO=\"Manual\",$M23=1),0,IF(OFFSET(CRONOPLE!$F$14,$M23,AV$13)=\"\",10^12,OFFSET(CRONOPLE!$F$14,$M23,AV$13))))","v":1000000000000},null,{"$f":"IF($D23<>\"Serviço\",0,IF(OR(AND(AUTOEVENTO=\"Manual\",$M23=1),$M23>(ROW(PLE.lastrow)-ROW(PLE.firstrow))),0,IF(OFFSET(PLE!$G$14,$M23,AX$13)=\"\",10^12,OFFSET(PLE!$G$14,$M23,AX$13))))","v":1000000000000},{"$f":"IF($D23<>\"Serviço\",0,IF(OR(AND(AUTOEVENTO=\"Manual\",$M23=1),$M23>(ROW(PLE.lastrow)-ROW(PLE.firstrow))),0,IF(OFFSET(PLE!$G$14,$M23,AY$13)=\"\",10^12,OFFSET(PLE!$G$14,$M23,AY$13))))","v":1000000000000},{"$f":"IF($D23<>\"Serviço\",0,IF(OR(AND(AUTOEVENTO=\"Manual\",$M23=1),$M23>(ROW(PLE.lastrow)-ROW(PLE.firstrow))),0,IF(OFFSET(PLE!$G$14,$M23,AZ$13)=\"\",10^12,OFFSET(PLE!$G$14,$M23,AZ$13))))","v":1000000000000},{"$f":"IF($D23<>\"Serviço\",0,IF(OR(AND(AUTOEVENTO=\"Manual\",$M23=1),$M23>(ROW(PLE.lastrow)-ROW(PLE.firstrow))),0,IF(OFFSET(PLE!$G$14,$M23,BA$13)=\"\",10^12,OFFSET(PLE!$G$14,$M23,BA$13))))","v":1000000000000},{"$f":"IF($D23<>\"Serviço\",0,IF(OR(AND(AUTOEVENTO=\"Manual\",$M23=1),$M23>(ROW(PLE.lastrow)-ROW(PLE.firstrow))),0,IF(OFFSET(PLE!$G$14,$M23,BB$13)=\"\",10^12,OFFSET(PLE!$G$14,$M23,BB$13))))","v":1000000000000},{"$f":"IF($D23<>\"Serviço\",0,IF(OR(AND(AUTOEVENTO=\"Manual\",$M23=1),$M23>(ROW(PLE.lastrow)-ROW(PLE.firstrow))),0,IF(OFFSET(PLE!$G$14,$M23,BC$13)=\"\",10^12,OFFSET(PLE!$G$14,$M23,BC$13))))","v":1000000000000},{"$f":"IF($D23<>\"Serviço\",0,IF(OR(AND(AUTOEVENTO=\"Manual\",$M23=1),$M23>(ROW(PLE.lastrow)-ROW(PLE.firstrow))),0,IF(OFFSET(PLE!$G$14,$M23,BD$13)=\"\",10^12,OFFSET(PLE!$G$14,$M23,BD$13))))","v":1000000000000},{"$f":"IF($D23<>\"Serviço\",0,IF(OR(AND(AUTOEVENTO=\"Manual\",$M23=1),$M23>(ROW(PLE.lastrow)-ROW(PLE.firstrow))),0,IF(OFFSET(PLE!$G$14,$M23,BE$13)=\"\",10^12,OFFSET(PLE!$G$14,$M23,BE$13))))","v":1000000000000},{"$f":"IF($D23<>\"Serviço\",0,IF(OR(AND(AUTOEVENTO=\"Manual\",$M23=1),$M23>(ROW(PLE.lastrow)-ROW(PLE.firstrow))),0,IF(OFFSET(PLE!$G$14,$M23,BF$13)=\"\",10^12,OFFSET(PLE!$G$14,$M23,BF$13))))","v":1000000000000},{"$f":"IF($D23<>\"Serviço\",0,IF(OR(AND(AUTOEVENTO=\"Manual\",$M23=1),$M23>(ROW(PLE.lastrow)-ROW(PLE.firstrow))),0,IF(OFFSET(PLE!$G$14,$M23,BG$13)=\"\",10^12,OFFSET(PLE!$G$14,$M23,BG$13))))","v":1000000000000}]
["6",{"$f":"OFFSET(ORÇAMENTO!C$15,ROW(B24)-ROW(B$15),0)","v":"S"},{"$f":"OFFSET(ORÇAMENTO!L$15,ROW(C24)-ROW(C$15),0)","v":"F"},{"$f":"OFFSET(ORÇAMENTO!N$15,ROW(D24)-ROW(D$15),0)","v":"Serviço"},{"$f":"OFFSET(ORÇAMENTO!O$15,ROW(E24)-ROW(E$15),0)","v":"1.2.3."},{"$f":"OFFSET(ORÇAMENTO!R$15,ROW(F24)-ROW(F$15),0)","v":"EXECUÇÃO DE PAVIMENTO EM PISO INTERTRAVADO, COM BLOCO RETANGULAR COR NATURAL DE 20 X 10 CM, ESPESSURA 8 CM. AF_10/2022"},{"$f":"IF($D24<>\"Serviço\",\"\",OFFSET(ORÇAMENTO!S$15,ROW(G24)-ROW(G$15),0))","v":"M2"},{"$f":"IF($D24<>\"Serviço\",0,IF(ACOMPANHAMENTO=\"BM\",ROUND(OFFSET(ORÇAMENTO!AJ$15,ROW(H24)-ROW(H$15),0),15-13*ORÇAMENTO!$AF$7),SUMPRODUCT(($Q$12:$AA$12<>\"\")*ROUND($Q24:$AA24,15-13*ORÇAMENTO!$AF$7))))","v":567.4},null,null,null,".",{"$f":"IF($D24<>\"Serviço\",\"\",IF(AUTOEVENTO=\"manual\",$A24,IF(ISERROR(MATCH($A24,$A$15:OFFSET($A24,-1,0),0)),MAX($M$15:OFFSET(M24,-1,0))+1,INDEX($M$15:OFFSET(M24,-1,0),MATCH($A24,$A$15:OFFSET($A24,-1,0),0)))))","v":3},{"$f":"IF($D24<>\"Serviço\",\"\",IF(AUTOEVENTO=\"Manual\",IF($A24=0,\"<-- defina o número do agrupador\",OFFSET(EVENTOS!$D$14,$A24,0)),OFFSET($F$15,$A24,0)))","v":"PAVIMENTAÇÃO"},null,null,null,null,null,null,null,null,null,null,null,null,null,{"$f":"IF(AND($D24=\"Serviço\",AB$12<>0,$H24>0,OR(AUTOEVENTO<>\"manual\",$M24<>1)),\nIF(Import.TipoArredondamento<>\"TransfereGOV\",\nROUND(OFFSET($P24,0,AB$13),15-13*ORÇAMENTO!$AF$7)/$H24*OFFSET(ORÇAMENTO!$X$15,ROW(AB24)-ROW(AB$15),0),\nROUND(ROUND(OFFSET($P24,0,AB$13),15-13*ORÇAMENTO!$AF$7)*OFFSET(ORÇAMENTO!$W$15,ROW(AB24)-ROW(AB$15),0),15-13*ORÇAMENTO!$AF$11)),0)","v":0},{"$f":"IF(AND($D24=\"Serviço\",AC$12<>0,$H24>0,OR(AUTOEVENTO<>\"manual\",$M24<>1)),\nIF(Import.TipoArredondamento<>\"TransfereGOV\",\nROUND(OFFSET($P24,0,AC$13),15-13*ORÇAMENTO!$AF$7)/$H24*OFFSET(ORÇAMENTO!$X$15,ROW(AC24)-ROW(AC$15),0),\nROUND(ROUND(OFFSET($P24,0,AC$13),15-13*ORÇAMENTO!$AF$7)*OFFSET(ORÇAMENTO!$W$15,ROW(AC24)-ROW(AC$15),0),15-13*ORÇAMENTO!$AF$11)),0)","v":0},{"$f":"IF(AND($D24=\"Serviço\",AD$12<>0,$H24>0,OR(AUTOEVENTO<>\"manual\",$M24<>1)),\nIF(Import.TipoArredondamento<>\"TransfereGOV\",\nROUND(OFFSET($P24,0,AD$13),15-13*ORÇAMENTO!$AF$7)/$H24*OFFSET(ORÇAMENTO!$X$15,ROW(AD24)-ROW(AD$15),0),\nROUND(ROUND(OFFSET($P24,0,AD$13),15-13*ORÇAMENTO!$AF$7)*OFFSET(ORÇAMENTO!$W$15,ROW(AD24)-ROW(AD$15),0),15-13*ORÇAMENTO!$AF$11)),0)","v":0},{"$f":"IF(AND($D24=\"Serviço\",AE$12<>0,$H24>0,OR(AUTOEVENTO<>\"manual\",$M24<>1)),\nIF(Import.TipoArredondamento<>\"TransfereGOV\",\nROUND(OFFSET($P24,0,AE$13),15-13*ORÇAMENTO!$AF$7)/$H24*OFFSET(ORÇAMENTO!$X$15,ROW(AE24)-ROW(AE$15),0),\nROUND(ROUND(OFFSET($P24,0,AE$13),15-13*ORÇAMENTO!$AF$7)*OFFSET(ORÇAMENTO!$W$15,ROW(AE24)-ROW(AE$15),0),15-13*ORÇAMENTO!$AF$11)),0)","v":0},{"$f":"IF(AND($D24=\"Serviço\",AF$12<>0,$H24>0,OR(AUTOEVENTO<>\"manual\",$M24<>1)),\nIF(Import.TipoArredondamento<>\"TransfereGOV\",\nROUND(OFFSET($P24,0,AF$13),15-13*ORÇAMENTO!$AF$7)/$H24*OFFSET(ORÇAMENTO!$X$15,ROW(AF24)-ROW(AF$15),0),\nROUND(ROUND(OFFSET($P24,0,AF$13),15-13*ORÇAMENTO!$AF$7)*OFFSET(ORÇAMENTO!$W$15,ROW(AF24)-ROW(AF$15),0),15-13*ORÇAMENTO!$AF$11)),0)","v":0},{"$f":"IF(AND($D24=\"Serviço\",AG$12<>0,$H24>0,OR(AUTOEVENTO<>\"manual\",$M24<>1)),\nIF(Import.TipoArredondamento<>\"TransfereGOV\",\nROUND(OFFSET($P24,0,AG$13),15-13*ORÇAMENTO!$AF$7)/$H24*OFFSET(ORÇAMENTO!$X$15,ROW(AG24)-ROW(AG$15),0),\nROUND(ROUND(OFFSET($P24,0,AG$13),15-13*ORÇAMENTO!$AF$7)*OFFSET(ORÇAMENTO!$W$15,ROW(AG24)-ROW(AG$15),0),15-13*ORÇAMENTO!$AF$11)),0)","v":0},{"$f":"IF(AND($D24=\"Serviço\",AH$12<>0,$H24>0,OR(AUTOEVENTO<>\"manual\",$M24<>1)),\nIF(Import.TipoArredondamento<>\"TransfereGOV\",\nROUND(OFFSET($P24,0,AH$13),15-13*ORÇAMENTO!$AF$7)/$H24*OFFSET(ORÇAMENTO!$X$15,ROW(AH24)-ROW(AH$15),0),\nROUND(ROUND(OFFSET($P24,0,AH$13),15-13*ORÇAMENTO!$AF$7)*OFFSET(ORÇAMENTO!$W$15,ROW(AH24)-ROW(AH$15),0),15-13*ORÇAMENTO!$AF$11)),0)","v":0},{"$f":"IF(AND($D24=\"Serviço\",AI$12<>0,$H24>0,OR(AUTOEVENTO<>\"manual\",$M24<>1)),\nIF(Import.TipoArredondamento<>\"TransfereGOV\",\nROUND(OFFSET($P24,0,AI$13),15-13*ORÇAMENTO!$AF$7)/$H24*OFFSET(ORÇAMENTO!$X$15,ROW(AI24)-ROW(AI$15),0),\nROUND(ROUND(OFFSET($P24,0,AI$13),15-13*ORÇAMENTO!$AF$7)*OFFSET(ORÇAMENTO!$W$15,ROW(AI24)-ROW(AI$15),0),15-13*ORÇAMENTO!$AF$11)),0)","v":0},{"$f":"IF(AND($D24=\"Serviço\",AJ$12<>0,$H24>0,OR(AUTOEVENTO<>\"manual\",$M24<>1)),\nIF(Import.TipoArredondamento<>\"TransfereGOV\",\nROUND(OFFSET($P24,0,AJ$13),15-13*ORÇAMENTO!$AF$7)/$H24*OFFSET(ORÇAMENTO!$X$15,ROW(AJ24)-ROW(AJ$15),0),\nROUND(ROUND(OFFSET($P24,0,AJ$13),15-13*ORÇAMENTO!$AF$7)*OFFSET(ORÇAMENTO!$W$15,ROW(AJ24)-ROW(AJ$15),0),15-13*ORÇAMENTO!$AF$11)),0)","v":0},{"$f":"IF(AND($D24=\"Serviço\",AK$12<>0,$H24>0,OR(AUTOEVENTO<>\"manual\",$M24<>1)),\nIF(Import.TipoArredondamento<>\"TransfereGOV\",\nROUND(OFFSET($P24,0,AK$13),15-13*ORÇAMENTO!$AF$7)/$H24*OFFSET(ORÇAMENTO!$X$15,ROW(AK24)-ROW(AK$15),0),\nROUND(ROUND(OFFSET($P24,0,AK$13),15-13*ORÇAMENTO!$AF$7)*OFFSET(ORÇAMENTO!$W$15,ROW(AK24)-ROW(AK$15),0),15-13*ORÇAMENTO!$AF$11)),0)","v":0},null,{"$f":"IF($D24<>\"Serviço\",0,IF(AND(AUTOEVENTO=\"Manual\",$M24=1),0,IF(OFFSET(CRONOPLE!$F$14,$M24,AM$13)=\"\",10^12,OFFSET(CRONOPLE!$F$14,$M24,AM$13))))","v":1000000000000},{"$f":"IF($D24<>\"Serviço\",0,IF(AND(AUTOEVENTO=\"Manual\",$M24=1),0,IF(OFFSET(CRONOPLE!$F$14,$M24,AN$13)=\"\",10^12,OFFSET(CRONOPLE!$F$14,$M24,AN$13))))","v":1000000000000},{"$f":"IF($D24<>\"Serviço\",0,IF(AND(AUTOEVENTO=\"Manual\",$M24=1),0,IF(OFFSET(CRONOPLE!$F$14,$M24,AO$13)=\"\",10^12,OFFSET(CRONOPLE!$F$14,$M24,AO$13))))","v":1000000000000},{"$f":"IF($D24<>\"Serviço\",0,IF(AND(AUTOEVENTO=\"Manual\",$M24=1),0,IF(OFFSET(CRONOPLE!$F$14,$M24,AP$13)=\"\",10^12,OFFSET(CRONOPLE!$F$14,$M24,AP$13))))","v":1000000000000},{"$f":"IF($D24<>\"Serviço\",0,IF(AND(AUTOEVENTO=\"Manual\",$M24=1),0,IF(OFFSET(CRONOPLE!$F$14,$M24,AQ$13)=\"\",10^12,OFFSET(CRONOPLE!$F$14,$M24,AQ$13))))","v":1000000000000},{"$f":"IF($D24<>\"Serviço\",0,IF(AND(AUTOEVENTO=\"Manual\",$M24=1),0,IF(OFFSET(CRONOPLE!$F$14,$M24,AR$13)=\"\",10^12,OFFSET(CRONOPLE!$F$14,$M24,AR$13))))","v":1000000000000},{"$f":"IF($D24<>\"Serviço\",0,IF(AND(AUTOEVENTO=\"Manual\",$M24=1),0,IF(OFFSET(CRONOPLE!$F$14,$M24,AS$13)=\"\",10^12,OFFSET(CRONOPLE!$F$14,$M24,AS$13))))","v":1000000000000},{"$f":"IF($D24<>\"Serviço\",0,IF(AND(AUTOEVENTO=\"Manual\",$M24=1),0,IF(OFFSET(CRONOPLE!$F$14,$M24,AT$13)=\"\",10^12,OFFSET(CRONOPLE!$F$14,$M24,AT$13))))","v":1000000000000},{"$f":"IF($D24<>\"Serviço\",0,IF(AND(AUTOEVENTO=\"Manual\",$M24=1),0,IF(OFFSET(CRONOPLE!$F$14,$M24,AU$13)=\"\",10^12,OFFSET(CRONOPLE!$F$14,$M24,AU$13))))","v":1000000000000},{"$f":"IF($D24<>\"Serviço\",0,IF(AND(AUTOEVENTO=\"Manual\",$M24=1),0,IF(OFFSET(CRONOPLE!$F$14,$M24,AV$13)=\"\",10^12,OFFSET(CRONOPLE!$F$14,$M24,AV$13))))","v":1000000000000},null,{"$f":"IF($D24<>\"Serviço\",0,IF(OR(AND(AUTOEVENTO=\"Manual\",$M24=1),$M24>(ROW(PLE.lastrow)-ROW(PLE.firstrow))),0,IF(OFFSET(PLE!$G$14,$M24,AX$13)=\"\",10^12,OFFSET(PLE!$G$14,$M24,AX$13))))","v":1000000000000},{"$f":"IF($D24<>\"Serviço\",0,IF(OR(AND(AUTOEVENTO=\"Manual\",$M24=1),$M24>(ROW(PLE.lastrow)-ROW(PLE.firstrow))),0,IF(OFFSET(PLE!$G$14,$M24,AY$13)=\"\",10^12,OFFSET(PLE!$G$14,$M24,AY$13))))","v":1000000000000},{"$f":"IF($D24<>\"Serviço\",0,IF(OR(AND(AUTOEVENTO=\"Manual\",$M24=1),$M24>(ROW(PLE.lastrow)-ROW(PLE.firstrow))),0,IF(OFFSET(PLE!$G$14,$M24,AZ$13)=\"\",10^12,OFFSET(PLE!$G$14,$M24,AZ$13))))","v":1000000000000},{"$f":"IF($D24<>\"Serviço\",0,IF(OR(AND(AUTOEVENTO=\"Manual\",$M24=1),$M24>(ROW(PLE.lastrow)-ROW(PLE.firstrow))),0,IF(OFFSET(PLE!$G$14,$M24,BA$13)=\"\",10^12,OFFSET(PLE!$G$14,$M24,BA$13))))","v":1000000000000},{"$f":"IF($D24<>\"Serviço\",0,IF(OR(AND(AUTOEVENTO=\"Manual\",$M24=1),$M24>(ROW(PLE.lastrow)-ROW(PLE.firstrow))),0,IF(OFFSET(PLE!$G$14,$M24,BB$13)=\"\",10^12,OFFSET(PLE!$G$14,$M24,BB$13))))","v":1000000000000},{"$f":"IF($D24<>\"Serviço\",0,IF(OR(AND(AUTOEVENTO=\"Manual\",$M24=1),$M24>(ROW(PLE.lastrow)-ROW(PLE.firstrow))),0,IF(OFFSET(PLE!$G$14,$M24,BC$13)=\"\",10^12,OFFSET(PLE!$G$14,$M24,BC$13))))","v":1000000000000},{"$f":"IF($D24<>\"Serviço\",0,IF(OR(AND(AUTOEVENTO=\"Manual\",$M24=1),$M24>(ROW(PLE.lastrow)-ROW(PLE.firstrow))),0,IF(OFFSET(PLE!$G$14,$M24,BD$13)=\"\",10^12,OFFSET(PLE!$G$14,$M24,BD$13))))","v":1000000000000},{"$f":"IF($D24<>\"Serviço\",0,IF(OR(AND(AUTOEVENTO=\"Manual\",$M24=1),$M24>(ROW(PLE.lastrow)-ROW(PLE.firstrow))),0,IF(OFFSET(PLE!$G$14,$M24,BE$13)=\"\",10^12,OFFSET(PLE!$G$14,$M24,BE$13))))","v":1000000000000},{"$f":"IF($D24<>\"Serviço\",0,IF(OR(AND(AUTOEVENTO=\"Manual\",$M24=1),$M24>(ROW(PLE.lastrow)-ROW(PLE.firstrow))),0,IF(OFFSET(PLE!$G$14,$M24,BF$13)=\"\",10^12,OFFSET(PLE!$G$14,$M24,BF$13))))","v":1000000000000},{"$f":"IF($D24<>\"Serviço\",0,IF(OR(AND(AUTOEVENTO=\"Manual\",$M24=1),$M24>(ROW(PLE.lastrow)-ROW(PLE.firstrow))),0,IF(OFFSET(PLE!$G$14,$M24,BG$13)=\"\",10^12,OFFSET(PLE!$G$14,$M24,BG$13))))","v":1000000000000}]
["6",{"$f":"OFFSET(ORÇAMENTO!C$15,ROW(B25)-ROW(B$15),0)","v":"S"},{"$f":"OFFSET(ORÇAMENTO!L$15,ROW(C25)-ROW(C$15),0)","v":"F"},{"$f":"OFFSET(ORÇAMENTO!N$15,ROW(D25)-ROW(D$15),0)","v":"Serviço"},{"$f":"OFFSET(ORÇAMENTO!O$15,ROW(E25)-ROW(E$15),0)","v":"1.2.4."},{"$f":"OFFSET(ORÇAMENTO!R$15,ROW(F25)-ROW(F$15),0)","v":"EXECUÇÃO DE PASSEIO EM PISO INTERTRAVADO, COM BLOCO RETANGULAR COR NATURAL DE 20 X 10 CM, ESPESSURA 6 CM. AF_10/2022"},{"$f":"IF($D25<>\"Serviço\",\"\",OFFSET(ORÇAMENTO!S$15,ROW(G25)-ROW(G$15),0))","v":"M2"},{"$f":"IF($D25<>\"Serviço\",0,IF(ACOMPANHAMENTO=\"BM\",ROUND(OFFSET(ORÇAMENTO!AJ$15,ROW(H25)-ROW(H$15),0),15-13*ORÇAMENTO!$AF$7),SUMPRODUCT(($Q$12:$AA$12<>\"\")*ROUND($Q25:$AA25,15-13*ORÇAMENTO!$AF$7))))","v":678.8},null,null,null,".",{"$f":"IF($D25<>\"Serviço\",\"\",IF(AUTOEVENTO=\"manual\",$A25,IF(ISERROR(MATCH($A25,$A$15:OFFSET($A25,-1,0),0)),MAX($M$15:OFFSET(M25,-1,0))+1,INDEX($M$15:OFFSET(M25,-1,0),MATCH($A25,$A$15:OFFSET($A25,-1,0),0)))))","v":3},{"$f":"IF($D25<>\"Serviço\",\"\",IF(AUTOEVENTO=\"Manual\",IF($A25=0,\"<-- defina o número do agrupador\",OFFSET(EVENTOS!$D$14,$A25,0)),OFFSET($F$15,$A25,0)))","v":"PAVIMENTAÇÃO"},null,null,null,null,null,null,null,null,null,null,null,null,null,{"$f":"IF(AND($D25=\"Serviço\",AB$12<>0,$H25>0,OR(AUTOEVENTO<>\"manual\",$M25<>1)),\nIF(Import.TipoArredondamento<>\"TransfereGOV\",\nROUND(OFFSET($P25,0,AB$13),15-13*ORÇAMENTO!$AF$7)/$H25*OFFSET(ORÇAMENTO!$X$15,ROW(AB25)-ROW(AB$15),0),\nROUND(ROUND(OFFSET($P25,0,AB$13),15-13*ORÇAMENTO!$AF$7)*OFFSET(ORÇAMENTO!$W$15,ROW(AB25)-ROW(AB$15),0),15-13*ORÇAMENTO!$AF$11)),0)","v":0},{"$f":"IF(AND($D25=\"Serviço\",AC$12<>0,$H25>0,OR(AUTOEVENTO<>\"manual\",$M25<>1)),\nIF(Import.TipoArredondamento<>\"TransfereGOV\",\nROUND(OFFSET($P25,0,AC$13),15-13*ORÇAMENTO!$AF$7)/$H25*OFFSET(ORÇAMENTO!$X$15,ROW(AC25)-ROW(AC$15),0),\nROUND(ROUND(OFFSET($P25,0,AC$13),15-13*ORÇAMENTO!$AF$7)*OFFSET(ORÇAMENTO!$W$15,ROW(AC25)-ROW(AC$15),0),15-13*ORÇAMENTO!$AF$11)),0)","v":0},{"$f":"IF(AND($D25=\"Serviço\",AD$12<>0,$H25>0,OR(AUTOEVENTO<>\"manual\",$M25<>1)),\nIF(Import.TipoArredondamento<>\"TransfereGOV\",\nROUND(OFFSET($P25,0,AD$13),15-13*ORÇAMENTO!$AF$7)/$H25*OFFSET(ORÇAMENTO!$X$15,ROW(AD25)-ROW(AD$15),0),\nROUND(ROUND(OFFSET($P25,0,AD$13),15-13*ORÇAMENTO!$AF$7)*OFFSET(ORÇAMENTO!$W$15,ROW(AD25)-ROW(AD$15),0),15-13*ORÇAMENTO!$AF$11)),0)","v":0},{"$f":"IF(AND($D25=\"Serviço\",AE$12<>0,$H25>0,OR(AUTOEVENTO<>\"manual\",$M25<>1)),\nIF(Import.TipoArredondamento<>\"TransfereGOV\",\nROUND(OFFSET($P25,0,AE$13),15-13*ORÇAMENTO!$AF$7)/$H25*OFFSET(ORÇAMENTO!$X$15,ROW(AE25)-ROW(AE$15),0),\nROUND(ROUND(OFFSET($P25,0,AE$13),15-13*ORÇAMENTO!$AF$7)*OFFSET(ORÇAMENTO!$W$15,ROW(AE25)-ROW(AE$15),0),15-13*ORÇAMENTO!$AF$11)),0)","v":0},{"$f":"IF(AND($D25=\"Serviço\",AF$12<>0,$H25>0,OR(AUTOEVENTO<>\"manual\",$M25<>1)),\nIF(Import.TipoArredondamento<>\"TransfereGOV\",\nROUND(OFFSET($P25,0,AF$13),15-13*ORÇAMENTO!$AF$7)/$H25*OFFSET(ORÇAMENTO!$X$15,ROW(AF25)-ROW(AF$15),0),\nROUND(ROUND(OFFSET($P25,0,AF$13),15-13*ORÇAMENTO!$AF$7)*OFFSET(ORÇAMENTO!$W$15,ROW(AF25)-ROW(AF$15),0),15-13*ORÇAMENTO!$AF$11)),0)","v":0},{"$f":"IF(AND($D25=\"Serviço\",AG$12<>0,$H25>0,OR(AUTOEVENTO<>\"manual\",$M25<>1)),\nIF(Import.TipoArredondamento<>\"TransfereGOV\",\nROUND(OFFSET($P25,0,AG$13),15-13*ORÇAMENTO!$AF$7)/$H25*OFFSET(ORÇAMENTO!$X$15,ROW(AG25)-ROW(AG$15),0),\nROUND(ROUND(OFFSET($P25,0,AG$13),15-13*ORÇAMENTO!$AF$7)*OFFSET(ORÇAMENTO!$W$15,ROW(AG25)-ROW(AG$15),0),15-13*ORÇAMENTO!$AF$11)),0)","v":0},{"$f":"IF(AND($D25=\"Serviço\",AH$12<>0,$H25>0,OR(AUTOEVENTO<>\"manual\",$M25<>1)),\nIF(Import.TipoArredondamento<>\"TransfereGOV\",\nROUND(OFFSET($P25,0,AH$13),15-13*ORÇAMENTO!$AF$7)/$H25*OFFSET(ORÇAMENTO!$X$15,ROW(AH25)-ROW(AH$15),0),\nROUND(ROUND(OFFSET($P25,0,AH$13),15-13*ORÇAMENTO!$AF$7)*OFFSET(ORÇAMENTO!$W$15,ROW(AH25)-ROW(AH$15),0),15-13*ORÇAMENTO!$AF$11)),0)","v":0},{"$f":"IF(AND($D25=\"Serviço\",AI$12<>0,$H25>0,OR(AUTOEVENTO<>\"manual\",$M25<>1)),\nIF(Import.TipoArredondamento<>\"TransfereGOV\",\nROUND(OFFSET($P25,0,AI$13),15-13*ORÇAMENTO!$AF$7)/$H25*OFFSET(ORÇAMENTO!$X$15,ROW(AI25)-ROW(AI$15),0),\nROUND(ROUND(OFFSET($P25,0,AI$13),15-13*ORÇAMENTO!$AF$7)*OFFSET(ORÇAMENTO!$W$15,ROW(AI25)-ROW(AI$15),0),15-13*ORÇAMENTO!$AF$11)),0)","v":0},{"$f":"IF(AND($D25=\"Serviço\",AJ$12<>0,$H25>0,OR(AUTOEVENTO<>\"manual\",$M25<>1)),\nIF(Import.TipoArredondamento<>\"TransfereGOV\",\nROUND(OFFSET($P25,0,AJ$13),15-13*ORÇAMENTO!$AF$7)/$H25*OFFSET(ORÇAMENTO!$X$15,ROW(AJ25)-ROW(AJ$15),0),\nROUND(ROUND(OFFSET($P25,0,AJ$13),15-13*ORÇAMENTO!$AF$7)*OFFSET(ORÇAMENTO!$W$15,ROW(AJ25)-ROW(AJ$15),0),15-13*ORÇAMENTO!$AF$11)),0)","v":0},{"$f":"IF(AND($D25=\"Serviço\",AK$12<>0,$H25>0,OR(AUTOEVENTO<>\"manual\",$M25<>1)),\nIF(Import.TipoArredondamento<>\"TransfereGOV\",\nROUND(OFFSET($P25,0,AK$13),15-13*ORÇAMENTO!$AF$7)/$H25*OFFSET(ORÇAMENTO!$X$15,ROW(AK25)-ROW(AK$15),0),\nROUND(ROUND(OFFSET($P25,0,AK$13),15-13*ORÇAMENTO!$AF$7)*OFFSET(ORÇAMENTO!$W$15,ROW(AK25)-ROW(AK$15),0),15-13*ORÇAMENTO!$AF$11)),0)","v":0},null,{"$f":"IF($D25<>\"Serviço\",0,IF(AND(AUTOEVENTO=\"Manual\",$M25=1),0,IF(OFFSET(CRONOPLE!$F$14,$M25,AM$13)=\"\",10^12,OFFSET(CRONOPLE!$F$14,$M25,AM$13))))","v":1000000000000},{"$f":"IF($D25<>\"Serviço\",0,IF(AND(AUTOEVENTO=\"Manual\",$M25=1),0,IF(OFFSET(CRONOPLE!$F$14,$M25,AN$13)=\"\",10^12,OFFSET(CRONOPLE!$F$14,$M25,AN$13))))","v":1000000000000},{"$f":"IF($D25<>\"Serviço\",0,IF(AND(AUTOEVENTO=\"Manual\",$M25=1),0,IF(OFFSET(CRONOPLE!$F$14,$M25,AO$13)=\"\",10^12,OFFSET(CRONOPLE!$F$14,$M25,AO$13))))","v":1000000000000},{"$f":"IF($D25<>\"Serviço\",0,IF(AND(AUTOEVENTO=\"Manual\",$M25=1),0,IF(OFFSET(CRONOPLE!$F$14,$M25,AP$13)=\"\",10^12,OFFSET(CRONOPLE!$F$14,$M25,AP$13))))","v":1000000000000},{"$f":"IF($D25<>\"Serviço\",0,IF(AND(AUTOEVENTO=\"Manual\",$M25=1),0,IF(OFFSET(CRONOPLE!$F$14,$M25,AQ$13)=\"\",10^12,OFFSET(CRONOPLE!$F$14,$M25,AQ$13))))","v":1000000000000},{"$f":"IF($D25<>\"Serviço\",0,IF(AND(AUTOEVENTO=\"Manual\",$M25=1),0,IF(OFFSET(CRONOPLE!$F$14,$M25,AR$13)=\"\",10^12,OFFSET(CRONOPLE!$F$14,$M25,AR$13))))","v":1000000000000},{"$f":"IF($D25<>\"Serviço\",0,IF(AND(AUTOEVENTO=\"Manual\",$M25=1),0,IF(OFFSET(CRONOPLE!$F$14,$M25,AS$13)=\"\",10^12,OFFSET(CRONOPLE!$F$14,$M25,AS$13))))","v":1000000000000},{"$f":"IF($D25<>\"Serviço\",0,IF(AND(AUTOEVENTO=\"Manual\",$M25=1),0,IF(OFFSET(CRONOPLE!$F$14,$M25,AT$13)=\"\",10^12,OFFSET(CRONOPLE!$F$14,$M25,AT$13))))","v":1000000000000},{"$f":"IF($D25<>\"Serviço\",0,IF(AND(AUTOEVENTO=\"Manual\",$M25=1),0,IF(OFFSET(CRONOPLE!$F$14,$M25,AU$13)=\"\",10^12,OFFSET(CRONOPLE!$F$14,$M25,AU$13))))","v":1000000000000},{"$f":"IF($D25<>\"Serviço\",0,IF(AND(AUTOEVENTO=\"Manual\",$M25=1),0,IF(OFFSET(CRONOPLE!$F$14,$M25,AV$13)=\"\",10^12,OFFSET(CRONOPLE!$F$14,$M25,AV$13))))","v":1000000000000},null,{"$f":"IF($D25<>\"Serviço\",0,IF(OR(AND(AUTOEVENTO=\"Manual\",$M25=1),$M25>(ROW(PLE.lastrow)-ROW(PLE.firstrow))),0,IF(OFFSET(PLE!$G$14,$M25,AX$13)=\"\",10^12,OFFSET(PLE!$G$14,$M25,AX$13))))","v":1000000000000},{"$f":"IF($D25<>\"Serviço\",0,IF(OR(AND(AUTOEVENTO=\"Manual\",$M25=1),$M25>(ROW(PLE.lastrow)-ROW(PLE.firstrow))),0,IF(OFFSET(PLE!$G$14,$M25,AY$13)=\"\",10^12,OFFSET(PLE!$G$14,$M25,AY$13))))","v":1000000000000},{"$f":"IF($D25<>\"Serviço\",0,IF(OR(AND(AUTOEVENTO=\"Manual\",$M25=1),$M25>(ROW(PLE.lastrow)-ROW(PLE.firstrow))),0,IF(OFFSET(PLE!$G$14,$M25,AZ$13)=\"\",10^12,OFFSET(PLE!$G$14,$M25,AZ$13))))","v":1000000000000},{"$f":"IF($D25<>\"Serviço\",0,IF(OR(AND(AUTOEVENTO=\"Manual\",$M25=1),$M25>(ROW(PLE.lastrow)-ROW(PLE.firstrow))),0,IF(OFFSET(PLE!$G$14,$M25,BA$13)=\"\",10^12,OFFSET(PLE!$G$14,$M25,BA$13))))","v":1000000000000},{"$f":"IF($D25<>\"Serviço\",0,IF(OR(AND(AUTOEVENTO=\"Manual\",$M25=1),$M25>(ROW(PLE.lastrow)-ROW(PLE.firstrow))),0,IF(OFFSET(PLE!$G$14,$M25,BB$13)=\"\",10^12,OFFSET(PLE!$G$14,$M25,BB$13))))","v":1000000000000},{"$f":"IF($D25<>\"Serviço\",0,IF(OR(AND(AUTOEVENTO=\"Manual\",$M25=1),$M25>(ROW(PLE.lastrow)-ROW(PLE.firstrow))),0,IF(OFFSET(PLE!$G$14,$M25,BC$13)=\"\",10^12,OFFSET(PLE!$G$14,$M25,BC$13))))","v":1000000000000},{"$f":"IF($D25<>\"Serviço\",0,IF(OR(AND(AUTOEVENTO=\"Manual\",$M25=1),$M25>(ROW(PLE.lastrow)-ROW(PLE.firstrow))),0,IF(OFFSET(PLE!$G$14,$M25,BD$13)=\"\",10^12,OFFSET(PLE!$G$14,$M25,BD$13))))","v":1000000000000},{"$f":"IF($D25<>\"Serviço\",0,IF(OR(AND(AUTOEVENTO=\"Manual\",$M25=1),$M25>(ROW(PLE.lastrow)-ROW(PLE.firstrow))),0,IF(OFFSET(PLE!$G$14,$M25,BE$13)=\"\",10^12,OFFSET(PLE!$G$14,$M25,BE$13))))","v":1000000000000},{"$f":"IF($D25<>\"Serviço\",0,IF(OR(AND(AUTOEVENTO=\"Manual\",$M25=1),$M25>(ROW(PLE.lastrow)-ROW(PLE.firstrow))),0,IF(OFFSET(PLE!$G$14,$M25,BF$13)=\"\",10^12,OFFSET(PLE!$G$14,$M25,BF$13))))","v":1000000000000},{"$f":"IF($D25<>\"Serviço\",0,IF(OR(AND(AUTOEVENTO=\"Manual\",$M25=1),$M25>(ROW(PLE.lastrow)-ROW(PLE.firstrow))),0,IF(OFFSET(PLE!$G$14,$M25,BG$13)=\"\",10^12,OFFSET(PLE!$G$14,$M25,BG$13))))","v":1000000000000}]
["6",{"$f":"OFFSET(ORÇAMENTO!C$15,ROW(B26)-ROW(B$15),0)","v":"S"},{"$f":"OFFSET(ORÇAMENTO!L$15,ROW(C26)-ROW(C$15),0)","v":"F"},{"$f":"OFFSET(ORÇAMENTO!N$15,ROW(D26)-ROW(D$15),0)","v":"Serviço"},{"$f":"OFFSET(ORÇAMENTO!O$15,ROW(E26)-ROW(E$15),0)","v":"1.2.5."},{"$f":"OFFSET(ORÇAMENTO!R$15,ROW(F26)-ROW(F$15),0)","v":"EXECUÇÃO DE PASSEIO (CALÇADA) OU PISO DE CONCRETO COM CONCRETO MOLDADO IN LOCO, FEITO EM OBRA, ACABAMENTO CONVENCIONAL, ESPESSURA 8 CM, ARMADO. AF_08/2022"},{"$f":"IF($D26<>\"Serviço\",\"\",OFFSET(ORÇAMENTO!S$15,ROW(G26)-ROW(G$15),0))","v":"M2"},{"$f":"IF($D26<>\"Serviço\",0,IF(ACOMPANHAMENTO=\"BM\",ROUND(OFFSET(ORÇAMENTO!AJ$15,ROW(H26)-ROW(H$15),0),15-13*ORÇAMENTO!$AF$7),SUMPRODUCT(($Q$12:$AA$12<>\"\")*ROUND($Q26:$AA26,15-13*ORÇAMENTO!$AF$7))))","v":196.67},null,null,null,".",{"$f":"IF($D26<>\"Serviço\",\"\",IF(AUTOEVENTO=\"manual\",$A26,IF(ISERROR(MATCH($A26,$A$15:OFFSET($A26,-1,0),0)),MAX($M$15:OFFSET(M26,-1,0))+1,INDEX($M$15:OFFSET(M26,-1,0),MATCH($A26,$A$15:OFFSET($A26,-1,0),0)))))","v":3},{"$f":"IF($D26<>\"Serviço\",\"\",IF(AUTOEVENTO=\"Manual\",IF($A26=0,\"<-- defina o número do agrupador\",OFFSET(EVENTOS!$D$14,$A26,0)),OFFSET($F$15,$A26,0)))","v":"PAVIMENTAÇÃO"},null,null,null,null,null,null,null,null,null,null,null,null,null,{"$f":"IF(AND($D26=\"Serviço\",AB$12<>0,$H26>0,OR(AUTOEVENTO<>\"manual\",$M26<>1)),\nIF(Import.TipoArredondamento<>\"TransfereGOV\",\nROUND(OFFSET($P26,0,AB$13),15-13*ORÇAMENTO!$AF$7)/$H26*OFFSET(ORÇAMENTO!$X$15,ROW(AB26)-ROW(AB$15),0),\nROUND(ROUND(OFFSET($P26,0,AB$13),15-13*ORÇAMENTO!$AF$7)*OFFSET(ORÇAMENTO!$W$15,ROW(AB26)-ROW(AB$15),0),15-13*ORÇAMENTO!$AF$11)),0)","v":0},{"$f":"IF(AND($D26=\"Serviço\",AC$12<>0,$H26>0,OR(AUTOEVENTO<>\"manual\",$M26<>1)),\nIF(Import.TipoArredondamento<>\"TransfereGOV\",\nROUND(OFFSET($P26,0,AC$13),15-13*ORÇAMENTO!$AF$7)/$H26*OFFSET(ORÇAMENTO!$X$15,ROW(AC26)-ROW(AC$15),0),\nROUND(ROUND(OFFSET($P26,0,AC$13),15-13*ORÇAMENTO!$AF$7)*OFFSET(ORÇAMENTO!$W$15,ROW(AC26)-ROW(AC$15),0),15-13*ORÇAMENTO!$AF$11)),0)","v":0},{"$f":"IF(AND($D26=\"Serviço\",AD$12<>0,$H26>0,OR(AUTOEVENTO<>\"manual\",$M26<>1)),\nIF(Import.TipoArredondamento<>\"TransfereGOV\",\nROUND(OFFSET($P26,0,AD$13),15-13*ORÇAMENTO!$AF$7)/$H26*OFFSET(ORÇAMENTO!$X$15,ROW(AD26)-ROW(AD$15),0),\nROUND(ROUND(OFFSET($P26,0,AD$13),15-13*ORÇAMENTO!$AF$7)*OFFSET(ORÇAMENTO!$W$15,ROW(AD26)-ROW(AD$15),0),15-13*ORÇAMENTO!$AF$11)),0)","v":0},{"$f":"IF(AND($D26=\"Serviço\",AE$12<>0,$H26>0,OR(AUTOEVENTO<>\"manual\",$M26<>1)),\nIF(Import.TipoArredondamento<>\"TransfereGOV\",\nROUND(OFFSET($P26,0,AE$13),15-13*ORÇAMENTO!$AF$7)/$H26*OFFSET(ORÇAMENTO!$X$15,ROW(AE26)-ROW(AE$15),0),\nROUND(ROUND(OFFSET($P26,0,AE$13),15-13*ORÇAMENTO!$AF$7)*OFFSET(ORÇAMENTO!$W$15,ROW(AE26)-ROW(AE$15),0),15-13*ORÇAMENTO!$AF$11)),0)","v":0},{"$f":"IF(AND($D26=\"Serviço\",AF$12<>0,$H26>0,OR(AUTOEVENTO<>\"manual\",$M26<>1)),\nIF(Import.TipoArredondamento<>\"TransfereGOV\",\nROUND(OFFSET($P26,0,AF$13),15-13*ORÇAMENTO!$AF$7)/$H26*OFFSET(ORÇAMENTO!$X$15,ROW(AF26)-ROW(AF$15),0),\nROUND(ROUND(OFFSET($P26,0,AF$13),15-13*ORÇAMENTO!$AF$7)*OFFSET(ORÇAMENTO!$W$15,ROW(AF26)-ROW(AF$15),0),15-13*ORÇAMENTO!$AF$11)),0)","v":0},{"$f":"IF(AND($D26=\"Serviço\",AG$12<>0,$H26>0,OR(AUTOEVENTO<>\"manual\",$M26<>1)),\nIF(Import.TipoArredondamento<>\"TransfereGOV\",\nROUND(OFFSET($P26,0,AG$13),15-13*ORÇAMENTO!$AF$7)/$H26*OFFSET(ORÇAMENTO!$X$15,ROW(AG26)-ROW(AG$15),0),\nROUND(ROUND(OFFSET($P26,0,AG$13),15-13*ORÇAMENTO!$AF$7)*OFFSET(ORÇAMENTO!$W$15,ROW(AG26)-ROW(AG$15),0),15-13*ORÇAMENTO!$AF$11)),0)","v":0},{"$f":"IF(AND($D26=\"Serviço\",AH$12<>0,$H26>0,OR(AUTOEVENTO<>\"manual\",$M26<>1)),\nIF(Import.TipoArredondamento<>\"TransfereGOV\",\nROUND(OFFSET($P26,0,AH$13),15-13*ORÇAMENTO!$AF$7)/$H26*OFFSET(ORÇAMENTO!$X$15,ROW(AH26)-ROW(AH$15),0),\nROUND(ROUND(OFFSET($P26,0,AH$13),15-13*ORÇAMENTO!$AF$7)*OFFSET(ORÇAMENTO!$W$15,ROW(AH26)-ROW(AH$15),0),15-13*ORÇAMENTO!$AF$11)),0)","v":0},{"$f":"IF(AND($D26=\"Serviço\",AI$12<>0,$H26>0,OR(AUTOEVENTO<>\"manual\",$M26<>1)),\nIF(Import.TipoArredondamento<>\"TransfereGOV\",\nROUND(OFFSET($P26,0,AI$13),15-13*ORÇAMENTO!$AF$7)/$H26*OFFSET(ORÇAMENTO!$X$15,ROW(AI26)-ROW(AI$15),0),\nROUND(ROUND(OFFSET($P26,0,AI$13),15-13*ORÇAMENTO!$AF$7)*OFFSET(ORÇAMENTO!$W$15,ROW(AI26)-ROW(AI$15),0),15-13*ORÇAMENTO!$AF$11)),0)","v":0},{"$f":"IF(AND($D26=\"Serviço\",AJ$12<>0,$H26>0,OR(AUTOEVENTO<>\"manual\",$M26<>1)),\nIF(Import.TipoArredondamento<>\"TransfereGOV\",\nROUND(OFFSET($P26,0,AJ$13),15-13*ORÇAMENTO!$AF$7)/$H26*OFFSET(ORÇAMENTO!$X$15,ROW(AJ26)-ROW(AJ$15),0),\nROUND(ROUND(OFFSET($P26,0,AJ$13),15-13*ORÇAMENTO!$AF$7)*OFFSET(ORÇAMENTO!$W$15,ROW(AJ26)-ROW(AJ$15),0),15-13*ORÇAMENTO!$AF$11)),0)","v":0},{"$f":"IF(AND($D26=\"Serviço\",AK$12<>0,$H26>0,OR(AUTOEVENTO<>\"manual\",$M26<>1)),\nIF(Import.TipoArredondamento<>\"TransfereGOV\",\nROUND(OFFSET($P26,0,AK$13),15-13*ORÇAMENTO!$AF$7)/$H26*OFFSET(ORÇAMENTO!$X$15,ROW(AK26)-ROW(AK$15),0),\nROUND(ROUND(OFFSET($P26,0,AK$13),15-13*ORÇAMENTO!$AF$7)*OFFSET(ORÇAMENTO!$W$15,ROW(AK26)-ROW(AK$15),0),15-13*ORÇAMENTO!$AF$11)),0)","v":0},null,{"$f":"IF($D26<>\"Serviço\",0,IF(AND(AUTOEVENTO=\"Manual\",$M26=1),0,IF(OFFSET(CRONOPLE!$F$14,$M26,AM$13)=\"\",10^12,OFFSET(CRONOPLE!$F$14,$M26,AM$13))))","v":1000000000000},{"$f":"IF($D26<>\"Serviço\",0,IF(AND(AUTOEVENTO=\"Manual\",$M26=1),0,IF(OFFSET(CRONOPLE!$F$14,$M26,AN$13)=\"\",10^12,OFFSET(CRONOPLE!$F$14,$M26,AN$13))))","v":1000000000000},{"$f":"IF($D26<>\"Serviço\",0,IF(AND(AUTOEVENTO=\"Manual\",$M26=1),0,IF(OFFSET(CRONOPLE!$F$14,$M26,AO$13)=\"\",10^12,OFFSET(CRONOPLE!$F$14,$M26,AO$13))))","v":1000000000000},{"$f":"IF($D26<>\"Serviço\",0,IF(AND(AUTOEVENTO=\"Manual\",$M26=1),0,IF(OFFSET(CRONOPLE!$F$14,$M26,AP$13)=\"\",10^12,OFFSET(CRONOPLE!$F$14,$M26,AP$13))))","v":1000000000000},{"$f":"IF($D26<>\"Serviço\",0,IF(AND(AUTOEVENTO=\"Manual\",$M26=1),0,IF(OFFSET(CRONOPLE!$F$14,$M26,AQ$13)=\"\",10^12,OFFSET(CRONOPLE!$F$14,$M26,AQ$13))))","v":1000000000000},{"$f":"IF($D26<>\"Serviço\",0,IF(AND(AUTOEVENTO=\"Manual\",$M26=1),0,IF(OFFSET(CRONOPLE!$F$14,$M26,AR$13)=\"\",10^12,OFFSET(CRONOPLE!$F$14,$M26,AR$13))))","v":1000000000000},{"$f":"IF($D26<>\"Serviço\",0,IF(AND(AUTOEVENTO=\"Manual\",$M26=1),0,IF(OFFSET(CRONOPLE!$F$14,$M26,AS$13)=\"\",10^12,OFFSET(CRONOPLE!$F$14,$M26,AS$13))))","v":1000000000000},{"$f":"IF($D26<>\"Serviço\",0,IF(AND(AUTOEVENTO=\"Manual\",$M26=1),0,IF(OFFSET(CRONOPLE!$F$14,$M26,AT$13)=\"\",10^12,OFFSET(CRONOPLE!$F$14,$M26,AT$13))))","v":1000000000000},{"$f":"IF($D26<>\"Serviço\",0,IF(AND(AUTOEVENTO=\"Manual\",$M26=1),0,IF(OFFSET(CRONOPLE!$F$14,$M26,AU$13)=\"\",10^12,OFFSET(CRONOPLE!$F$14,$M26,AU$13))))","v":1000000000000},{"$f":"IF($D26<>\"Serviço\",0,IF(AND(AUTOEVENTO=\"Manual\",$M26=1),0,IF(OFFSET(CRONOPLE!$F$14,$M26,AV$13)=\"\",10^12,OFFSET(CRONOPLE!$F$14,$M26,AV$13))))","v":1000000000000},null,{"$f":"IF($D26<>\"Serviço\",0,IF(OR(AND(AUTOEVENTO=\"Manual\",$M26=1),$M26>(ROW(PLE.lastrow)-ROW(PLE.firstrow))),0,IF(OFFSET(PLE!$G$14,$M26,AX$13)=\"\",10^12,OFFSET(PLE!$G$14,$M26,AX$13))))","v":1000000000000},{"$f":"IF($D26<>\"Serviço\",0,IF(OR(AND(AUTOEVENTO=\"Manual\",$M26=1),$M26>(ROW(PLE.lastrow)-ROW(PLE.firstrow))),0,IF(OFFSET(PLE!$G$14,$M26,AY$13)=\"\",10^12,OFFSET(PLE!$G$14,$M26,AY$13))))","v":1000000000000},{"$f":"IF($D26<>\"Serviço\",0,IF(OR(AND(AUTOEVENTO=\"Manual\",$M26=1),$M26>(ROW(PLE.lastrow)-ROW(PLE.firstrow))),0,IF(OFFSET(PLE!$G$14,$M26,AZ$13)=\"\",10^12,OFFSET(PLE!$G$14,$M26,AZ$13))))","v":1000000000000},{"$f":"IF($D26<>\"Serviço\",0,IF(OR(AND(AUTOEVENTO=\"Manual\",$M26=1),$M26>(ROW(PLE.lastrow)-ROW(PLE.firstrow))),0,IF(OFFSET(PLE!$G$14,$M26,BA$13)=\"\",10^12,OFFSET(PLE!$G$14,$M26,BA$13))))","v":1000000000000},{"$f":"IF($D26<>\"Serviço\",0,IF(OR(AND(AUTOEVENTO=\"Manual\",$M26=1),$M26>(ROW(PLE.lastrow)-ROW(PLE.firstrow))),0,IF(OFFSET(PLE!$G$14,$M26,BB$13)=\"\",10^12,OFFSET(PLE!$G$14,$M26,BB$13))))","v":1000000000000},{"$f":"IF($D26<>\"Serviço\",0,IF(OR(AND(AUTOEVENTO=\"Manual\",$M26=1),$M26>(ROW(PLE.lastrow)-ROW(PLE.firstrow))),0,IF(OFFSET(PLE!$G$14,$M26,BC$13)=\"\",10^12,OFFSET(PLE!$G$14,$M26,BC$13))))","v":1000000000000},{"$f":"IF($D26<>\"Serviço\",0,IF(OR(AND(AUTOEVENTO=\"Manual\",$M26=1),$M26>(ROW(PLE.lastrow)-ROW(PLE.firstrow))),0,IF(OFFSET(PLE!$G$14,$M26,BD$13)=\"\",10^12,OFFSET(PLE!$G$14,$M26,BD$13))))","v":1000000000000},{"$f":"IF($D26<>\"Serviço\",0,IF(OR(AND(AUTOEVENTO=\"Manual\",$M26=1),$M26>(ROW(PLE.lastrow)-ROW(PLE.firstrow))),0,IF(OFFSET(PLE!$G$14,$M26,BE$13)=\"\",10^12,OFFSET(PLE!$G$14,$M26,BE$13))))","v":1000000000000},{"$f":"IF($D26<>\"Serviço\",0,IF(OR(AND(AUTOEVENTO=\"Manual\",$M26=1),$M26>(ROW(PLE.lastrow)-ROW(PLE.firstrow))),0,IF(OFFSET(PLE!$G$14,$M26,BF$13)=\"\",10^12,OFFSET(PLE!$G$14,$M26,BF$13))))","v":1000000000000},{"$f":"IF($D26<>\"Serviço\",0,IF(OR(AND(AUTOEVENTO=\"Manual\",$M26=1),$M26>(ROW(PLE.lastrow)-ROW(PLE.firstrow))),0,IF(OFFSET(PLE!$G$14,$M26,BG$13)=\"\",10^12,OFFSET(PLE!$G$14,$M26,BG$13))))","v":1000000000000}]
["6",{"$f":"OFFSET(ORÇAMENTO!C$15,ROW(B27)-ROW(B$15),0)","v":"S"},{"$f":"OFFSET(ORÇAMENTO!L$15,ROW(C27)-ROW(C$15),0)","v":"F"},{"$f":"OFFSET(ORÇAMENTO!N$15,ROW(D27)-ROW(D$15),0)","v":"Serviço"},{"$f":"OFFSET(ORÇAMENTO!O$15,ROW(E27)-ROW(E$15),0)","v":"1.2.6."},{"$f":"OFFSET(ORÇAMENTO!R$15,ROW(F27)-ROW(F$15),0)","v":"PISO PODOTÁTIL DE ALERTA OU DIRECIONAL, DE CONCRETO, ASSENTADO SOBRE ARGAMASSA. AF_03/2024"},{"$f":"IF($D27<>\"Serviço\",\"\",OFFSET(ORÇAMENTO!S$15,ROW(G27)-ROW(G$15),0))","v":"M2"},{"$f":"IF($D27<>\"Serviço\",0,IF(ACOMPANHAMENTO=\"BM\",ROUND(OFFSET(ORÇAMENTO!AJ$15,ROW(H27)-ROW(H$15),0),15-13*ORÇAMENTO!$AF$7),SUMPRODUCT(($Q$12:$AA$12<>\"\")*ROUND($Q27:$AA27,15-13*ORÇAMENTO!$AF$7))))","v":81.16},null,null,null,".",{"$f":"IF($D27<>\"Serviço\",\"\",IF(AUTOEVENTO=\"manual\",$A27,IF(ISERROR(MATCH($A27,$A$15:OFFSET($A27,-1,0),0)),MAX($M$15:OFFSET(M27,-1,0))+1,INDEX($M$15:OFFSET(M27,-1,0),MATCH($A27,$A$15:OFFSET($A27,-1,0),0)))))","v":3},{"$f":"IF($D27<>\"Serviço\",\"\",IF(AUTOEVENTO=\"Manual\",IF($A27=0,\"<-- defina o número do agrupador\",OFFSET(EVENTOS!$D$14,$A27,0)),OFFSET($F$15,$A27,0)))","v":"PAVIMENTAÇÃO"},null,null,null,null,null,null,null,null,null,null,null,null,null,{"$f":"IF(AND($D27=\"Serviço\",AB$12<>0,$H27>0,OR(AUTOEVENTO<>\"manual\",$M27<>1)),\nIF(Import.TipoArredondamento<>\"TransfereGOV\",\nROUND(OFFSET($P27,0,AB$13),15-13*ORÇAMENTO!$AF$7)/$H27*OFFSET(ORÇAMENTO!$X$15,ROW(AB27)-ROW(AB$15),0),\nROUND(ROUND(OFFSET($P27,0,AB$13),15-13*ORÇAMENTO!$AF$7)*OFFSET(ORÇAMENTO!$W$15,ROW(AB27)-ROW(AB$15),0),15-13*ORÇAMENTO!$AF$11)),0)","v":0},{"$f":"IF(AND($D27=\"Serviço\",AC$12<>0,$H27>0,OR(AUTOEVENTO<>\"manual\",$M27<>1)),\nIF(Import.TipoArredondamento<>\"TransfereGOV\",\nROUND(OFFSET($P27,0,AC$13),15-13*ORÇAMENTO!$AF$7)/$H27*OFFSET(ORÇAMENTO!$X$15,ROW(AC27)-ROW(AC$15),0),\nROUND(ROUND(OFFSET($P27,0,AC$13),15-13*ORÇAMENTO!$AF$7)*OFFSET(ORÇAMENTO!$W$15,ROW(AC27)-ROW(AC$15),0),15-13*ORÇAMENTO!$AF$11)),0)","v":0},{"$f":"IF(AND($D27=\"Serviço\",AD$12<>0,$H27>0,OR(AUTOEVENTO<>\"manual\",$M27<>1)),\nIF(Import.TipoArredondamento<>\"TransfereGOV\",\nROUND(OFFSET($P27,0,AD$13),15-13*ORÇAMENTO!$AF$7)/$H27*OFFSET(ORÇAMENTO!$X$15,ROW(AD27)-ROW(AD$15),0),\nROUND(ROUND(OFFSET($P27,0,AD$13),15-13*ORÇAMENTO!$AF$7)*OFFSET(ORÇAMENTO!$W$15,ROW(AD27)-ROW(AD$15),0),15-13*ORÇAMENTO!$AF$11)),0)","v":0},{"$f":"IF(AND($D27=\"Serviço\",AE$12<>0,$H27>0,OR(AUTOEVENTO<>\"manual\",$M27<>1)),\nIF(Import.TipoArredondamento<>\"TransfereGOV\",\nROUND(OFFSET($P27,0,AE$13),15-13*ORÇAMENTO!$AF$7)/$H27*OFFSET(ORÇAMENTO!$X$15,ROW(AE27)-ROW(AE$15),0),\nROUND(ROUND(OFFSET($P27,0,AE$13),15-13*ORÇAMENTO!$AF$7)*OFFSET(ORÇAMENTO!$W$15,ROW(AE27)-ROW(AE$15),0),15-13*ORÇAMENTO!$AF$11)),0)","v":0},{"$f":"IF(AND($D27=\"Serviço\",AF$12<>0,$H27>0,OR(AUTOEVENTO<>\"manual\",$M27<>1)),\nIF(Import.TipoArredondamento<>\"TransfereGOV\",\nROUND(OFFSET($P27,0,AF$13),15-13*ORÇAMENTO!$AF$7)/$H27*OFFSET(ORÇAMENTO!$X$15,ROW(AF27)-ROW(AF$15),0),\nROUND(ROUND(OFFSET($P27,0,AF$13),15-13*ORÇAMENTO!$AF$7)*OFFSET(ORÇAMENTO!$W$15,ROW(AF27)-ROW(AF$15),0),15-13*ORÇAMENTO!$AF$11)),0)","v":0},{"$f":"IF(AND($D27=\"Serviço\",AG$12<>0,$H27>0,OR(AUTOEVENTO<>\"manual\",$M27<>1)),\nIF(Import.TipoArredondamento<>\"TransfereGOV\",\nROUND(OFFSET($P27,0,AG$13),15-13*ORÇAMENTO!$AF$7)/$H27*OFFSET(ORÇAMENTO!$X$15,ROW(AG27)-ROW(AG$15),0),\nROUND(ROUND(OFFSET($P27,0,AG$13),15-13*ORÇAMENTO!$AF$7)*OFFSET(ORÇAMENTO!$W$15,ROW(AG27)-ROW(AG$15),0),15-13*ORÇAMENTO!$AF$11)),0)","v":0},{"$f":"IF(AND($D27=\"Serviço\",AH$12<>0,$H27>0,OR(AUTOEVENTO<>\"manual\",$M27<>1)),\nIF(Import.TipoArredondamento<>\"TransfereGOV\",\nROUND(OFFSET($P27,0,AH$13),15-13*ORÇAMENTO!$AF$7)/$H27*OFFSET(ORÇAMENTO!$X$15,ROW(AH27)-ROW(AH$15),0),\nROUND(ROUND(OFFSET($P27,0,AH$13),15-13*ORÇAMENTO!$AF$7)*OFFSET(ORÇAMENTO!$W$15,ROW(AH27)-ROW(AH$15),0),15-13*ORÇAMENTO!$AF$11)),0)","v":0},{"$f":"IF(AND($D27=\"Serviço\",AI$12<>0,$H27>0,OR(AUTOEVENTO<>\"manual\",$M27<>1)),\nIF(Import.TipoArredondamento<>\"TransfereGOV\",\nROUND(OFFSET($P27,0,AI$13),15-13*ORÇAMENTO!$AF$7)/$H27*OFFSET(ORÇAMENTO!$X$15,ROW(AI27)-ROW(AI$15),0),\nROUND(ROUND(OFFSET($P27,0,AI$13),15-13*ORÇAMENTO!$AF$7)*OFFSET(ORÇAMENTO!$W$15,ROW(AI27)-ROW(AI$15),0),15-13*ORÇAMENTO!$AF$11)),0)","v":0},{"$f":"IF(AND($D27=\"Serviço\",AJ$12<>0,$H27>0,OR(AUTOEVENTO<>\"manual\",$M27<>1)),\nIF(Import.TipoArredondamento<>\"TransfereGOV\",\nROUND(OFFSET($P27,0,AJ$13),15-13*ORÇAMENTO!$AF$7)/$H27*OFFSET(ORÇAMENTO!$X$15,ROW(AJ27)-ROW(AJ$15),0),\nROUND(ROUND(OFFSET($P27,0,AJ$13),15-13*ORÇAMENTO!$AF$7)*OFFSET(ORÇAMENTO!$W$15,ROW(AJ27)-ROW(AJ$15),0),15-13*ORÇAMENTO!$AF$11)),0)","v":0},{"$f":"IF(AND($D27=\"Serviço\",AK$12<>0,$H27>0,OR(AUTOEVENTO<>\"manual\",$M27<>1)),\nIF(Import.TipoArredondamento<>\"TransfereGOV\",\nROUND(OFFSET($P27,0,AK$13),15-13*ORÇAMENTO!$AF$7)/$H27*OFFSET(ORÇAMENTO!$X$15,ROW(AK27)-ROW(AK$15),0),\nROUND(ROUND(OFFSET($P27,0,AK$13),15-13*ORÇAMENTO!$AF$7)*OFFSET(ORÇAMENTO!$W$15,ROW(AK27)-ROW(AK$15),0),15-13*ORÇAMENTO!$AF$11)),0)","v":0},null,{"$f":"IF($D27<>\"Serviço\",0,IF(AND(AUTOEVENTO=\"Manual\",$M27=1),0,IF(OFFSET(CRONOPLE!$F$14,$M27,AM$13)=\"\",10^12,OFFSET(CRONOPLE!$F$14,$M27,AM$13))))","v":1000000000000},{"$f":"IF($D27<>\"Serviço\",0,IF(AND(AUTOEVENTO=\"Manual\",$M27=1),0,IF(OFFSET(CRONOPLE!$F$14,$M27,AN$13)=\"\",10^12,OFFSET(CRONOPLE!$F$14,$M27,AN$13))))","v":1000000000000},{"$f":"IF($D27<>\"Serviço\",0,IF(AND(AUTOEVENTO=\"Manual\",$M27=1),0,IF(OFFSET(CRONOPLE!$F$14,$M27,AO$13)=\"\",10^12,OFFSET(CRONOPLE!$F$14,$M27,AO$13))))","v":1000000000000},{"$f":"IF($D27<>\"Serviço\",0,IF(AND(AUTOEVENTO=\"Manual\",$M27=1),0,IF(OFFSET(CRONOPLE!$F$14,$M27,AP$13)=\"\",10^12,OFFSET(CRONOPLE!$F$14,$M27,AP$13))))","v":1000000000000},{"$f":"IF($D27<>\"Serviço\",0,IF(AND(AUTOEVENTO=\"Manual\",$M27=1),0,IF(OFFSET(CRONOPLE!$F$14,$M27,AQ$13)=\"\",10^12,OFFSET(CRONOPLE!$F$14,$M27,AQ$13))))","v":1000000000000},{"$f":"IF($D27<>\"Serviço\",0,IF(AND(AUTOEVENTO=\"Manual\",$M27=1),0,IF(OFFSET(CRONOPLE!$F$14,$M27,AR$13)=\"\",10^12,OFFSET(CRONOPLE!$F$14,$M27,AR$13))))","v":1000000000000},{"$f":"IF($D27<>\"Serviço\",0,IF(AND(AUTOEVENTO=\"Manual\",$M27=1),0,IF(OFFSET(CRONOPLE!$F$14,$M27,AS$13)=\"\",10^12,OFFSET(CRONOPLE!$F$14,$M27,AS$13))))","v":1000000000000},{"$f":"IF($D27<>\"Serviço\",0,IF(AND(AUTOEVENTO=\"Manual\",$M27=1),0,IF(OFFSET(CRONOPLE!$F$14,$M27,AT$13)=\"\",10^12,OFFSET(CRONOPLE!$F$14,$M27,AT$13))))","v":1000000000000},{"$f":"IF($D27<>\"Serviço\",0,IF(AND(AUTOEVENTO=\"Manual\",$M27=1),0,IF(OFFSET(CRONOPLE!$F$14,$M27,AU$13)=\"\",10^12,OFFSET(CRONOPLE!$F$14,$M27,AU$13))))","v":1000000000000},{"$f":"IF($D27<>\"Serviço\",0,IF(AND(AUTOEVENTO=\"Manual\",$M27=1),0,IF(OFFSET(CRONOPLE!$F$14,$M27,AV$13)=\"\",10^12,OFFSET(CRONOPLE!$F$14,$M27,AV$13))))","v":1000000000000},null,{"$f":"IF($D27<>\"Serviço\",0,IF(OR(AND(AUTOEVENTO=\"Manual\",$M27=1),$M27>(ROW(PLE.lastrow)-ROW(PLE.firstrow))),0,IF(OFFSET(PLE!$G$14,$M27,AX$13)=\"\",10^12,OFFSET(PLE!$G$14,$M27,AX$13))))","v":1000000000000},{"$f":"IF($D27<>\"Serviço\",0,IF(OR(AND(AUTOEVENTO=\"Manual\",$M27=1),$M27>(ROW(PLE.lastrow)-ROW(PLE.firstrow))),0,IF(OFFSET(PLE!$G$14,$M27,AY$13)=\"\",10^12,OFFSET(PLE!$G$14,$M27,AY$13))))","v":1000000000000},{"$f":"IF($D27<>\"Serviço\",0,IF(OR(AND(AUTOEVENTO=\"Manual\",$M27=1),$M27>(ROW(PLE.lastrow)-ROW(PLE.firstrow))),0,IF(OFFSET(PLE!$G$14,$M27,AZ$13)=\"\",10^12,OFFSET(PLE!$G$14,$M27,AZ$13))))","v":1000000000000},{"$f":"IF($D27<>\"Serviço\",0,IF(OR(AND(AUTOEVENTO=\"Manual\",$M27=1),$M27>(ROW(PLE.lastrow)-ROW(PLE.firstrow))),0,IF(OFFSET(PLE!$G$14,$M27,BA$13)=\"\",10^12,OFFSET(PLE!$G$14,$M27,BA$13))))","v":1000000000000},{"$f":"IF($D27<>\"Serviço\",0,IF(OR(AND(AUTOEVENTO=\"Manual\",$M27=1),$M27>(ROW(PLE.lastrow)-ROW(PLE.firstrow))),0,IF(OFFSET(PLE!$G$14,$M27,BB$13)=\"\",10^12,OFFSET(PLE!$G$14,$M27,BB$13))))","v":1000000000000},{"$f":"IF($D27<>\"Serviço\",0,IF(OR(AND(AUTOEVENTO=\"Manual\",$M27=1),$M27>(ROW(PLE.lastrow)-ROW(PLE.firstrow))),0,IF(OFFSET(PLE!$G$14,$M27,BC$13)=\"\",10^12,OFFSET(PLE!$G$14,$M27,BC$13))))","v":1000000000000},{"$f":"IF($D27<>\"Serviço\",0,IF(OR(AND(AUTOEVENTO=\"Manual\",$M27=1),$M27>(ROW(PLE.lastrow)-ROW(PLE.firstrow))),0,IF(OFFSET(PLE!$G$14,$M27,BD$13)=\"\",10^12,OFFSET(PLE!$G$14,$M27,BD$13))))","v":1000000000000},{"$f":"IF($D27<>\"Serviço\",0,IF(OR(AND(AUTOEVENTO=\"Manual\",$M27=1),$M27>(ROW(PLE.lastrow)-ROW(PLE.firstrow))),0,IF(OFFSET(PLE!$G$14,$M27,BE$13)=\"\",10^12,OFFSET(PLE!$G$14,$M27,BE$13))))","v":1000000000000},{"$f":"IF($D27<>\"Serviço\",0,IF(OR(AND(AUTOEVENTO=\"Manual\",$M27=1),$M27>(ROW(PLE.lastrow)-ROW(PLE.firstrow))),0,IF(OFFSET(PLE!$G$14,$M27,BF$13)=\"\",10^12,OFFSET(PLE!$G$14,$M27,BF$13))))","v":1000000000000},{"$f":"IF($D27<>\"Serviço\",0,IF(OR(AND(AUTOEVENTO=\"Manual\",$M27=1),$M27>(ROW(PLE.lastrow)-ROW(PLE.firstrow))),0,IF(OFFSET(PLE!$G$14,$M27,BG$13)=\"\",10^12,OFFSET(PLE!$G$14,$M27,BG$13))))","v":1000000000000}]
[{"$f":"IF(AUTOEVENTO=\"Manual\",IF(K28<>\"\",MIN(VALUE(LEFT(K28,FIND(\".\",K28)-1)),COUNTA(EVENTOS.Lista)),0),IF(OR($B28>AUTOEVENTO,$B28=\"S\",$B28=0),SUBSTITUTE(OFFSET($A28,-1,0),IF($D28=\"Serviço\",\".\",\"\"),\"\"),ROW(A28)-ROW($A$15)&\".\"))","v":"13."},{"$f":"OFFSET(ORÇAMENTO!C$15,ROW(B28)-ROW(B$15),0)","v":2},{"$f":"OFFSET(ORÇAMENTO!L$15,ROW(C28)-ROW(C$15),0)","v":"F"},{"$f":"OFFSET(ORÇAMENTO!N$15,ROW(D28)-ROW(D$15),0)","v":"Nível 2"},{"$f":"OFFSET(ORÇAMENTO!O$15,ROW(E28)-ROW(E$15),0)","v":"1.3."},{"$f":"OFFSET(ORÇAMENTO!R$15,ROW(F28)-ROW(F$15),0)","v":"PAISAGISMO"},{"$f":"IF($D28<>\"Serviço\",\"\",OFFSET(ORÇAMENTO!S$15,ROW(G28)-ROW(G$15),0))","v":""},{"$f":"IF($D28<>\"Serviço\",0,IF(ACOMPANHAMENTO=\"BM\",ROUND(OFFSET(ORÇAMENTO!AJ$15,ROW(H28)-ROW(H$15),0),15-13*ORÇAMENTO!$AF$7),SUMPRODUCT(($Q$12:$AA$12<>\"\")*ROUND($Q28:$AA28,15-13*ORÇAMENTO!$AF$7))))","v":0},null,null,null,".",{"$f":"IF($D28<>\"Serviço\",\"\",IF(AUTOEVENTO=\"manual\",$A28,IF(ISERROR(MATCH($A28,$A$15:OFFSET($A28,-1,0),0)),MAX($M$15:OFFSET(M28,-1,0))+1,INDEX($M$15:OFFSET(M28,-1,0),MATCH($A28,$A$15:OFFSET($A28,-1,0),0)))))","v":""},{"$f":"IF($D28<>\"Serviço\",\"\",IF(AUTOEVENTO=\"Manual\",IF($A28=0,\"<-- defina o número do agrupador\",OFFSET(EVENTOS!$D$14,$A28,0)),OFFSET($F$15,$A28,0)))","v":""},null,null,null,null,null,null,null,null,null,null,null,null,null,{"$f":"IF(AND($D28=\"Serviço\",AB$12<>0,$H28>0,OR(AUTOEVENTO<>\"manual\",$M28<>1)),\nIF(Import.TipoArredondamento<>\"TransfereGOV\",\nROUND(OFFSET($P28,0,AB$13),15-13*ORÇAMENTO!$AF$7)/$H28*OFFSET(ORÇAMENTO!$X$15,ROW(AB28)-ROW(AB$15),0),\nROUND(ROUND(OFFSET($P28,0,AB$13),15-13*ORÇAMENTO!$AF$7)*OFFSET(ORÇAMENTO!$W$15,ROW(AB28)-ROW(AB$15),0),15-13*ORÇAMENTO!$AF$11)),0)","v":0},{"$f":"IF(AND($D28=\"Serviço\",AC$12<>0,$H28>0,OR(AUTOEVENTO<>\"manual\",$M28<>1)),\nIF(Import.TipoArredondamento<>\"TransfereGOV\",\nROUND(OFFSET($P28,0,AC$13),15-13*ORÇAMENTO!$AF$7)/$H28*OFFSET(ORÇAMENTO!$X$15,ROW(AC28)-ROW(AC$15),0),\nROUND(ROUND(OFFSET($P28,0,AC$13),15-13*ORÇAMENTO!$AF$7)*OFFSET(ORÇAMENTO!$W$15,ROW(AC28)-ROW(AC$15),0),15-13*ORÇAMENTO!$AF$11)),0)","v":0},{"$f":"IF(AND($D28=\"Serviço\",AD$12<>0,$H28>0,OR(AUTOEVENTO<>\"manual\",$M28<>1)),\nIF(Import.TipoArredondamento<>\"TransfereGOV\",\nROUND(OFFSET($P28,0,AD$13),15-13*ORÇAMENTO!$AF$7)/$H28*OFFSET(ORÇAMENTO!$X$15,ROW(AD28)-ROW(AD$15),0),\nROUND(ROUND(OFFSET($P28,0,AD$13),15-13*ORÇAMENTO!$AF$7)*OFFSET(ORÇAMENTO!$W$15,ROW(AD28)-ROW(AD$15),0),15-13*ORÇAMENTO!$AF$11)),0)","v":0},{"$f":"IF(AND($D28=\"Serviço\",AE$12<>0,$H28>0,OR(AUTOEVENTO<>\"manual\",$M28<>1)),\nIF(Import.TipoArredondamento<>\"TransfereGOV\",\nROUND(OFFSET($P28,0,AE$13),15-13*ORÇAMENTO!$AF$7)/$H28*OFFSET(ORÇAMENTO!$X$15,ROW(AE28)-ROW(AE$15),0),\nROUND(ROUND(OFFSET($P28,0,AE$13),15-13*ORÇAMENTO!$AF$7)*OFFSET(ORÇAMENTO!$W$15,ROW(AE28)-ROW(AE$15),0),15-13*ORÇAMENTO!$AF$11)),0)","v":0},{"$f":"IF(AND($D28=\"Serviço\",AF$12<>0,$H28>0,OR(AUTOEVENTO<>\"manual\",$M28<>1)),\nIF(Import.TipoArredondamento<>\"TransfereGOV\",\nROUND(OFFSET($P28,0,AF$13),15-13*ORÇAMENTO!$AF$7)/$H28*OFFSET(ORÇAMENTO!$X$15,ROW(AF28)-ROW(AF$15),0),\nROUND(ROUND(OFFSET($P28,0,AF$13),15-13*ORÇAMENTO!$AF$7)*OFFSET(ORÇAMENTO!$W$15,ROW(AF28)-ROW(AF$15),0),15-13*ORÇAMENTO!$AF$11)),0)","v":0},{"$f":"IF(AND($D28=\"Serviço\",AG$12<>0,$H28>0,OR(AUTOEVENTO<>\"manual\",$M28<>1)),\nIF(Import.TipoArredondamento<>\"TransfereGOV\",\nROUND(OFFSET($P28,0,AG$13),15-13*ORÇAMENTO!$AF$7)/$H28*OFFSET(ORÇAMENTO!$X$15,ROW(AG28)-ROW(AG$15),0),\nROUND(ROUND(OFFSET($P28,0,AG$13),15-13*ORÇAMENTO!$AF$7)*OFFSET(ORÇAMENTO!$W$15,ROW(AG28)-ROW(AG$15),0),15-13*ORÇAMENTO!$AF$11)),0)","v":0},{"$f":"IF(AND($D28=\"Serviço\",AH$12<>0,$H28>0,OR(AUTOEVENTO<>\"manual\",$M28<>1)),\nIF(Import.TipoArredondamento<>\"TransfereGOV\",\nROUND(OFFSET($P28,0,AH$13),15-13*ORÇAMENTO!$AF$7)/$H28*OFFSET(ORÇAMENTO!$X$15,ROW(AH28)-ROW(AH$15),0),\nROUND(ROUND(OFFSET($P28,0,AH$13),15-13*ORÇAMENTO!$AF$7)*OFFSET(ORÇAMENTO!$W$15,ROW(AH28)-ROW(AH$15),0),15-13*ORÇAMENTO!$AF$11)),0)","v":0},{"$f":"IF(AND($D28=\"Serviço\",AI$12<>0,$H28>0,OR(AUTOEVENTO<>\"manual\",$M28<>1)),\nIF(Import.TipoArredondamento<>\"TransfereGOV\",\nROUND(OFFSET($P28,0,AI$13),15-13*ORÇAMENTO!$AF$7)/$H28*OFFSET(ORÇAMENTO!$X$15,ROW(AI28)-ROW(AI$15),0),\nROUND(ROUND(OFFSET($P28,0,AI$13),15-13*ORÇAMENTO!$AF$7)*OFFSET(ORÇAMENTO!$W$15,ROW(AI28)-ROW(AI$15),0),15-13*ORÇAMENTO!$AF$11)),0)","v":0},{"$f":"IF(AND($D28=\"Serviço\",AJ$12<>0,$H28>0,OR(AUTOEVENTO<>\"manual\",$M28<>1)),\nIF(Import.TipoArredondamento<>\"TransfereGOV\",\nROUND(OFFSET($P28,0,AJ$13),15-13*ORÇAMENTO!$AF$7)/$H28*OFFSET(ORÇAMENTO!$X$15,ROW(AJ28)-ROW(AJ$15),0),\nROUND(ROUND(OFFSET($P28,0,AJ$13),15-13*ORÇAMENTO!$AF$7)*OFFSET(ORÇAMENTO!$W$15,ROW(AJ28)-ROW(AJ$15),0),15-13*ORÇAMENTO!$AF$11)),0)","v":0},{"$f":"IF(AND($D28=\"Serviço\",AK$12<>0,$H28>0,OR(AUTOEVENTO<>\"manual\",$M28<>1)),\nIF(Import.TipoArredondamento<>\"TransfereGOV\",\nROUND(OFFSET($P28,0,AK$13),15-13*ORÇAMENTO!$AF$7)/$H28*OFFSET(ORÇAMENTO!$X$15,ROW(AK28)-ROW(AK$15),0),\nROUND(ROUND(OFFSET($P28,0,AK$13),15-13*ORÇAMENTO!$AF$7)*OFFSET(ORÇAMENTO!$W$15,ROW(AK28)-ROW(AK$15),0),15-13*ORÇAMENTO!$AF$11)),0)","v":0},null,{"$f":"IF($D28<>\"Serviço\",0,IF(AND(AUTOEVENTO=\"Manual\",$M28=1),0,IF(OFFSET(CRONOPLE!$F$14,$M28,AM$13)=\"\",10^12,OFFSET(CRONOPLE!$F$14,$M28,AM$13))))","v":0},{"$f":"IF($D28<>\"Serviço\",0,IF(AND(AUTOEVENTO=\"Manual\",$M28=1),0,IF(OFFSET(CRONOPLE!$F$14,$M28,AN$13)=\"\",10^12,OFFSET(CRONOPLE!$F$14,$M28,AN$13))))","v":0},{"$f":"IF($D28<>\"Serviço\",0,IF(AND(AUTOEVENTO=\"Manual\",$M28=1),0,IF(OFFSET(CRONOPLE!$F$14,$M28,AO$13)=\"\",10^12,OFFSET(CRONOPLE!$F$14,$M28,AO$13))))","v":0},{"$f":"IF($D28<>\"Serviço\",0,IF(AND(AUTOEVENTO=\"Manual\",$M28=1),0,IF(OFFSET(CRONOPLE!$F$14,$M28,AP$13)=\"\",10^12,OFFSET(CRONOPLE!$F$14,$M28,AP$13))))","v":0},{"$f":"IF($D28<>\"Serviço\",0,IF(AND(AUTOEVENTO=\"Manual\",$M28=1),0,IF(OFFSET(CRONOPLE!$F$14,$M28,AQ$13)=\"\",10^12,OFFSET(CRONOPLE!$F$14,$M28,AQ$13))))","v":0},{"$f":"IF($D28<>\"Serviço\",0,IF(AND(AUTOEVENTO=\"Manual\",$M28=1),0,IF(OFFSET(CRONOPLE!$F$14,$M28,AR$13)=\"\",10^12,OFFSET(CRONOPLE!$F$14,$M28,AR$13))))","v":0},{"$f":"IF($D28<>\"Serviço\",0,IF(AND(AUTOEVENTO=\"Manual\",$M28=1),0,IF(OFFSET(CRONOPLE!$F$14,$M28,AS$13)=\"\",10^12,OFFSET(CRONOPLE!$F$14,$M28,AS$13))))","v":0},{"$f":"IF($D28<>\"Serviço\",0,IF(AND(AUTOEVENTO=\"Manual\",$M28=1),0,IF(OFFSET(CRONOPLE!$F$14,$M28,AT$13)=\"\",10^12,OFFSET(CRONOPLE!$F$14,$M28,AT$13))))","v":0},{"$f":"IF($D28<>\"Serviço\",0,IF(AND(AUTOEVENTO=\"Manual\",$M28=1),0,IF(OFFSET(CRONOPLE!$F$14,$M28,AU$13)=\"\",10^12,OFFSET(CRONOPLE!$F$14,$M28,AU$13))))","v":0},{"$f":"IF($D28<>\"Serviço\",0,IF(AND(AUTOEVENTO=\"Manual\",$M28=1),0,IF(OFFSET(CRONOPLE!$F$14,$M28,AV$13)=\"\",10^12,OFFSET(CRONOPLE!$F$14,$M28,AV$13))))","v":0},null,{"$f":"IF($D28<>\"Serviço\",0,IF(OR(AND(AUTOEVENTO=\"Manual\",$M28=1),$M28>(ROW(PLE.lastrow)-ROW(PLE.firstrow))),0,IF(OFFSET(PLE!$G$14,$M28,AX$13)=\"\",10^12,OFFSET(PLE!$G$14,$M28,AX$13))))","v":0},{"$f":"IF($D28<>\"Serviço\",0,IF(OR(AND(AUTOEVENTO=\"Manual\",$M28=1),$M28>(ROW(PLE.lastrow)-ROW(PLE.firstrow))),0,IF(OFFSET(PLE!$G$14,$M28,AY$13)=\"\",10^12,OFFSET(PLE!$G$14,$M28,AY$13))))","v":0},{"$f":"IF($D28<>\"Serviço\",0,IF(OR(AND(AUTOEVENTO=\"Manual\",$M28=1),$M28>(ROW(PLE.lastrow)-ROW(PLE.firstrow))),0,IF(OFFSET(PLE!$G$14,$M28,AZ$13)=\"\",10^12,OFFSET(PLE!$G$14,$M28,AZ$13))))","v":0},{"$f":"IF($D28<>\"Serviço\",0,IF(OR(AND(AUTOEVENTO=\"Manual\",$M28=1),$M28>(ROW(PLE.lastrow)-ROW(PLE.firstrow))),0,IF(OFFSET(PLE!$G$14,$M28,BA$13)=\"\",10^12,OFFSET(PLE!$G$14,$M28,BA$13))))","v":0},{"$f":"IF($D28<>\"Serviço\",0,IF(OR(AND(AUTOEVENTO=\"Manual\",$M28=1),$M28>(ROW(PLE.lastrow)-ROW(PLE.firstrow))),0,IF(OFFSET(PLE!$G$14,$M28,BB$13)=\"\",10^12,OFFSET(PLE!$G$14,$M28,BB$13))))","v":0},{"$f":"IF($D28<>\"Serviço\",0,IF(OR(AND(AUTOEVENTO=\"Manual\",$M28=1),$M28>(ROW(PLE.lastrow)-ROW(PLE.firstrow))),0,IF(OFFSET(PLE!$G$14,$M28,BC$13)=\"\",10^12,OFFSET(PLE!$G$14,$M28,BC$13))))","v":0},{"$f":"IF($D28<>\"Serviço\",0,IF(OR(AND(AUTOEVENTO=\"Manual\",$M28=1),$M28>(ROW(PLE.lastrow)-ROW(PLE.firstrow))),0,IF(OFFSET(PLE!$G$14,$M28,BD$13)=\"\",10^12,OFFSET(PLE!$G$14,$M28,BD$13))))","v":0},{"$f":"IF($D28<>\"Serviço\",0,IF(OR(AND(AUTOEVENTO=\"Manual\",$M28=1),$M28>(ROW(PLE.lastrow)-ROW(PLE.firstrow))),0,IF(OFFSET(PLE!$G$14,$M28,BE$13)=\"\",10^12,OFFSET(PLE!$G$14,$M28,BE$13))))","v":0},{"$f":"IF($D28<>\"Serviço\",0,IF(OR(AND(AUTOEVENTO=\"Manual\",$M28=1),$M28>(ROW(PLE.lastrow)-ROW(PLE.firstrow))),0,IF(OFFSET(PLE!$G$14,$M28,BF$13)=\"\",10^12,OFFSET(PLE!$G$14,$M28,BF$13))))","v":0},{"$f":"IF($D28<>\"Serviço\",0,IF(OR(AND(AUTOEVENTO=\"Manual\",$M28=1),$M28>(ROW(PLE.lastrow)-ROW(PLE.firstrow))),0,IF(OFFSET(PLE!$G$14,$M28,BG$13)=\"\",10^12,OFFSET(PLE!$G$14,$M28,BG$13))))","v":0}]
["13",{"$f":"OFFSET(ORÇAMENTO!C$15,ROW(B29)-ROW(B$15),0)","v":"S"},{"$f":"OFFSET(ORÇAMENTO!L$15,ROW(C29)-ROW(C$15),0)","v":"F"},{"$f":"OFFSET(ORÇAMENTO!N$15,ROW(D29)-ROW(D$15),0)","v":"Serviço"},{"$f":"OFFSET(ORÇAMENTO!O$15,ROW(E29)-ROW(E$15),0)","v":"1.3.1."},{"$f":"OFFSET(ORÇAMENTO!R$15,ROW(F29)-ROW(F$15),0)","v":"PLANTIO DE GRAMA BATATAIS EM PLACAS. AF_07/2024"},{"$f":"IF($D29<>\"Serviço\",\"\",OFFSET(ORÇAMENTO!S$15,ROW(G29)-ROW(G$15),0))","v":"M2"},{"$f":"IF($D29<>\"Serviço\",0,IF(ACOMPANHAMENTO=\"BM\",ROUND(OFFSET(ORÇAMENTO!AJ$15,ROW(H29)-ROW(H$15),0),15-13*ORÇAMENTO!$AF$7),SUMPRODUCT(($Q$12:$AA$12<>\"\")*ROUND($Q29:$AA29,15-13*ORÇAMENTO!$AF$7))))","v":65.319999999999993},null,null,null,".",{"$f":"IF($D29<>\"Serviço\",\"\",IF(AUTOEVENTO=\"manual\",$A29,IF(ISERROR(MATCH($A29,$A$15:OFFSET($A29,-1,0),0)),MAX($M$15:OFFSET(M29,-1,0))+1,INDEX($M$15:OFFSET(M29,-1,0),MATCH($A29,$A$15:OFFSET($A29,-1,0),0)))))","v":4},{"$f":"IF($D29<>\"Serviço\",\"\",IF(AUTOEVENTO=\"Manual\",IF($A29=0,\"<-- defina o número do agrupador\",OFFSET(EVENTOS!$D$14,$A29,0)),OFFSET($F$15,$A29,0)))","v":"PAISAGISMO"},null,null,null,null,null,null,null,null,null,null,null,null,null,{"$f":"IF(AND($D29=\"Serviço\",AB$12<>0,$H29>0,OR(AUTOEVENTO<>\"manual\",$M29<>1)),\nIF(Import.TipoArredondamento<>\"TransfereGOV\",\nROUND(OFFSET($P29,0,AB$13),15-13*ORÇAMENTO!$AF$7)/$H29*OFFSET(ORÇAMENTO!$X$15,ROW(AB29)-ROW(AB$15),0),\nROUND(ROUND(OFFSET($P29,0,AB$13),15-13*ORÇAMENTO!$AF$7)*OFFSET(ORÇAMENTO!$W$15,ROW(AB29)-ROW(AB$15),0),15-13*ORÇAMENTO!$AF$11)),0)","v":0},{"$f":"IF(AND($D29=\"Serviço\",AC$12<>0,$H29>0,OR(AUTOEVENTO<>\"manual\",$M29<>1)),\nIF(Import.TipoArredondamento<>\"TransfereGOV\",\nROUND(OFFSET($P29,0,AC$13),15-13*ORÇAMENTO!$AF$7)/$H29*OFFSET(ORÇAMENTO!$X$15,ROW(AC29)-ROW(AC$15),0),\nROUND(ROUND(OFFSET($P29,0,AC$13),15-13*ORÇAMENTO!$AF$7)*OFFSET(ORÇAMENTO!$W$15,ROW(AC29)-ROW(AC$15),0),15-13*ORÇAMENTO!$AF$11)),0)","v":0},{"$f":"IF(AND($D29=\"Serviço\",AD$12<>0,$H29>0,OR(AUTOEVENTO<>\"manual\",$M29<>1)),\nIF(Import.TipoArredondamento<>\"TransfereGOV\",\nROUND(OFFSET($P29,0,AD$13),15-13*ORÇAMENTO!$AF$7)/$H29*OFFSET(ORÇAMENTO!$X$15,ROW(AD29)-ROW(AD$15),0),\nROUND(ROUND(OFFSET($P29,0,AD$13),15-13*ORÇAMENTO!$AF$7)*OFFSET(ORÇAMENTO!$W$15,ROW(AD29)-ROW(AD$15),0),15-13*ORÇAMENTO!$AF$11)),0)","v":0},{"$f":"IF(AND($D29=\"Serviço\",AE$12<>0,$H29>0,OR(AUTOEVENTO<>\"manual\",$M29<>1)),\nIF(Import.TipoArredondamento<>\"TransfereGOV\",\nROUND(OFFSET($P29,0,AE$13),15-13*ORÇAMENTO!$AF$7)/$H29*OFFSET(ORÇAMENTO!$X$15,ROW(AE29)-ROW(AE$15),0),\nROUND(ROUND(OFFSET($P29,0,AE$13),15-13*ORÇAMENTO!$AF$7)*OFFSET(ORÇAMENTO!$W$15,ROW(AE29)-ROW(AE$15),0),15-13*ORÇAMENTO!$AF$11)),0)","v":0},{"$f":"IF(AND($D29=\"Serviço\",AF$12<>0,$H29>0,OR(AUTOEVENTO<>\"manual\",$M29<>1)),\nIF(Import.TipoArredondamento<>\"TransfereGOV\",\nROUND(OFFSET($P29,0,AF$13),15-13*ORÇAMENTO!$AF$7)/$H29*OFFSET(ORÇAMENTO!$X$15,ROW(AF29)-ROW(AF$15),0),\nROUND(ROUND(OFFSET($P29,0,AF$13),15-13*ORÇAMENTO!$AF$7)*OFFSET(ORÇAMENTO!$W$15,ROW(AF29)-ROW(AF$15),0),15-13*ORÇAMENTO!$AF$11)),0)","v":0},{"$f":"IF(AND($D29=\"Serviço\",AG$12<>0,$H29>0,OR(AUTOEVENTO<>\"manual\",$M29<>1)),\nIF(Import.TipoArredondamento<>\"TransfereGOV\",\nROUND(OFFSET($P29,0,AG$13),15-13*ORÇAMENTO!$AF$7)/$H29*OFFSET(ORÇAMENTO!$X$15,ROW(AG29)-ROW(AG$15),0),\nROUND(ROUND(OFFSET($P29,0,AG$13),15-13*ORÇAMENTO!$AF$7)*OFFSET(ORÇAMENTO!$W$15,ROW(AG29)-ROW(AG$15),0),15-13*ORÇAMENTO!$AF$11)),0)","v":0},{"$f":"IF(AND($D29=\"Serviço\",AH$12<>0,$H29>0,OR(AUTOEVENTO<>\"manual\",$M29<>1)),\nIF(Import.TipoArredondamento<>\"TransfereGOV\",\nROUND(OFFSET($P29,0,AH$13),15-13*ORÇAMENTO!$AF$7)/$H29*OFFSET(ORÇAMENTO!$X$15,ROW(AH29)-ROW(AH$15),0),\nROUND(ROUND(OFFSET($P29,0,AH$13),15-13*ORÇAMENTO!$AF$7)*OFFSET(ORÇAMENTO!$W$15,ROW(AH29)-ROW(AH$15),0),15-13*ORÇAMENTO!$AF$11)),0)","v":0},{"$f":"IF(AND($D29=\"Serviço\",AI$12<>0,$H29>0,OR(AUTOEVENTO<>\"manual\",$M29<>1)),\nIF(Import.TipoArredondamento<>\"TransfereGOV\",\nROUND(OFFSET($P29,0,AI$13),15-13*ORÇAMENTO!$AF$7)/$H29*OFFSET(ORÇAMENTO!$X$15,ROW(AI29)-ROW(AI$15),0),\nROUND(ROUND(OFFSET($P29,0,AI$13),15-13*ORÇAMENTO!$AF$7)*OFFSET(ORÇAMENTO!$W$15,ROW(AI29)-ROW(AI$15),0),15-13*ORÇAMENTO!$AF$11)),0)","v":0},{"$f":"IF(AND($D29=\"Serviço\",AJ$12<>0,$H29>0,OR(AUTOEVENTO<>\"manual\",$M29<>1)),\nIF(Import.TipoArredondamento<>\"TransfereGOV\",\nROUND(OFFSET($P29,0,AJ$13),15-13*ORÇAMENTO!$AF$7)/$H29*OFFSET(ORÇAMENTO!$X$15,ROW(AJ29)-ROW(AJ$15),0),\nROUND(ROUND(OFFSET($P29,0,AJ$13),15-13*ORÇAMENTO!$AF$7)*OFFSET(ORÇAMENTO!$W$15,ROW(AJ29)-ROW(AJ$15),0),15-13*ORÇAMENTO!$AF$11)),0)","v":0},{"$f":"IF(AND($D29=\"Serviço\",AK$12<>0,$H29>0,OR(AUTOEVENTO<>\"manual\",$M29<>1)),\nIF(Import.TipoArredondamento<>\"TransfereGOV\",\nROUND(OFFSET($P29,0,AK$13),15-13*ORÇAMENTO!$AF$7)/$H29*OFFSET(ORÇAMENTO!$X$15,ROW(AK29)-ROW(AK$15),0),\nROUND(ROUND(OFFSET($P29,0,AK$13),15-13*ORÇAMENTO!$AF$7)*OFFSET(ORÇAMENTO!$W$15,ROW(AK29)-ROW(AK$15),0),15-13*ORÇAMENTO!$AF$11)),0)","v":0},null,{"$f":"IF($D29<>\"Serviço\",0,IF(AND(AUTOEVENTO=\"Manual\",$M29=1),0,IF(OFFSET(CRONOPLE!$F$14,$M29,AM$13)=\"\",10^12,OFFSET(CRONOPLE!$F$14,$M29,AM$13))))","v":1000000000000},{"$f":"IF($D29<>\"Serviço\",0,IF(AND(AUTOEVENTO=\"Manual\",$M29=1),0,IF(OFFSET(CRONOPLE!$F$14,$M29,AN$13)=\"\",10^12,OFFSET(CRONOPLE!$F$14,$M29,AN$13))))","v":1000000000000},{"$f":"IF($D29<>\"Serviço\",0,IF(AND(AUTOEVENTO=\"Manual\",$M29=1),0,IF(OFFSET(CRONOPLE!$F$14,$M29,AO$13)=\"\",10^12,OFFSET(CRONOPLE!$F$14,$M29,AO$13))))","v":1000000000000},{"$f":"IF($D29<>\"Serviço\",0,IF(AND(AUTOEVENTO=\"Manual\",$M29=1),0,IF(OFFSET(CRONOPLE!$F$14,$M29,AP$13)=\"\",10^12,OFFSET(CRONOPLE!$F$14,$M29,AP$13))))","v":1000000000000},{"$f":"IF($D29<>\"Serviço\",0,IF(AND(AUTOEVENTO=\"Manual\",$M29=1),0,IF(OFFSET(CRONOPLE!$F$14,$M29,AQ$13)=\"\",10^12,OFFSET(CRONOPLE!$F$14,$M29,AQ$13))))","v":1000000000000},{"$f":"IF($D29<>\"Serviço\",0,IF(AND(AUTOEVENTO=\"Manual\",$M29=1),0,IF(OFFSET(CRONOPLE!$F$14,$M29,AR$13)=\"\",10^12,OFFSET(CRONOPLE!$F$14,$M29,AR$13))))","v":1000000000000},{"$f":"IF($D29<>\"Serviço\",0,IF(AND(AUTOEVENTO=\"Manual\",$M29=1),0,IF(OFFSET(CRONOPLE!$F$14,$M29,AS$13)=\"\",10^12,OFFSET(CRONOPLE!$F$14,$M29,AS$13))))","v":1000000000000},{"$f":"IF($D29<>\"Serviço\",0,IF(AND(AUTOEVENTO=\"Manual\",$M29=1),0,IF(OFFSET(CRONOPLE!$F$14,$M29,AT$13)=\"\",10^12,OFFSET(CRONOPLE!$F$14,$M29,AT$13))))","v":1000000000000},{"$f":"IF($D29<>\"Serviço\",0,IF(AND(AUTOEVENTO=\"Manual\",$M29=1),0,IF(OFFSET(CRONOPLE!$F$14,$M29,AU$13)=\"\",10^12,OFFSET(CRONOPLE!$F$14,$M29,AU$13))))","v":1000000000000},{"$f":"IF($D29<>\"Serviço\",0,IF(AND(AUTOEVENTO=\"Manual\",$M29=1),0,IF(OFFSET(CRONOPLE!$F$14,$M29,AV$13)=\"\",10^12,OFFSET(CRONOPLE!$F$14,$M29,AV$13))))","v":1000000000000},null,{"$f":"IF($D29<>\"Serviço\",0,IF(OR(AND(AUTOEVENTO=\"Manual\",$M29=1),$M29>(ROW(PLE.lastrow)-ROW(PLE.firstrow))),0,IF(OFFSET(PLE!$G$14,$M29,AX$13)=\"\",10^12,OFFSET(PLE!$G$14,$M29,AX$13))))","v":1000000000000},{"$f":"IF($D29<>\"Serviço\",0,IF(OR(AND(AUTOEVENTO=\"Manual\",$M29=1),$M29>(ROW(PLE.lastrow)-ROW(PLE.firstrow))),0,IF(OFFSET(PLE!$G$14,$M29,AY$13)=\"\",10^12,OFFSET(PLE!$G$14,$M29,AY$13))))","v":1000000000000},{"$f":"IF($D29<>\"Serviço\",0,IF(OR(AND(AUTOEVENTO=\"Manual\",$M29=1),$M29>(ROW(PLE.lastrow)-ROW(PLE.firstrow))),0,IF(OFFSET(PLE!$G$14,$M29,AZ$13)=\"\",10^12,OFFSET(PLE!$G$14,$M29,AZ$13))))","v":1000000000000},{"$f":"IF($D29<>\"Serviço\",0,IF(OR(AND(AUTOEVENTO=\"Manual\",$M29=1),$M29>(ROW(PLE.lastrow)-ROW(PLE.firstrow))),0,IF(OFFSET(PLE!$G$14,$M29,BA$13)=\"\",10^12,OFFSET(PLE!$G$14,$M29,BA$13))))","v":1000000000000},{"$f":"IF($D29<>\"Serviço\",0,IF(OR(AND(AUTOEVENTO=\"Manual\",$M29=1),$M29>(ROW(PLE.lastrow)-ROW(PLE.firstrow))),0,IF(OFFSET(PLE!$G$14,$M29,BB$13)=\"\",10^12,OFFSET(PLE!$G$14,$M29,BB$13))))","v":1000000000000},{"$f":"IF($D29<>\"Serviço\",0,IF(OR(AND(AUTOEVENTO=\"Manual\",$M29=1),$M29>(ROW(PLE.lastrow)-ROW(PLE.firstrow))),0,IF(OFFSET(PLE!$G$14,$M29,BC$13)=\"\",10^12,OFFSET(PLE!$G$14,$M29,BC$13))))","v":1000000000000},{"$f":"IF($D29<>\"Serviço\",0,IF(OR(AND(AUTOEVENTO=\"Manual\",$M29=1),$M29>(ROW(PLE.lastrow)-ROW(PLE.firstrow))),0,IF(OFFSET(PLE!$G$14,$M29,BD$13)=\"\",10^12,OFFSET(PLE!$G$14,$M29,BD$13))))","v":1000000000000},{"$f":"IF($D29<>\"Serviço\",0,IF(OR(AND(AUTOEVENTO=\"Manual\",$M29=1),$M29>(ROW(PLE.lastrow)-ROW(PLE.firstrow))),0,IF(OFFSET(PLE!$G$14,$M29,BE$13)=\"\",10^12,OFFSET(PLE!$G$14,$M29,BE$13))))","v":1000000000000},{"$f":"IF($D29<>\"Serviço\",0,IF(OR(AND(AUTOEVENTO=\"Manual\",$M29=1),$M29>(ROW(PLE.lastrow)-ROW(PLE.firstrow))),0,IF(OFFSET(PLE!$G$14,$M29,BF$13)=\"\",10^12,OFFSET(PLE!$G$14,$M29,BF$13))))","v":1000000000000},{"$f":"IF($D29<>\"Serviço\",0,IF(OR(AND(AUTOEVENTO=\"Manual\",$M29=1),$M29>(ROW(PLE.lastrow)-ROW(PLE.firstrow))),0,IF(OFFSET(PLE!$G$14,$M29,BG$13)=\"\",10^12,OFFSET(PLE!$G$14,$M29,BG$13))))","v":1000000000000}]
[{"$f":"IF(AUTOEVENTO=\"Manual\",IF(K30<>\"\",MIN(VALUE(LEFT(K30,FIND(\".\",K30)-1)),COUNTA(EVENTOS.Lista)),0),IF(OR($B30>AUTOEVENTO,$B30=\"S\",$B30=0),SUBSTITUTE(OFFSET($A30,-1,0),IF($D30=\"Serviço\",\".\",\"\"),\"\"),ROW(A30)-ROW($A$15)&\".\"))","v":"15."},{"$f":"OFFSET(ORÇAMENTO!C$15,ROW(B30)-ROW(B$15),0)","v":2},{"$f":"OFFSET(ORÇAMENTO!L$15,ROW(C30)-ROW(C$15),0)","v":"F"},{"$f":"OFFSET(ORÇAMENTO!N$15,ROW(D30)-ROW(D$15),0)","v":"Nível 2"},{"$f":"OFFSET(ORÇAMENTO!O$15,ROW(E30)-ROW(E$15),0)","v":"1.4."},{"$f":"OFFSET(ORÇAMENTO!R$15,ROW(F30)-ROW(F$15),0)","v":"LIMPEZA DA OBRA"},{"$f":"IF($D30<>\"Serviço\",\"\",OFFSET(ORÇAMENTO!S$15,ROW(G30)-ROW(G$15),0))","v":""},{"$f":"IF($D30<>\"Serviço\",0,IF(ACOMPANHAMENTO=\"BM\",ROUND(OFFSET(ORÇAMENTO!AJ$15,ROW(H30)-ROW(H$15),0),15-13*ORÇAMENTO!$AF$7),SUMPRODUCT(($Q$12:$AA$12<>\"\")*ROUND($Q30:$AA30,15-13*ORÇAMENTO!$AF$7))))","v":0},null,null,null,".",{"$f":"IF($D30<>\"Serviço\",\"\",IF(AUTOEVENTO=\"manual\",$A30,IF(ISERROR(MATCH($A30,$A$15:OFFSET($A30,-1,0),0)),MAX($M$15:OFFSET(M30,-1,0))+1,INDEX($M$15:OFFSET(M30,-1,0),MATCH($A30,$A$15:OFFSET($A30,-1,0),0)))))","v":""},{"$f":"IF($D30<>\"Serviço\",\"\",IF(AUTOEVENTO=\"Manual\",IF($A30=0,\"<-- defina o número do agrupador\",OFFSET(EVENTOS!$D$14,$A30,0)),OFFSET($F$15,$A30,0)))","v":""},null,null,null,null,null,null,null,null,null,null,null,null,null,{"$f":"IF(AND($D30=\"Serviço\",AB$12<>0,$H30>0,OR(AUTOEVENTO<>\"manual\",$M30<>1)),\nIF(Import.TipoArredondamento<>\"TransfereGOV\",\nROUND(OFFSET($P30,0,AB$13),15-13*ORÇAMENTO!$AF$7)/$H30*OFFSET(ORÇAMENTO!$X$15,ROW(AB30)-ROW(AB$15),0),\nROUND(ROUND(OFFSET($P30,0,AB$13),15-13*ORÇAMENTO!$AF$7)*OFFSET(ORÇAMENTO!$W$15,ROW(AB30)-ROW(AB$15),0),15-13*ORÇAMENTO!$AF$11)),0)","v":0},{"$f":"IF(AND($D30=\"Serviço\",AC$12<>0,$H30>0,OR(AUTOEVENTO<>\"manual\",$M30<>1)),\nIF(Import.TipoArredondamento<>\"TransfereGOV\",\nROUND(OFFSET($P30,0,AC$13),15-13*ORÇAMENTO!$AF$7)/$H30*OFFSET(ORÇAMENTO!$X$15,ROW(AC30)-ROW(AC$15),0),\nROUND(ROUND(OFFSET($P30,0,AC$13),15-13*ORÇAMENTO!$AF$7)*OFFSET(ORÇAMENTO!$W$15,ROW(AC30)-ROW(AC$15),0),15-13*ORÇAMENTO!$AF$11)),0)","v":0},{"$f":"IF(AND($D30=\"Serviço\",AD$12<>0,$H30>0,OR(AUTOEVENTO<>\"manual\",$M30<>1)),\nIF(Import.TipoArredondamento<>\"TransfereGOV\",\nROUND(OFFSET($P30,0,AD$13),15-13*ORÇAMENTO!$AF$7)/$H30*OFFSET(ORÇAMENTO!$X$15,ROW(AD30)-ROW(AD$15),0),\nROUND(ROUND(OFFSET($P30,0,AD$13),15-13*ORÇAMENTO!$AF$7)*OFFSET(ORÇAMENTO!$W$15,ROW(AD30)-ROW(AD$15),0),15-13*ORÇAMENTO!$AF$11)),0)","v":0},{"$f":"IF(AND($D30=\"Serviço\",AE$12<>0,$H30>0,OR(AUTOEVENTO<>\"manual\",$M30<>1)),\nIF(Import.TipoArredondamento<>\"TransfereGOV\",\nROUND(OFFSET($P30,0,AE$13),15-13*ORÇAMENTO!$AF$7)/$H30*OFFSET(ORÇAMENTO!$X$15,ROW(AE30)-ROW(AE$15),0),\nROUND(ROUND(OFFSET($P30,0,AE$13),15-13*ORÇAMENTO!$AF$7)*OFFSET(ORÇAMENTO!$W$15,ROW(AE30)-ROW(AE$15),0),15-13*ORÇAMENTO!$AF$11)),0)","v":0},{"$f":"IF(AND($D30=\"Serviço\",AF$12<>0,$H30>0,OR(AUTOEVENTO<>\"manual\",$M30<>1)),\nIF(Import.TipoArredondamento<>\"TransfereGOV\",\nROUND(OFFSET($P30,0,AF$13),15-13*ORÇAMENTO!$AF$7)/$H30*OFFSET(ORÇAMENTO!$X$15,ROW(AF30)-ROW(AF$15),0),\nROUND(ROUND(OFFSET($P30,0,AF$13),15-13*ORÇAMENTO!$AF$7)*OFFSET(ORÇAMENTO!$W$15,ROW(AF30)-ROW(AF$15),0),15-13*ORÇAMENTO!$AF$11)),0)","v":0},{"$f":"IF(AND($D30=\"Serviço\",AG$12<>0,$H30>0,OR(AUTOEVENTO<>\"manual\",$M30<>1)),\nIF(Import.TipoArredondamento<>\"TransfereGOV\",\nROUND(OFFSET($P30,0,AG$13),15-13*ORÇAMENTO!$AF$7)/$H30*OFFSET(ORÇAMENTO!$X$15,ROW(AG30)-ROW(AG$15),0),\nROUND(ROUND(OFFSET($P30,0,AG$13),15-13*ORÇAMENTO!$AF$7)*OFFSET(ORÇAMENTO!$W$15,ROW(AG30)-ROW(AG$15),0),15-13*ORÇAMENTO!$AF$11)),0)","v":0},{"$f":"IF(AND($D30=\"Serviço\",AH$12<>0,$H30>0,OR(AUTOEVENTO<>\"manual\",$M30<>1)),\nIF(Import.TipoArredondamento<>\"TransfereGOV\",\nROUND(OFFSET($P30,0,AH$13),15-13*ORÇAMENTO!$AF$7)/$H30*OFFSET(ORÇAMENTO!$X$15,ROW(AH30)-ROW(AH$15),0),\nROUND(ROUND(OFFSET($P30,0,AH$13),15-13*ORÇAMENTO!$AF$7)*OFFSET(ORÇAMENTO!$W$15,ROW(AH30)-ROW(AH$15),0),15-13*ORÇAMENTO!$AF$11)),0)","v":0},{"$f":"IF(AND($D30=\"Serviço\",AI$12<>0,$H30>0,OR(AUTOEVENTO<>\"manual\",$M30<>1)),\nIF(Import.TipoArredondamento<>\"TransfereGOV\",\nROUND(OFFSET($P30,0,AI$13),15-13*ORÇAMENTO!$AF$7)/$H30*OFFSET(ORÇAMENTO!$X$15,ROW(AI30)-ROW(AI$15),0),\nROUND(ROUND(OFFSET($P30,0,AI$13),15-13*ORÇAMENTO!$AF$7)*OFFSET(ORÇAMENTO!$W$15,ROW(AI30)-ROW(AI$15),0),15-13*ORÇAMENTO!$AF$11)),0)","v":0},{"$f":"IF(AND($D30=\"Serviço\",AJ$12<>0,$H30>0,OR(AUTOEVENTO<>\"manual\",$M30<>1)),\nIF(Import.TipoArredondamento<>\"TransfereGOV\",\nROUND(OFFSET($P30,0,AJ$13),15-13*ORÇAMENTO!$AF$7)/$H30*OFFSET(ORÇAMENTO!$X$15,ROW(AJ30)-ROW(AJ$15),0),\nROUND(ROUND(OFFSET($P30,0,AJ$13),15-13*ORÇAMENTO!$AF$7)*OFFSET(ORÇAMENTO!$W$15,ROW(AJ30)-ROW(AJ$15),0),15-13*ORÇAMENTO!$AF$11)),0)","v":0},{"$f":"IF(AND($D30=\"Serviço\",AK$12<>0,$H30>0,OR(AUTOEVENTO<>\"manual\",$M30<>1)),\nIF(Import.TipoArredondamento<>\"TransfereGOV\",\nROUND(OFFSET($P30,0,AK$13),15-13*ORÇAMENTO!$AF$7)/$H30*OFFSET(ORÇAMENTO!$X$15,ROW(AK30)-ROW(AK$15),0),\nROUND(ROUND(OFFSET($P30,0,AK$13),15-13*ORÇAMENTO!$AF$7)*OFFSET(ORÇAMENTO!$W$15,ROW(AK30)-ROW(AK$15),0),15-13*ORÇAMENTO!$AF$11)),0)","v":0},null,{"$f":"IF($D30<>\"Serviço\",0,IF(AND(AUTOEVENTO=\"Manual\",$M30=1),0,IF(OFFSET(CRONOPLE!$F$14,$M30,AM$13)=\"\",10^12,OFFSET(CRONOPLE!$F$14,$M30,AM$13))))","v":0},{"$f":"IF($D30<>\"Serviço\",0,IF(AND(AUTOEVENTO=\"Manual\",$M30=1),0,IF(OFFSET(CRONOPLE!$F$14,$M30,AN$13)=\"\",10^12,OFFSET(CRONOPLE!$F$14,$M30,AN$13))))","v":0},{"$f":"IF($D30<>\"Serviço\",0,IF(AND(AUTOEVENTO=\"Manual\",$M30=1),0,IF(OFFSET(CRONOPLE!$F$14,$M30,AO$13)=\"\",10^12,OFFSET(CRONOPLE!$F$14,$M30,AO$13))))","v":0},{"$f":"IF($D30<>\"Serviço\",0,IF(AND(AUTOEVENTO=\"Manual\",$M30=1),0,IF(OFFSET(CRONOPLE!$F$14,$M30,AP$13)=\"\",10^12,OFFSET(CRONOPLE!$F$14,$M30,AP$13))))","v":0},{"$f":"IF($D30<>\"Serviço\",0,IF(AND(AUTOEVENTO=\"Manual\",$M30=1),0,IF(OFFSET(CRONOPLE!$F$14,$M30,AQ$13)=\"\",10^12,OFFSET(CRONOPLE!$F$14,$M30,AQ$13))))","v":0},{"$f":"IF($D30<>\"Serviço\",0,IF(AND(AUTOEVENTO=\"Manual\",$M30=1),0,IF(OFFSET(CRONOPLE!$F$14,$M30,AR$13)=\"\",10^12,OFFSET(CRONOPLE!$F$14,$M30,AR$13))))","v":0},{"$f":"IF($D30<>\"Serviço\",0,IF(AND(AUTOEVENTO=\"Manual\",$M30=1),0,IF(OFFSET(CRONOPLE!$F$14,$M30,AS$13)=\"\",10^12,OFFSET(CRONOPLE!$F$14,$M30,AS$13))))","v":0},{"$f":"IF($D30<>\"Serviço\",0,IF(AND(AUTOEVENTO=\"Manual\",$M30=1),0,IF(OFFSET(CRONOPLE!$F$14,$M30,AT$13)=\"\",10^12,OFFSET(CRONOPLE!$F$14,$M30,AT$13))))","v":0},{"$f":"IF($D30<>\"Serviço\",0,IF(AND(AUTOEVENTO=\"Manual\",$M30=1),0,IF(OFFSET(CRONOPLE!$F$14,$M30,AU$13)=\"\",10^12,OFFSET(CRONOPLE!$F$14,$M30,AU$13))))","v":0},{"$f":"IF($D30<>\"Serviço\",0,IF(AND(AUTOEVENTO=\"Manual\",$M30=1),0,IF(OFFSET(CRONOPLE!$F$14,$M30,AV$13)=\"\",10^12,OFFSET(CRONOPLE!$F$14,$M30,AV$13))))","v":0},null,{"$f":"IF($D30<>\"Serviço\",0,IF(OR(AND(AUTOEVENTO=\"Manual\",$M30=1),$M30>(ROW(PLE.lastrow)-ROW(PLE.firstrow))),0,IF(OFFSET(PLE!$G$14,$M30,AX$13)=\"\",10^12,OFFSET(PLE!$G$14,$M30,AX$13))))","v":0},{"$f":"IF($D30<>\"Serviço\",0,IF(OR(AND(AUTOEVENTO=\"Manual\",$M30=1),$M30>(ROW(PLE.lastrow)-ROW(PLE.firstrow))),0,IF(OFFSET(PLE!$G$14,$M30,AY$13)=\"\",10^12,OFFSET(PLE!$G$14,$M30,AY$13))))","v":0},{"$f":"IF($D30<>\"Serviço\",0,IF(OR(AND(AUTOEVENTO=\"Manual\",$M30=1),$M30>(ROW(PLE.lastrow)-ROW(PLE.firstrow))),0,IF(OFFSET(PLE!$G$14,$M30,AZ$13)=\"\",10^12,OFFSET(PLE!$G$14,$M30,AZ$13))))","v":0},{"$f":"IF($D30<>\"Serviço\",0,IF(OR(AND(AUTOEVENTO=\"Manual\",$M30=1),$M30>(ROW(PLE.lastrow)-ROW(PLE.firstrow))),0,IF(OFFSET(PLE!$G$14,$M30,BA$13)=\"\",10^12,OFFSET(PLE!$G$14,$M30,BA$13))))","v":0},{"$f":"IF($D30<>\"Serviço\",0,IF(OR(AND(AUTOEVENTO=\"Manual\",$M30=1),$M30>(ROW(PLE.lastrow)-ROW(PLE.firstrow))),0,IF(OFFSET(PLE!$G$14,$M30,BB$13)=\"\",10^12,OFFSET(PLE!$G$14,$M30,BB$13))))","v":0},{"$f":"IF($D30<>\"Serviço\",0,IF(OR(AND(AUTOEVENTO=\"Manual\",$M30=1),$M30>(ROW(PLE.lastrow)-ROW(PLE.firstrow))),0,IF(OFFSET(PLE!$G$14,$M30,BC$13)=\"\",10^12,OFFSET(PLE!$G$14,$M30,BC$13))))","v":0},{"$f":"IF($D30<>\"Serviço\",0,IF(OR(AND(AUTOEVENTO=\"Manual\",$M30=1),$M30>(ROW(PLE.lastrow)-ROW(PLE.firstrow))),0,IF(OFFSET(PLE!$G$14,$M30,BD$13)=\"\",10^12,OFFSET(PLE!$G$14,$M30,BD$13))))","v":0},{"$f":"IF($D30<>\"Serviço\",0,IF(OR(AND(AUTOEVENTO=\"Manual\",$M30=1),$M30>(ROW(PLE.lastrow)-ROW(PLE.firstrow))),0,IF(OFFSET(PLE!$G$14,$M30,BE$13)=\"\",10^12,OFFSET(PLE!$G$14,$M30,BE$13))))","v":0},{"$f":"IF($D30<>\"Serviço\",0,IF(OR(AND(AUTOEVENTO=\"Manual\",$M30=1),$M30>(ROW(PLE.lastrow)-ROW(PLE.firstrow))),0,IF(OFFSET(PLE!$G$14,$M30,BF$13)=\"\",10^12,OFFSET(PLE!$G$14,$M30,BF$13))))","v":0},{"$f":"IF($D30<>\"Serviço\",0,IF(OR(AND(AUTOEVENTO=\"Manual\",$M30=1),$M30>(ROW(PLE.lastrow)-ROW(PLE.firstrow))),0,IF(OFFSET(PLE!$G$14,$M30,BG$13)=\"\",10^12,OFFSET(PLE!$G$14,$M30,BG$13))))","v":0}]
["15",{"$f":"OFFSET(ORÇAMENTO!C$15,ROW(B31)-ROW(B$15),0)","v":"S"},{"$f":"OFFSET(ORÇAMENTO!L$15,ROW(C31)-ROW(C$15),0)","v":"F"},{"$f":"OFFSET(ORÇAMENTO!N$15,ROW(D31)-ROW(D$15),0)","v":"Serviço"},{"$f":"OFFSET(ORÇAMENTO!O$15,ROW(E31)-ROW(E$15),0)","v":"1.4.1."},{"$f":"OFFSET(ORÇAMENTO!R$15,ROW(F31)-ROW(F$15),0)","v":"CARGA, MANOBRA E DESCARGA DE ENTULHO EM CAMINHÃO BASCULANTE 6 M³ - CARGA COM ESCAVADEIRA HIDRÁULICA  (CAÇAMBA DE 0,80 M³ / 111 HP) E DESCARGA LIVRE (UNIDADE: M3). AF_07/2020"},{"$f":"IF($D31<>\"Serviço\",\"\",OFFSET(ORÇAMENTO!S$15,ROW(G31)-ROW(G$15),0))","v":"M3"},{"$f":"IF($D31<>\"Serviço\",0,IF(ACOMPANHAMENTO=\"BM\",ROUND(OFFSET(ORÇAMENTO!AJ$15,ROW(H31)-ROW(H$15),0),15-13*ORÇAMENTO!$AF$7),SUMPRODUCT(($Q$12:$AA$12<>\"\")*ROUND($Q31:$AA31,15-13*ORÇAMENTO!$AF$7))))","v":45},null,null,null,".",{"$f":"IF($D31<>\"Serviço\",\"\",IF(AUTOEVENTO=\"manual\",$A31,IF(ISERROR(MATCH($A31,$A$15:OFFSET($A31,-1,0),0)),MAX($M$15:OFFSET(M31,-1,0))+1,INDEX($M$15:OFFSET(M31,-1,0),MATCH($A31,$A$15:OFFSET($A31,-1,0),0)))))","v":5},{"$f":"IF($D31<>\"Serviço\",\"\",IF(AUTOEVENTO=\"Manual\",IF($A31=0,\"<-- defina o número do agrupador\",OFFSET(EVENTOS!$D$14,$A31,0)),OFFSET($F$15,$A31,0)))","v":"LIMPEZA DA OBRA"},null,null,null,null,null,null,null,null,null,null,null,null,null,{"$f":"IF(AND($D31=\"Serviço\",AB$12<>0,$H31>0,OR(AUTOEVENTO<>\"manual\",$M31<>1)),\nIF(Import.TipoArredondamento<>\"TransfereGOV\",\nROUND(OFFSET($P31,0,AB$13),15-13*ORÇAMENTO!$AF$7)/$H31*OFFSET(ORÇAMENTO!$X$15,ROW(AB31)-ROW(AB$15),0),\nROUND(ROUND(OFFSET($P31,0,AB$13),15-13*ORÇAMENTO!$AF$7)*OFFSET(ORÇAMENTO!$W$15,ROW(AB31)-ROW(AB$15),0),15-13*ORÇAMENTO!$AF$11)),0)","v":0},{"$f":"IF(AND($D31=\"Serviço\",AC$12<>0,$H31>0,OR(AUTOEVENTO<>\"manual\",$M31<>1)),\nIF(Import.TipoArredondamento<>\"TransfereGOV\",\nROUND(OFFSET($P31,0,AC$13),15-13*ORÇAMENTO!$AF$7)/$H31*OFFSET(ORÇAMENTO!$X$15,ROW(AC31)-ROW(AC$15),0),\nROUND(ROUND(OFFSET($P31,0,AC$13),15-13*ORÇAMENTO!$AF$7)*OFFSET(ORÇAMENTO!$W$15,ROW(AC31)-ROW(AC$15),0),15-13*ORÇAMENTO!$AF$11)),0)","v":0},{"$f":"IF(AND($D31=\"Serviço\",AD$12<>0,$H31>0,OR(AUTOEVENTO<>\"manual\",$M31<>1)),\nIF(Import.TipoArredondamento<>\"TransfereGOV\",\nROUND(OFFSET($P31,0,AD$13),15-13*ORÇAMENTO!$AF$7)/$H31*OFFSET(ORÇAMENTO!$X$15,ROW(AD31)-ROW(AD$15),0),\nROUND(ROUND(OFFSET($P31,0,AD$13),15-13*ORÇAMENTO!$AF$7)*OFFSET(ORÇAMENTO!$W$15,ROW(AD31)-ROW(AD$15),0),15-13*ORÇAMENTO!$AF$11)),0)","v":0},{"$f":"IF(AND($D31=\"Serviço\",AE$12<>0,$H31>0,OR(AUTOEVENTO<>\"manual\",$M31<>1)),\nIF(Import.TipoArredondamento<>\"TransfereGOV\",\nROUND(OFFSET($P31,0,AE$13),15-13*ORÇAMENTO!$AF$7)/$H31*OFFSET(ORÇAMENTO!$X$15,ROW(AE31)-ROW(AE$15),0),\nROUND(ROUND(OFFSET($P31,0,AE$13),15-13*ORÇAMENTO!$AF$7)*OFFSET(ORÇAMENTO!$W$15,ROW(AE31)-ROW(AE$15),0),15-13*ORÇAMENTO!$AF$11)),0)","v":0},{"$f":"IF(AND($D31=\"Serviço\",AF$12<>0,$H31>0,OR(AUTOEVENTO<>\"manual\",$M31<>1)),\nIF(Import.TipoArredondamento<>\"TransfereGOV\",\nROUND(OFFSET($P31,0,AF$13),15-13*ORÇAMENTO!$AF$7)/$H31*OFFSET(ORÇAMENTO!$X$15,ROW(AF31)-ROW(AF$15),0),\nROUND(ROUND(OFFSET($P31,0,AF$13),15-13*ORÇAMENTO!$AF$7)*OFFSET(ORÇAMENTO!$W$15,ROW(AF31)-ROW(AF$15),0),15-13*ORÇAMENTO!$AF$11)),0)","v":0},{"$f":"IF(AND($D31=\"Serviço\",AG$12<>0,$H31>0,OR(AUTOEVENTO<>\"manual\",$M31<>1)),\nIF(Import.TipoArredondamento<>\"TransfereGOV\",\nROUND(OFFSET($P31,0,AG$13),15-13*ORÇAMENTO!$AF$7)/$H31*OFFSET(ORÇAMENTO!$X$15,ROW(AG31)-ROW(AG$15),0),\nROUND(ROUND(OFFSET($P31,0,AG$13),15-13*ORÇAMENTO!$AF$7)*OFFSET(ORÇAMENTO!$W$15,ROW(AG31)-ROW(AG$15),0),15-13*ORÇAMENTO!$AF$11)),0)","v":0},{"$f":"IF(AND($D31=\"Serviço\",AH$12<>0,$H31>0,OR(AUTOEVENTO<>\"manual\",$M31<>1)),\nIF(Import.TipoArredondamento<>\"TransfereGOV\",\nROUND(OFFSET($P31,0,AH$13),15-13*ORÇAMENTO!$AF$7)/$H31*OFFSET(ORÇAMENTO!$X$15,ROW(AH31)-ROW(AH$15),0),\nROUND(ROUND(OFFSET($P31,0,AH$13),15-13*ORÇAMENTO!$AF$7)*OFFSET(ORÇAMENTO!$W$15,ROW(AH31)-ROW(AH$15),0),15-13*ORÇAMENTO!$AF$11)),0)","v":0},{"$f":"IF(AND($D31=\"Serviço\",AI$12<>0,$H31>0,OR(AUTOEVENTO<>\"manual\",$M31<>1)),\nIF(Import.TipoArredondamento<>\"TransfereGOV\",\nROUND(OFFSET($P31,0,AI$13),15-13*ORÇAMENTO!$AF$7)/$H31*OFFSET(ORÇAMENTO!$X$15,ROW(AI31)-ROW(AI$15),0),\nROUND(ROUND(OFFSET($P31,0,AI$13),15-13*ORÇAMENTO!$AF$7)*OFFSET(ORÇAMENTO!$W$15,ROW(AI31)-ROW(AI$15),0),15-13*ORÇAMENTO!$AF$11)),0)","v":0},{"$f":"IF(AND($D31=\"Serviço\",AJ$12<>0,$H31>0,OR(AUTOEVENTO<>\"manual\",$M31<>1)),\nIF(Import.TipoArredondamento<>\"TransfereGOV\",\nROUND(OFFSET($P31,0,AJ$13),15-13*ORÇAMENTO!$AF$7)/$H31*OFFSET(ORÇAMENTO!$X$15,ROW(AJ31)-ROW(AJ$15),0),\nROUND(ROUND(OFFSET($P31,0,AJ$13),15-13*ORÇAMENTO!$AF$7)*OFFSET(ORÇAMENTO!$W$15,ROW(AJ31)-ROW(AJ$15),0),15-13*ORÇAMENTO!$AF$11)),0)","v":0},{"$f":"IF(AND($D31=\"Serviço\",AK$12<>0,$H31>0,OR(AUTOEVENTO<>\"manual\",$M31<>1)),\nIF(Import.TipoArredondamento<>\"TransfereGOV\",\nROUND(OFFSET($P31,0,AK$13),15-13*ORÇAMENTO!$AF$7)/$H31*OFFSET(ORÇAMENTO!$X$15,ROW(AK31)-ROW(AK$15),0),\nROUND(ROUND(OFFSET($P31,0,AK$13),15-13*ORÇAMENTO!$AF$7)*OFFSET(ORÇAMENTO!$W$15,ROW(AK31)-ROW(AK$15),0),15-13*ORÇAMENTO!$AF$11)),0)","v":0},null,{"$f":"IF($D31<>\"Serviço\",0,IF(AND(AUTOEVENTO=\"Manual\",$M31=1),0,IF(OFFSET(CRONOPLE!$F$14,$M31,AM$13)=\"\",10^12,OFFSET(CRONOPLE!$F$14,$M31,AM$13))))","v":1000000000000},{"$f":"IF($D31<>\"Serviço\",0,IF(AND(AUTOEVENTO=\"Manual\",$M31=1),0,IF(OFFSET(CRONOPLE!$F$14,$M31,AN$13)=\"\",10^12,OFFSET(CRONOPLE!$F$14,$M31,AN$13))))","v":1000000000000},{"$f":"IF($D31<>\"Serviço\",0,IF(AND(AUTOEVENTO=\"Manual\",$M31=1),0,IF(OFFSET(CRONOPLE!$F$14,$M31,AO$13)=\"\",10^12,OFFSET(CRONOPLE!$F$14,$M31,AO$13))))","v":1000000000000},{"$f":"IF($D31<>\"Serviço\",0,IF(AND(AUTOEVENTO=\"Manual\",$M31=1),0,IF(OFFSET(CRONOPLE!$F$14,$M31,AP$13)=\"\",10^12,OFFSET(CRONOPLE!$F$14,$M31,AP$13))))","v":1000000000000},{"$f":"IF($D31<>\"Serviço\",0,IF(AND(AUTOEVENTO=\"Manual\",$M31=1),0,IF(OFFSET(CRONOPLE!$F$14,$M31,AQ$13)=\"\",10^12,OFFSET(CRONOPLE!$F$14,$M31,AQ$13))))","v":1000000000000},{"$f":"IF($D31<>\"Serviço\",0,IF(AND(AUTOEVENTO=\"Manual\",$M31=1),0,IF(OFFSET(CRONOPLE!$F$14,$M31,AR$13)=\"\",10^12,OFFSET(CRONOPLE!$F$14,$M31,AR$13))))","v":1000000000000},{"$f":"IF($D31<>\"Serviço\",0,IF(AND(AUTOEVENTO=\"Manual\",$M31=1),0,IF(OFFSET(CRONOPLE!$F$14,$M31,AS$13)=\"\",10^12,OFFSET(CRONOPLE!$F$14,$M31,AS$13))))","v":1000000000000},{"$f":"IF($D31<>\"Serviço\",0,IF(AND(AUTOEVENTO=\"Manual\",$M31=1),0,IF(OFFSET(CRONOPLE!$F$14,$M31,AT$13)=\"\",10^12,OFFSET(CRONOPLE!$F$14,$M31,AT$13))))","v":1000000000000},{"$f":"IF($D31<>\"Serviço\",0,IF(AND(AUTOEVENTO=\"Manual\",$M31=1),0,IF(OFFSET(CRONOPLE!$F$14,$M31,AU$13)=\"\",10^12,OFFSET(CRONOPLE!$F$14,$M31,AU$13))))","v":1000000000000},{"$f":"IF($D31<>\"Serviço\",0,IF(AND(AUTOEVENTO=\"Manual\",$M31=1),0,IF(OFFSET(CRONOPLE!$F$14,$M31,AV$13)=\"\",10^12,OFFSET(CRONOPLE!$F$14,$M31,AV$13))))","v":1000000000000},null,{"$f":"IF($D31<>\"Serviço\",0,IF(OR(AND(AUTOEVENTO=\"Manual\",$M31=1),$M31>(ROW(PLE.lastrow)-ROW(PLE.firstrow))),0,IF(OFFSET(PLE!$G$14,$M31,AX$13)=\"\",10^12,OFFSET(PLE!$G$14,$M31,AX$13))))","v":1000000000000},{"$f":"IF($D31<>\"Serviço\",0,IF(OR(AND(AUTOEVENTO=\"Manual\",$M31=1),$M31>(ROW(PLE.lastrow)-ROW(PLE.firstrow))),0,IF(OFFSET(PLE!$G$14,$M31,AY$13)=\"\",10^12,OFFSET(PLE!$G$14,$M31,AY$13))))","v":1000000000000},{"$f":"IF($D31<>\"Serviço\",0,IF(OR(AND(AUTOEVENTO=\"Manual\",$M31=1),$M31>(ROW(PLE.lastrow)-ROW(PLE.firstrow))),0,IF(OFFSET(PLE!$G$14,$M31,AZ$13)=\"\",10^12,OFFSET(PLE!$G$14,$M31,AZ$13))))","v":1000000000000},{"$f":"IF($D31<>\"Serviço\",0,IF(OR(AND(AUTOEVENTO=\"Manual\",$M31=1),$M31>(ROW(PLE.lastrow)-ROW(PLE.firstrow))),0,IF(OFFSET(PLE!$G$14,$M31,BA$13)=\"\",10^12,OFFSET(PLE!$G$14,$M31,BA$13))))","v":1000000000000},{"$f":"IF($D31<>\"Serviço\",0,IF(OR(AND(AUTOEVENTO=\"Manual\",$M31=1),$M31>(ROW(PLE.lastrow)-ROW(PLE.firstrow))),0,IF(OFFSET(PLE!$G$14,$M31,BB$13)=\"\",10^12,OFFSET(PLE!$G$14,$M31,BB$13))))","v":1000000000000},{"$f":"IF($D31<>\"Serviço\",0,IF(OR(AND(AUTOEVENTO=\"Manual\",$M31=1),$M31>(ROW(PLE.lastrow)-ROW(PLE.firstrow))),0,IF(OFFSET(PLE!$G$14,$M31,BC$13)=\"\",10^12,OFFSET(PLE!$G$14,$M31,BC$13))))","v":1000000000000},{"$f":"IF($D31<>\"Serviço\",0,IF(OR(AND(AUTOEVENTO=\"Manual\",$M31=1),$M31>(ROW(PLE.lastrow)-ROW(PLE.firstrow))),0,IF(OFFSET(PLE!$G$14,$M31,BD$13)=\"\",10^12,OFFSET(PLE!$G$14,$M31,BD$13))))","v":1000000000000},{"$f":"IF($D31<>\"Serviço\",0,IF(OR(AND(AUTOEVENTO=\"Manual\",$M31=1),$M31>(ROW(PLE.lastrow)-ROW(PLE.firstrow))),0,IF(OFFSET(PLE!$G$14,$M31,BE$13)=\"\",10^12,OFFSET(PLE!$G$14,$M31,BE$13))))","v":1000000000000},{"$f":"IF($D31<>\"Serviço\",0,IF(OR(AND(AUTOEVENTO=\"Manual\",$M31=1),$M31>(ROW(PLE.lastrow)-ROW(PLE.firstrow))),0,IF(OFFSET(PLE!$G$14,$M31,BF$13)=\"\",10^12,OFFSET(PLE!$G$14,$M31,BF$13))))","v":1000000000000},{"$f":"IF($D31<>\"Serviço\",0,IF(OR(AND(AUTOEVENTO=\"Manual\",$M31=1),$M31>(ROW(PLE.lastrow)-ROW(PLE.firstrow))),0,IF(OFFSET(PLE!$G$14,$M31,BG$13)=\"\",10^12,OFFSET(PLE!$G$14,$M31,BG$13))))","v":1000000000000}]
["15",{"$f":"OFFSET(ORÇAMENTO!C$15,ROW(B32)-ROW(B$15),0)","v":"S"},{"$f":"OFFSET(ORÇAMENTO!L$15,ROW(C32)-ROW(C$15),0)","v":"F"},{"$f":"OFFSET(ORÇAMENTO!N$15,ROW(D32)-ROW(D$15),0)","v":"Serviço"},{"$f":"OFFSET(ORÇAMENTO!O$15,ROW(E32)-ROW(E$15),0)","v":"1.4.2."},{"$f":"OFFSET(ORÇAMENTO!R$15,ROW(F32)-ROW(F$15),0)","v":"TRANSPORTE COM CAMINHÃO BASCULANTE DE 6 M³, EM VIA URBANA PAVIMENTADA, DMT ATÉ 30 KM (UNIDADE: M3XKM). AF_07/2020"},{"$f":"IF($D32<>\"Serviço\",\"\",OFFSET(ORÇAMENTO!S$15,ROW(G32)-ROW(G$15),0))","v":"M3XKM"},{"$f":"IF($D32<>\"Serviço\",0,IF(ACOMPANHAMENTO=\"BM\",ROUND(OFFSET(ORÇAMENTO!AJ$15,ROW(H32)-ROW(H$15),0),15-13*ORÇAMENTO!$AF$7),SUMPRODUCT(($Q$12:$AA$12<>\"\")*ROUND($Q32:$AA32,15-13*ORÇAMENTO!$AF$7))))","v":1350},null,null,null,".",{"$f":"IF($D32<>\"Serviço\",\"\",IF(AUTOEVENTO=\"manual\",$A32,IF(ISERROR(MATCH($A32,$A$15:OFFSET($A32,-1,0),0)),MAX($M$15:OFFSET(M32,-1,0))+1,INDEX($M$15:OFFSET(M32,-1,0),MATCH($A32,$A$15:OFFSET($A32,-1,0),0)))))","v":5},{"$f":"IF($D32<>\"Serviço\",\"\",IF(AUTOEVENTO=\"Manual\",IF($A32=0,\"<-- defina o número do agrupador\",OFFSET(EVENTOS!$D$14,$A32,0)),OFFSET($F$15,$A32,0)))","v":"LIMPEZA DA OBRA"},null,null,null,null,null,null,null,null,null,null,null,null,null,{"$f":"IF(AND($D32=\"Serviço\",AB$12<>0,$H32>0,OR(AUTOEVENTO<>\"manual\",$M32<>1)),\nIF(Import.TipoArredondamento<>\"TransfereGOV\",\nROUND(OFFSET($P32,0,AB$13),15-13*ORÇAMENTO!$AF$7)/$H32*OFFSET(ORÇAMENTO!$X$15,ROW(AB32)-ROW(AB$15),0),\nROUND(ROUND(OFFSET($P32,0,AB$13),15-13*ORÇAMENTO!$AF$7)*OFFSET(ORÇAMENTO!$W$15,ROW(AB32)-ROW(AB$15),0),15-13*ORÇAMENTO!$AF$11)),0)","v":0},{"$f":"IF(AND($D32=\"Serviço\",AC$12<>0,$H32>0,OR(AUTOEVENTO<>\"manual\",$M32<>1)),\nIF(Import.TipoArredondamento<>\"TransfereGOV\",\nROUND(OFFSET($P32,0,AC$13),15-13*ORÇAMENTO!$AF$7)/$H32*OFFSET(ORÇAMENTO!$X$15,ROW(AC32)-ROW(AC$15),0),\nROUND(ROUND(OFFSET($P32,0,AC$13),15-13*ORÇAMENTO!$AF$7)*OFFSET(ORÇAMENTO!$W$15,ROW(AC32)-ROW(AC$15),0),15-13*ORÇAMENTO!$AF$11)),0)","v":0},{"$f":"IF(AND($D32=\"Serviço\",AD$12<>0,$H32>0,OR(AUTOEVENTO<>\"manual\",$M32<>1)),\nIF(Import.TipoArredondamento<>\"TransfereGOV\",\nROUND(OFFSET($P32,0,AD$13),15-13*ORÇAMENTO!$AF$7)/$H32*OFFSET(ORÇAMENTO!$X$15,ROW(AD32)-ROW(AD$15),0),\nROUND(ROUND(OFFSET($P32,0,AD$13),15-13*ORÇAMENTO!$AF$7)*OFFSET(ORÇAMENTO!$W$15,ROW(AD32)-ROW(AD$15),0),15-13*ORÇAMENTO!$AF$11)),0)","v":0},{"$f":"IF(AND($D32=\"Serviço\",AE$12<>0,$H32>0,OR(AUTOEVENTO<>\"manual\",$M32<>1)),\nIF(Import.TipoArredondamento<>\"TransfereGOV\",\nROUND(OFFSET($P32,0,AE$13),15-13*ORÇAMENTO!$AF$7)/$H32*OFFSET(ORÇAMENTO!$X$15,ROW(AE32)-ROW(AE$15),0),\nROUND(ROUND(OFFSET($P32,0,AE$13),15-13*ORÇAMENTO!$AF$7)*OFFSET(ORÇAMENTO!$W$15,ROW(AE32)-ROW(AE$15),0),15-13*ORÇAMENTO!$AF$11)),0)","v":0},{"$f":"IF(AND($D32=\"Serviço\",AF$12<>0,$H32>0,OR(AUTOEVENTO<>\"manual\",$M32<>1)),\nIF(Import.TipoArredondamento<>\"TransfereGOV\",\nROUND(OFFSET($P32,0,AF$13),15-13*ORÇAMENTO!$AF$7)/$H32*OFFSET(ORÇAMENTO!$X$15,ROW(AF32)-ROW(AF$15),0),\nROUND(ROUND(OFFSET($P32,0,AF$13),15-13*ORÇAMENTO!$AF$7)*OFFSET(ORÇAMENTO!$W$15,ROW(AF32)-ROW(AF$15),0),15-13*ORÇAMENTO!$AF$11)),0)","v":0},{"$f":"IF(AND($D32=\"Serviço\",AG$12<>0,$H32>0,OR(AUTOEVENTO<>\"manual\",$M32<>1)),\nIF(Import.TipoArredondamento<>\"TransfereGOV\",\nROUND(OFFSET($P32,0,AG$13),15-13*ORÇAMENTO!$AF$7)/$H32*OFFSET(ORÇAMENTO!$X$15,ROW(AG32)-ROW(AG$15),0),\nROUND(ROUND(OFFSET($P32,0,AG$13),15-13*ORÇAMENTO!$AF$7)*OFFSET(ORÇAMENTO!$W$15,ROW(AG32)-ROW(AG$15),0),15-13*ORÇAMENTO!$AF$11)),0)","v":0},{"$f":"IF(AND($D32=\"Serviço\",AH$12<>0,$H32>0,OR(AUTOEVENTO<>\"manual\",$M32<>1)),\nIF(Import.TipoArredondamento<>\"TransfereGOV\",\nROUND(OFFSET($P32,0,AH$13),15-13*ORÇAMENTO!$AF$7)/$H32*OFFSET(ORÇAMENTO!$X$15,ROW(AH32)-ROW(AH$15),0),\nROUND(ROUND(OFFSET($P32,0,AH$13),15-13*ORÇAMENTO!$AF$7)*OFFSET(ORÇAMENTO!$W$15,ROW(AH32)-ROW(AH$15),0),15-13*ORÇAMENTO!$AF$11)),0)","v":0},{"$f":"IF(AND($D32=\"Serviço\",AI$12<>0,$H32>0,OR(AUTOEVENTO<>\"manual\",$M32<>1)),\nIF(Import.TipoArredondamento<>\"TransfereGOV\",\nROUND(OFFSET($P32,0,AI$13),15-13*ORÇAMENTO!$AF$7)/$H32*OFFSET(ORÇAMENTO!$X$15,ROW(AI32)-ROW(AI$15),0),\nROUND(ROUND(OFFSET($P32,0,AI$13),15-13*ORÇAMENTO!$AF$7)*OFFSET(ORÇAMENTO!$W$15,ROW(AI32)-ROW(AI$15),0),15-13*ORÇAMENTO!$AF$11)),0)","v":0},{"$f":"IF(AND($D32=\"Serviço\",AJ$12<>0,$H32>0,OR(AUTOEVENTO<>\"manual\",$M32<>1)),\nIF(Import.TipoArredondamento<>\"TransfereGOV\",\nROUND(OFFSET($P32,0,AJ$13),15-13*ORÇAMENTO!$AF$7)/$H32*OFFSET(ORÇAMENTO!$X$15,ROW(AJ32)-ROW(AJ$15),0),\nROUND(ROUND(OFFSET($P32,0,AJ$13),15-13*ORÇAMENTO!$AF$7)*OFFSET(ORÇAMENTO!$W$15,ROW(AJ32)-ROW(AJ$15),0),15-13*ORÇAMENTO!$AF$11)),0)","v":0},{"$f":"IF(AND($D32=\"Serviço\",AK$12<>0,$H32>0,OR(AUTOEVENTO<>\"manual\",$M32<>1)),\nIF(Import.TipoArredondamento<>\"TransfereGOV\",\nROUND(OFFSET($P32,0,AK$13),15-13*ORÇAMENTO!$AF$7)/$H32*OFFSET(ORÇAMENTO!$X$15,ROW(AK32)-ROW(AK$15),0),\nROUND(ROUND(OFFSET($P32,0,AK$13),15-13*ORÇAMENTO!$AF$7)*OFFSET(ORÇAMENTO!$W$15,ROW(AK32)-ROW(AK$15),0),15-13*ORÇAMENTO!$AF$11)),0)","v":0},null,{"$f":"IF($D32<>\"Serviço\",0,IF(AND(AUTOEVENTO=\"Manual\",$M32=1),0,IF(OFFSET(CRONOPLE!$F$14,$M32,AM$13)=\"\",10^12,OFFSET(CRONOPLE!$F$14,$M32,AM$13))))","v":1000000000000},{"$f":"IF($D32<>\"Serviço\",0,IF(AND(AUTOEVENTO=\"Manual\",$M32=1),0,IF(OFFSET(CRONOPLE!$F$14,$M32,AN$13)=\"\",10^12,OFFSET(CRONOPLE!$F$14,$M32,AN$13))))","v":1000000000000},{"$f":"IF($D32<>\"Serviço\",0,IF(AND(AUTOEVENTO=\"Manual\",$M32=1),0,IF(OFFSET(CRONOPLE!$F$14,$M32,AO$13)=\"\",10^12,OFFSET(CRONOPLE!$F$14,$M32,AO$13))))","v":1000000000000},{"$f":"IF($D32<>\"Serviço\",0,IF(AND(AUTOEVENTO=\"Manual\",$M32=1),0,IF(OFFSET(CRONOPLE!$F$14,$M32,AP$13)=\"\",10^12,OFFSET(CRONOPLE!$F$14,$M32,AP$13))))","v":1000000000000},{"$f":"IF($D32<>\"Serviço\",0,IF(AND(AUTOEVENTO=\"Manual\",$M32=1),0,IF(OFFSET(CRONOPLE!$F$14,$M32,AQ$13)=\"\",10^12,OFFSET(CRONOPLE!$F$14,$M32,AQ$13))))","v":1000000000000},{"$f":"IF($D32<>\"Serviço\",0,IF(AND(AUTOEVENTO=\"Manual\",$M32=1),0,IF(OFFSET(CRONOPLE!$F$14,$M32,AR$13)=\"\",10^12,OFFSET(CRONOPLE!$F$14,$M32,AR$13))))","v":1000000000000},{"$f":"IF($D32<>\"Serviço\",0,IF(AND(AUTOEVENTO=\"Manual\",$M32=1),0,IF(OFFSET(CRONOPLE!$F$14,$M32,AS$13)=\"\",10^12,OFFSET(CRONOPLE!$F$14,$M32,AS$13))))","v":1000000000000},{"$f":"IF($D32<>\"Serviço\",0,IF(AND(AUTOEVENTO=\"Manual\",$M32=1),0,IF(OFFSET(CRONOPLE!$F$14,$M32,AT$13)=\"\",10^12,OFFSET(CRONOPLE!$F$14,$M32,AT$13))))","v":1000000000000},{"$f":"IF($D32<>\"Serviço\",0,IF(AND(AUTOEVENTO=\"Manual\",$M32=1),0,IF(OFFSET(CRONOPLE!$F$14,$M32,AU$13)=\"\",10^12,OFFSET(CRONOPLE!$F$14,$M32,AU$13))))","v":1000000000000},{"$f":"IF($D32<>\"Serviço\",0,IF(AND(AUTOEVENTO=\"Manual\",$M32=1),0,IF(OFFSET(CRONOPLE!$F$14,$M32,AV$13)=\"\",10^12,OFFSET(CRONOPLE!$F$14,$M32,AV$13))))","v":1000000000000},null,{"$f":"IF($D32<>\"Serviço\",0,IF(OR(AND(AUTOEVENTO=\"Manual\",$M32=1),$M32>(ROW(PLE.lastrow)-ROW(PLE.firstrow))),0,IF(OFFSET(PLE!$G$14,$M32,AX$13)=\"\",10^12,OFFSET(PLE!$G$14,$M32,AX$13))))","v":1000000000000},{"$f":"IF($D32<>\"Serviço\",0,IF(OR(AND(AUTOEVENTO=\"Manual\",$M32=1),$M32>(ROW(PLE.lastrow)-ROW(PLE.firstrow))),0,IF(OFFSET(PLE!$G$14,$M32,AY$13)=\"\",10^12,OFFSET(PLE!$G$14,$M32,AY$13))))","v":1000000000000},{"$f":"IF($D32<>\"Serviço\",0,IF(OR(AND(AUTOEVENTO=\"Manual\",$M32=1),$M32>(ROW(PLE.lastrow)-ROW(PLE.firstrow))),0,IF(OFFSET(PLE!$G$14,$M32,AZ$13)=\"\",10^12,OFFSET(PLE!$G$14,$M32,AZ$13))))","v":1000000000000},{"$f":"IF($D32<>\"Serviço\",0,IF(OR(AND(AUTOEVENTO=\"Manual\",$M32=1),$M32>(ROW(PLE.lastrow)-ROW(PLE.firstrow))),0,IF(OFFSET(PLE!$G$14,$M32,BA$13)=\"\",10^12,OFFSET(PLE!$G$14,$M32,BA$13))))","v":1000000000000},{"$f":"IF($D32<>\"Serviço\",0,IF(OR(AND(AUTOEVENTO=\"Manual\",$M32=1),$M32>(ROW(PLE.lastrow)-ROW(PLE.firstrow))),0,IF(OFFSET(PLE!$G$14,$M32,BB$13)=\"\",10^12,OFFSET(PLE!$G$14,$M32,BB$13))))","v":1000000000000},{"$f":"IF($D32<>\"Serviço\",0,IF(OR(AND(AUTOEVENTO=\"Manual\",$M32=1),$M32>(ROW(PLE.lastrow)-ROW(PLE.firstrow))),0,IF(OFFSET(PLE!$G$14,$M32,BC$13)=\"\",10^12,OFFSET(PLE!$G$14,$M32,BC$13))))","v":1000000000000},{"$f":"IF($D32<>\"Serviço\",0,IF(OR(AND(AUTOEVENTO=\"Manual\",$M32=1),$M32>(ROW(PLE.lastrow)-ROW(PLE.firstrow))),0,IF(OFFSET(PLE!$G$14,$M32,BD$13)=\"\",10^12,OFFSET(PLE!$G$14,$M32,BD$13))))","v":1000000000000},{"$f":"IF($D32<>\"Serviço\",0,IF(OR(AND(AUTOEVENTO=\"Manual\",$M32=1),$M32>(ROW(PLE.lastrow)-ROW(PLE.firstrow))),0,IF(OFFSET(PLE!$G$14,$M32,BE$13)=\"\",10^12,OFFSET(PLE!$G$14,$M32,BE$13))))","v":1000000000000},{"$f":"IF($D32<>\"Serviço\",0,IF(OR(AND(AUTOEVENTO=\"Manual\",$M32=1),$M32>(ROW(PLE.lastrow)-ROW(PLE.firstrow))),0,IF(OFFSET(PLE!$G$14,$M32,BF$13)=\"\",10^12,OFFSET(PLE!$G$14,$M32,BF$13))))","v":1000000000000},{"$f":"IF($D32<>\"Serviço\",0,IF(OR(AND(AUTOEVENTO=\"Manual\",$M32=1),$M32>(ROW(PLE.lastrow)-ROW(PLE.firstrow))),0,IF(OFFSET(PLE!$G$14,$M32,BG$13)=\"\",10^12,OFFSET(PLE!$G$14,$M32,BG$13))))","v":1000000000000}]
["15",{"$f":"OFFSET(ORÇAMENTO!C$15,ROW(B33)-ROW(B$15),0)","v":"S"},{"$f":"OFFSET(ORÇAMENTO!L$15,ROW(C33)-ROW(C$15),0)","v":"F"},{"$f":"OFFSET(ORÇAMENTO!N$15,ROW(D33)-ROW(D$15),0)","v":"Serviço"},{"$f":"OFFSET(ORÇAMENTO!O$15,ROW(E33)-ROW(E$15),0)","v":"1.4.3."},{"$f":"OFFSET(ORÇAMENTO!R$15,ROW(F33)-ROW(F$15),0)","v":"TRANSPORTE COM CAMINHÃO BASCULANTE DE 6 M³, EM VIA URBANA PAVIMENTADA, ADICIONAL PARA DMT EXCEDENTE A 30 KM (UNIDADE: M3XKM). AF_07/2020"},{"$f":"IF($D33<>\"Serviço\",\"\",OFFSET(ORÇAMENTO!S$15,ROW(G33)-ROW(G$15),0))","v":"M3XKM"},{"$f":"IF($D33<>\"Serviço\",0,IF(ACOMPANHAMENTO=\"BM\",ROUND(OFFSET(ORÇAMENTO!AJ$15,ROW(H33)-ROW(H$15),0),15-13*ORÇAMENTO!$AF$7),SUMPRODUCT(($Q$12:$AA$12<>\"\")*ROUND($Q33:$AA33,15-13*ORÇAMENTO!$AF$7))))","v":1350},null,null,null,".",{"$f":"IF($D33<>\"Serviço\",\"\",IF(AUTOEVENTO=\"manual\",$A33,IF(ISERROR(MATCH($A33,$A$15:OFFSET($A33,-1,0),0)),MAX($M$15:OFFSET(M33,-1,0))+1,INDEX($M$15:OFFSET(M33,-1,0),MATCH($A33,$A$15:OFFSET($A33,-1,0),0)))))","v":5},{"$f":"IF($D33<>\"Serviço\",\"\",IF(AUTOEVENTO=\"Manual\",IF($A33=0,\"<-- defina o número do agrupador\",OFFSET(EVENTOS!$D$14,$A33,0)),OFFSET($F$15,$A33,0)))","v":"LIMPEZA DA OBRA"},null,null,null,null,null,null,null,null,null,null,null,null,null,{"$f":"IF(AND($D33=\"Serviço\",AB$12<>0,$H33>0,OR(AUTOEVENTO<>\"manual\",$M33<>1)),\nIF(Import.TipoArredondamento<>\"TransfereGOV\",\nROUND(OFFSET($P33,0,AB$13),15-13*ORÇAMENTO!$AF$7)/$H33*OFFSET(ORÇAMENTO!$X$15,ROW(AB33)-ROW(AB$15),0),\nROUND(ROUND(OFFSET($P33,0,AB$13),15-13*ORÇAMENTO!$AF$7)*OFFSET(ORÇAMENTO!$W$15,ROW(AB33)-ROW(AB$15),0),15-13*ORÇAMENTO!$AF$11)),0)","v":0},{"$f":"IF(AND($D33=\"Serviço\",AC$12<>0,$H33>0,OR(AUTOEVENTO<>\"manual\",$M33<>1)),\nIF(Import.TipoArredondamento<>\"TransfereGOV\",\nROUND(OFFSET($P33,0,AC$13),15-13*ORÇAMENTO!$AF$7)/$H33*OFFSET(ORÇAMENTO!$X$15,ROW(AC33)-ROW(AC$15),0),\nROUND(ROUND(OFFSET($P33,0,AC$13),15-13*ORÇAMENTO!$AF$7)*OFFSET(ORÇAMENTO!$W$15,ROW(AC33)-ROW(AC$15),0),15-13*ORÇAMENTO!$AF$11)),0)","v":0},{"$f":"IF(AND($D33=\"Serviço\",AD$12<>0,$H33>0,OR(AUTOEVENTO<>\"manual\",$M33<>1)),\nIF(Import.TipoArredondamento<>\"TransfereGOV\",\nROUND(OFFSET($P33,0,AD$13),15-13*ORÇAMENTO!$AF$7)/$H33*OFFSET(ORÇAMENTO!$X$15,ROW(AD33)-ROW(AD$15),0),\nROUND(ROUND(OFFSET($P33,0,AD$13),15-13*ORÇAMENTO!$AF$7)*OFFSET(ORÇAMENTO!$W$15,ROW(AD33)-ROW(AD$15),0),15-13*ORÇAMENTO!$AF$11)),0)","v":0},{"$f":"IF(AND($D33=\"Serviço\",AE$12<>0,$H33>0,OR(AUTOEVENTO<>\"manual\",$M33<>1)),\nIF(Import.TipoArredondamento<>\"TransfereGOV\",\nROUND(OFFSET($P33,0,AE$13),15-13*ORÇAMENTO!$AF$7)/$H33*OFFSET(ORÇAMENTO!$X$15,ROW(AE33)-ROW(AE$15),0),\nROUND(ROUND(OFFSET($P33,0,AE$13),15-13*ORÇAMENTO!$AF$7)*OFFSET(ORÇAMENTO!$W$15,ROW(AE33)-ROW(AE$15),0),15-13*ORÇAMENTO!$AF$11)),0)","v":0},{"$f":"IF(AND($D33=\"Serviço\",AF$12<>0,$H33>0,OR(AUTOEVENTO<>\"manual\",$M33<>1)),\nIF(Import.TipoArredondamento<>\"TransfereGOV\",\nROUND(OFFSET($P33,0,AF$13),15-13*ORÇAMENTO!$AF$7)/$H33*OFFSET(ORÇAMENTO!$X$15,ROW(AF33)-ROW(AF$15),0),\nROUND(ROUND(OFFSET($P33,0,AF$13),15-13*ORÇAMENTO!$AF$7)*OFFSET(ORÇAMENTO!$W$15,ROW(AF33)-ROW(AF$15),0),15-13*ORÇAMENTO!$AF$11)),0)","v":0},{"$f":"IF(AND($D33=\"Serviço\",AG$12<>0,$H33>0,OR(AUTOEVENTO<>\"manual\",$M33<>1)),\nIF(Import.TipoArredondamento<>\"TransfereGOV\",\nROUND(OFFSET($P33,0,AG$13),15-13*ORÇAMENTO!$AF$7)/$H33*OFFSET(ORÇAMENTO!$X$15,ROW(AG33)-ROW(AG$15),0),\nROUND(ROUND(OFFSET($P33,0,AG$13),15-13*ORÇAMENTO!$AF$7)*OFFSET(ORÇAMENTO!$W$15,ROW(AG33)-ROW(AG$15),0),15-13*ORÇAMENTO!$AF$11)),0)","v":0},{"$f":"IF(AND($D33=\"Serviço\",AH$12<>0,$H33>0,OR(AUTOEVENTO<>\"manual\",$M33<>1)),\nIF(Import.TipoArredondamento<>\"TransfereGOV\",\nROUND(OFFSET($P33,0,AH$13),15-13*ORÇAMENTO!$AF$7)/$H33*OFFSET(ORÇAMENTO!$X$15,ROW(AH33)-ROW(AH$15),0),\nROUND(ROUND(OFFSET($P33,0,AH$13),15-13*ORÇAMENTO!$AF$7)*OFFSET(ORÇAMENTO!$W$15,ROW(AH33)-ROW(AH$15),0),15-13*ORÇAMENTO!$AF$11)),0)","v":0},{"$f":"IF(AND($D33=\"Serviço\",AI$12<>0,$H33>0,OR(AUTOEVENTO<>\"manual\",$M33<>1)),\nIF(Import.TipoArredondamento<>\"TransfereGOV\",\nROUND(OFFSET($P33,0,AI$13),15-13*ORÇAMENTO!$AF$7)/$H33*OFFSET(ORÇAMENTO!$X$15,ROW(AI33)-ROW(AI$15),0),\nROUND(ROUND(OFFSET($P33,0,AI$13),15-13*ORÇAMENTO!$AF$7)*OFFSET(ORÇAMENTO!$W$15,ROW(AI33)-ROW(AI$15),0),15-13*ORÇAMENTO!$AF$11)),0)","v":0},{"$f":"IF(AND($D33=\"Serviço\",AJ$12<>0,$H33>0,OR(AUTOEVENTO<>\"manual\",$M33<>1)),\nIF(Import.TipoArredondamento<>\"TransfereGOV\",\nROUND(OFFSET($P33,0,AJ$13),15-13*ORÇAMENTO!$AF$7)/$H33*OFFSET(ORÇAMENTO!$X$15,ROW(AJ33)-ROW(AJ$15),0),\nROUND(ROUND(OFFSET($P33,0,AJ$13),15-13*ORÇAMENTO!$AF$7)*OFFSET(ORÇAMENTO!$W$15,ROW(AJ33)-ROW(AJ$15),0),15-13*ORÇAMENTO!$AF$11)),0)","v":0},{"$f":"IF(AND($D33=\"Serviço\",AK$12<>0,$H33>0,OR(AUTOEVENTO<>\"manual\",$M33<>1)),\nIF(Import.TipoArredondamento<>\"TransfereGOV\",\nROUND(OFFSET($P33,0,AK$13),15-13*ORÇAMENTO!$AF$7)/$H33*OFFSET(ORÇAMENTO!$X$15,ROW(AK33)-ROW(AK$15),0),\nROUND(ROUND(OFFSET($P33,0,AK$13),15-13*ORÇAMENTO!$AF$7)*OFFSET(ORÇAMENTO!$W$15,ROW(AK33)-ROW(AK$15),0),15-13*ORÇAMENTO!$AF$11)),0)","v":0},null,{"$f":"IF($D33<>\"Serviço\",0,IF(AND(AUTOEVENTO=\"Manual\",$M33=1),0,IF(OFFSET(CRONOPLE!$F$14,$M33,AM$13)=\"\",10^12,OFFSET(CRONOPLE!$F$14,$M33,AM$13))))","v":1000000000000},{"$f":"IF($D33<>\"Serviço\",0,IF(AND(AUTOEVENTO=\"Manual\",$M33=1),0,IF(OFFSET(CRONOPLE!$F$14,$M33,AN$13)=\"\",10^12,OFFSET(CRONOPLE!$F$14,$M33,AN$13))))","v":1000000000000},{"$f":"IF($D33<>\"Serviço\",0,IF(AND(AUTOEVENTO=\"Manual\",$M33=1),0,IF(OFFSET(CRONOPLE!$F$14,$M33,AO$13)=\"\",10^12,OFFSET(CRONOPLE!$F$14,$M33,AO$13))))","v":1000000000000},{"$f":"IF($D33<>\"Serviço\",0,IF(AND(AUTOEVENTO=\"Manual\",$M33=1),0,IF(OFFSET(CRONOPLE!$F$14,$M33,AP$13)=\"\",10^12,OFFSET(CRONOPLE!$F$14,$M33,AP$13))))","v":1000000000000},{"$f":"IF($D33<>\"Serviço\",0,IF(AND(AUTOEVENTO=\"Manual\",$M33=1),0,IF(OFFSET(CRONOPLE!$F$14,$M33,AQ$13)=\"\",10^12,OFFSET(CRONOPLE!$F$14,$M33,AQ$13))))","v":1000000000000},{"$f":"IF($D33<>\"Serviço\",0,IF(AND(AUTOEVENTO=\"Manual\",$M33=1),0,IF(OFFSET(CRONOPLE!$F$14,$M33,AR$13)=\"\",10^12,OFFSET(CRONOPLE!$F$14,$M33,AR$13))))","v":1000000000000},{"$f":"IF($D33<>\"Serviço\",0,IF(AND(AUTOEVENTO=\"Manual\",$M33=1),0,IF(OFFSET(CRONOPLE!$F$14,$M33,AS$13)=\"\",10^12,OFFSET(CRONOPLE!$F$14,$M33,AS$13))))","v":1000000000000},{"$f":"IF($D33<>\"Serviço\",0,IF(AND(AUTOEVENTO=\"Manual\",$M33=1),0,IF(OFFSET(CRONOPLE!$F$14,$M33,AT$13)=\"\",10^12,OFFSET(CRONOPLE!$F$14,$M33,AT$13))))","v":1000000000000},{"$f":"IF($D33<>\"Serviço\",0,IF(AND(AUTOEVENTO=\"Manual\",$M33=1),0,IF(OFFSET(CRONOPLE!$F$14,$M33,AU$13)=\"\",10^12,OFFSET(CRONOPLE!$F$14,$M33,AU$13))))","v":1000000000000},{"$f":"IF($D33<>\"Serviço\",0,IF(AND(AUTOEVENTO=\"Manual\",$M33=1),0,IF(OFFSET(CRONOPLE!$F$14,$M33,AV$13)=\"\",10^12,OFFSET(CRONOPLE!$F$14,$M33,AV$13))))","v":1000000000000},null,{"$f":"IF($D33<>\"Serviço\",0,IF(OR(AND(AUTOEVENTO=\"Manual\",$M33=1),$M33>(ROW(PLE.lastrow)-ROW(PLE.firstrow))),0,IF(OFFSET(PLE!$G$14,$M33,AX$13)=\"\",10^12,OFFSET(PLE!$G$14,$M33,AX$13))))","v":1000000000000},{"$f":"IF($D33<>\"Serviço\",0,IF(OR(AND(AUTOEVENTO=\"Manual\",$M33=1),$M33>(ROW(PLE.lastrow)-ROW(PLE.firstrow))),0,IF(OFFSET(PLE!$G$14,$M33,AY$13)=\"\",10^12,OFFSET(PLE!$G$14,$M33,AY$13))))","v":1000000000000},{"$f":"IF($D33<>\"Serviço\",0,IF(OR(AND(AUTOEVENTO=\"Manual\",$M33=1),$M33>(ROW(PLE.lastrow)-ROW(PLE.firstrow))),0,IF(OFFSET(PLE!$G$14,$M33,AZ$13)=\"\",10^12,OFFSET(PLE!$G$14,$M33,AZ$13))))","v":1000000000000},{"$f":"IF($D33<>\"Serviço\",0,IF(OR(AND(AUTOEVENTO=\"Manual\",$M33=1),$M33>(ROW(PLE.lastrow)-ROW(PLE.firstrow))),0,IF(OFFSET(PLE!$G$14,$M33,BA$13)=\"\",10^12,OFFSET(PLE!$G$14,$M33,BA$13))))","v":1000000000000},{"$f":"IF($D33<>\"Serviço\",0,IF(OR(AND(AUTOEVENTO=\"Manual\",$M33=1),$M33>(ROW(PLE.lastrow)-ROW(PLE.firstrow))),0,IF(OFFSET(PLE!$G$14,$M33,BB$13)=\"\",10^12,OFFSET(PLE!$G$14,$M33,BB$13))))","v":1000000000000},{"$f":"IF($D33<>\"Serviço\",0,IF(OR(AND(AUTOEVENTO=\"Manual\",$M33=1),$M33>(ROW(PLE.lastrow)-ROW(PLE.firstrow))),0,IF(OFFSET(PLE!$G$14,$M33,BC$13)=\"\",10^12,OFFSET(PLE!$G$14,$M33,BC$13))))","v":1000000000000},{"$f":"IF($D33<>\"Serviço\",0,IF(OR(AND(AUTOEVENTO=\"Manual\",$M33=1),$M33>(ROW(PLE.lastrow)-ROW(PLE.firstrow))),0,IF(OFFSET(PLE!$G$14,$M33,BD$13)=\"\",10^12,OFFSET(PLE!$G$14,$M33,BD$13))))","v":1000000000000},{"$f":"IF($D33<>\"Serviço\",0,IF(OR(AND(AUTOEVENTO=\"Manual\",$M33=1),$M33>(ROW(PLE.lastrow)-ROW(PLE.firstrow))),0,IF(OFFSET(PLE!$G$14,$M33,BE$13)=\"\",10^12,OFFSET(PLE!$G$14,$M33,BE$13))))","v":1000000000000},{"$f":"IF($D33<>\"Serviço\",0,IF(OR(AND(AUTOEVENTO=\"Manual\",$M33=1),$M33>(ROW(PLE.lastrow)-ROW(PLE.firstrow))),0,IF(OFFSET(PLE!$G$14,$M33,BF$13)=\"\",10^12,OFFSET(PLE!$G$14,$M33,BF$13))))","v":1000000000000},{"$f":"IF($D33<>\"Serviço\",0,IF(OR(AND(AUTOEVENTO=\"Manual\",$M33=1),$M33>(ROW(PLE.lastrow)-ROW(PLE.firstrow))),0,IF(OFFSET(PLE!$G$14,$M33,BG$13)=\"\",10^12,OFFSET(PLE!$G$14,$M33,BG$13))))","v":1000000000000}]
[null,{"$f":"OFFSET(ORÇAMENTO!C$15,ROW(B34)-ROW(B$15),0)","v":-1},{"$f":"OFFSET(ORÇAMENTO!L$15,ROW(C34)-ROW(C$15),0)","v":"F"},"LOTE",null,null,null,null,null,null,null,"."]
[]
[]
[]
[null,null,null,null,null,{"$f":"Import.Município","v":"TRAMANDAÍ/RS"}]
[null,null,null,null,null,"Local",null,null,"Responsável Técnico",null,null,null,null,null,null,null,null,null,null,"Responsável Técnico"]
[null,null,null,null,null,null,null,null,{"$f":"OFFSET(Import.RespOrçamento,0,-1) & \" \" & Import.RespOrçamento","v":"Nome: PAULO RICARDO VIEGAS ALVES"},null,null,null,null,null,null,null,null,null,null,{"$f":"OFFSET(Import.RespOrçamento,0,-1) & \" \" & Import.RespOrçamento","v":"Nome: PAULO RICARDO VIEGAS ALVES"}]
[null,null,null,null,null,{"$f":"DADOS!$F$25","v":"2025-03-14"},null,null,"CREA/CAU: A86.107-3",null,null,null,null,null,null,null,null,null,null,"CREA/CAU: A86.107-3"]
[null,null,null,null,null,"Data",null,null,"ART/RRT: RRT 15101062",null,null,null,null,null,null,null,null,null,null,"ART/RRT: RRT 15101062"]

{"sheet":"EVENTOS","index":6,"n_rows":19,"n_cols":6,"rows_kept":19,"cut":false,"hidden":false,"merged":[[5,2,5,5],[8,2,10,5],[12,3,12,4],[13,3,13,4],[18,3,18,4],[14,3,14,4],[15,3,15,4],[16,3,16,4],[17,3,17,4]]}
[]
[null,null,"AGRUPADORES DE EVENTOS"]
[]
[null,null,"1. Selecione abaixo a forma de definição dos agrupadores de eventos:"]
[]
[null,null,"Automática, conforme os agrupadores Nível 2 do Orçamento"]
[]
[]
[null,null,{"$f":"IF(ACOMPANHAMENTO=\"BM\",\"Foi selecionado na aba 'MENU' o acompanhamento por BM. Não há necessidade de definição de Eventos.\",\"\")","v":"Foi selecionado na aba 'MENU' o acompanhamento por BM. Não há necessidade de definição de Eventos."}]
[]
[]
[]
[null,null,"Nº do Evento","Título do Evento",null,"Valor Total dos Eventos (R$)"]
[null,{"$f":"CONCATENATE(C14,\".\",D14)","v":{"$error":"#VALUE!"}},{"$f":"OFFSET(C14,-1,0)+1","v":{"$error":"#VALUE!"}},null,null,{"$f":"IF(AUTOEVENTO=\"Manual\",ROUND(SUMPRODUCT((CÁLCULO!$M$15:$M$34=EVENTOS!$C14)*(OFFSET(CÁLCULO!$AA$15,0,1):OFFSET(CÁLCULO!$AL$34,0,-1))),2),0)","v":0}]
[null,{"$f":"CONCATENATE(C15,\".\",D15)","v":"1.Administração Local"},1,"Administração Local",null,{"$f":"IF(AUTOEVENTO=\"Manual\",ROUND(SUMIF(CÁLCULO!$M$15:$M$34,1,ORÇAMENTO!$X$15:$X$34),2),0)","v":0}]
[null,{"$f":"CONCATENATE(C16,\".\",D16)","v":"2."},{"$f":"OFFSET(C16,-1,0)+1","v":2},null,null,{"$f":"IF(AUTOEVENTO=\"Manual\",ROUND(SUMPRODUCT((CÁLCULO!$M$15:$M$34=EVENTOS!$C16)*(OFFSET(CÁLCULO!$AA$15,0,1):OFFSET(CÁLCULO!$AL$34,0,-1))),2),0)","v":0}]
[null,"3.",3,null,null,{"$f":"IF(AUTOEVENTO=\"Manual\",ROUND(SUMPRODUCT((CÁLCULO!$M$15:$M$34=EVENTOS!$C17)*(OFFSET(CÁLCULO!$AA$15,0,1):OFFSET(CÁLCULO!$AL$34,0,-1))),2),0)","v":0}]
[null,"4.",4,null,null,{"$f":"IF(AUTOEVENTO=\"Manual\",ROUND(SUMPRODUCT((CÁLCULO!$M$15:$M$34=EVENTOS!$C18)*(OFFSET(CÁLCULO!$AA$15,0,1):OFFSET(CÁLCULO!$AL$34,0,-1))),2),0)","v":0}]
[null,"5.",5,null,null,{"$f":"IF(AUTOEVENTO=\"Manual\",ROUND(SUMPRODUCT((CÁLCULO!$M$15:$M$34=EVENTOS!$C19)*(OFFSET(CÁLCULO!$AA$15,0,1):OFFSET(CÁLCULO!$AL$34,0,-1))),2),0)","v":0}]

{"sheet":"CRONO","index":7,"n_rows":45,"n_cols":32,"rows_kept":45,"cut":false,"hidden":false,"merged":[[7,5,10,5],[7,7,7,8],[6,6,8,6],[29,7,30,9],[11,6,12,6],[11,7,12,7],[11,8,12,8],[43,7,43,9],[3,29,3,30],[4,29,4,30],[7,24,7,29],[11,17,12,17],[11,18,12,18],[7,10,7,18],[7,19,7,23],[9,9,10,18],[40,7,40,17]]}
[{"$f":"OFFSET(A1,-3,0)+1","v":{"$error":"#REF!"}},{"$f":"IF($Q1<>2,0,IF($R1=0,1,IF(E2>0,OFFSET(QCI!$M$13,SUBSTITUTE(E2,\".\",\"\"),0),OFFSET(ORÇAMENTO!$AA$15,CRONO!$E1,0))/$R1))","v":{"$error":"#REF!"}},{"$f":"IF($Q1<>2,0,IF($R1=0,1,IF(E2>0,OFFSET(QCI!$N$13,SUBSTITUTE(E2,\".\",\"\"),0),OFFSET(ORÇAMENTO!$AB$15,CRONO!$E1,0))/$R1))","v":{"$error":"#REF!"}},{"$f":"IF(AND($Q1=2,ACOMPANHAMENTO=\"BM\"),D2,D3/$R1)","v":{"$error":"#REF!"}},{"$f":"IF(A1<=ORÇAMENTO.MáximoListaCrono,MATCH(A1,ORÇAMENTO.ListaCrono,0),NA())","v":{"$error":"#REF!"}},{"$f":"IF(AND($E2<>-1,$R1>0),\"F\",\"\")","v":{"$error":"#REF!"}},{"$f":"IF(OR(R1=0,R1=\"\"),\"Linha\",IF(AND(OR(ACOMPANHAMENTO=\"PLE\",$Q1<>2),$E2=0),\"Linha\",1-SUM(T1:AF1)))","v":{"$error":"#REF!"}},{"$f":"IF($E2=0,OFFSET(ORÇAMENTO!O$15,$E1,0),IF($E2<>-1,OFFSET(QCI!$D$13,$E2,0),\"\"))","v":{"$error":"#REF!"}},{"$f":"IF($E2=0,OFFSET(ORÇAMENTO!R$15,$E1,0),IF($E2<>-1,OFFSET(QCI!$G$13,$E2,0),\"\"))","v":{"$error":"#REF!"}},null,null,{"$f":"IF($E2=0,OFFSET(ORÇAMENTO!C$15,$E1,0),1)","v":{"$error":"#REF!"}},{"$f":"IF($E2=-1,0,IF(M$13<=$L1,IF(ISERROR(MATCH(M$13,OFFSET($L1,1,0,ROW($L$29)-ROW($L1)-1),0)),ROW($L$29)-ROW($L1)-1,MATCH(M$13,OFFSET($L1,1,0,ROW($L$29)-ROW($L1)-1),0)-1),0))","v":{"$error":"#REF!"}},{"$f":"IF($E2=-1,0,IF(N$13<=$L1,IF(ISERROR(MATCH(N$13,OFFSET($L1,1,0,ROW($L$29)-ROW($L1)-1),0)),ROW($L$29)-ROW($L1)-1,MATCH(N$13,OFFSET($L1,1,0,ROW($L$29)-ROW($L1)-1),0)-1),0))","v":{"$error":"#REF!"}},{"$f":"IF($E2=-1,0,IF(O$13<=$L1,IF(ISERROR(MATCH(O$13,OFFSET($L1,1,0,ROW($L$29)-ROW($L1)-1),0)),ROW($L$29)-ROW($L1)-1,MATCH(O$13,OFFSET($L1,1,0,ROW($L$29)-ROW($L1)-1),0)-1),0))","v":{"$error":"#REF!"}},{"$f":"IF($E2=-1,0,IF(P$13<=$L1,IF(ISERROR(MATCH(P$13,OFFSET($L1,1,0,ROW($L$29)-ROW($L1)-1),0)),ROW($L$29)-ROW($L1)-1,MATCH(P$13,OFFSET($L1,1,0,ROW($L$29)-ROW($L1)-1),0)-1),0))","v":{"$error":"#REF!"}},{"$f":"MIN(OFFSET(L1,0,1,,L1))","v":{"$error":"#REF!"}},{"$f":"IF($E2=0,OFFSET(ORÇAMENTO!X$15,$E1,0),IF($E2<>-1,OFFSET(QCI!$O$13,$E2,0),\"\"))","v":{"$error":"#REF!"}},"% Período:",{"$f":"IF(AND($Q1=2,ACOMPANHAMENTO=\"BM\"),T2,T3/$R1)","v":{"$error":"#REF!"}},{"$error":"#REF!"},{"$error":"#REF!"},{"$error":"#REF!"},{"$error":"#REF!"},{"$error":"#REF!"},{"$error":"#REF!"},{"$error":"#REF!"},{"$error":"#REF!"},{"$error":"#REF!"},{"$error":"#REF!"},{"$error":"#REF!"}]
[null,null,null,null,{"$f":"IF(ISERROR(E1),IF(1+COUNTIF($L$13:OFFSET(L1,-1,0),1)<=MAX(QCI!$D$13:$D$24),1+COUNTIF($L$13:OFFSET(L1,-1,0),1),-1),0)","v":{"$error":"#REF!"}},{"$f":"IF(AND($E2<>-1,$R1>0),\"F\",\"\")","v":{"$error":"#REF!"}},{"$f":"IF(OR(R1=0,R1=\"\"),\"vazia\",IF(AND(OR(ACOMPANHAMENTO=\"PLE\",$Q1<>2),$E2=0),\"calculada\",\"-->\"))","v":{"$error":"#REF!"}},null,{"$f":"IF(AND(G1<>0,ISNUMBER(G1)),\"PREENCHA ESTA LINHA -->\",\"\")","v":{"$error":"#REF!"}}]
[null,null,null,{"$f":"IF($Q1=2,IF(AND(ACOMPANHAMENTO=\"PLE\",ISNUMBER($E1)),SUMIF((OFFSET(CÁLCULO!$AM$15:$AW$15,$E1,0,OFFSET(ORÇAMENTO!$D$15,CRONO!$E1,0))),\"=\"&CRONO!D$12,OFFSET(CÁLCULO!$AB$15:$AL$15,$E1,0,OFFSET(ORÇAMENTO!$D$15,CRONO!$E1,0)))+IF(AND($E3<>\"\",$E3<>0),SUMIF(CÁLCULO!$AM$15:$AW$34,\"=\"&CRONO!D$12,CÁLCULO!$AB$15:$AL$34)/(ORÇAMENTO!$X$15-CÁLCULO.TotalAdmLocal)*CRONO!$E3,0),D2*$R1),SUMIF(OFFSET($R3,1,0,$Q1-2),($L1+1)&\"$\",OFFSET(D3,1,0,$Q1-2)))","v":{"$error":"#REF!"}},{"$f":"IF(OR($Q1<>2,AUTOEVENTO<>\"manual\",$E2>0),\"\",SUMIF(OFFSET(CÁLCULO!$M$15,CRONO!$E1,0,OFFSET(ORÇAMENTO!$D$15,CRONO!$E1,0)),1,OFFSET(ORÇAMENTO!$X$15,CRONO!$E1,0,OFFSET(ORÇAMENTO!$D$15,CRONO!$E1,0))))","v":{"$error":"#REF!"}},null,null,null,null,null,null,null,null,null,null,null,null,{"$f":"L1&\"$\"","v":{"$error":"#REF!"}},null,{"$f":"IF($Q1=2,IF(AND(ACOMPANHAMENTO=\"PLE\",ISNUMBER($E1)),SUMIF((OFFSET(CÁLCULO!$AM$15:$AW$15,$E1,0,OFFSET(ORÇAMENTO!$D$15,CRONO!$E1,0))),\"<=\"&CRONO!T$12,OFFSET(CÁLCULO!$AB$15:$AL$15,$E1,0,OFFSET(ORÇAMENTO!$D$15,CRONO!$E1,0)))+IF(AND($E3<>\"\",$E3<>0),SUMIF(CÁLCULO!$AM$15:$AW$34,\"<=\"&CRONO!T$12,CÁLCULO!$AB$15:$AL$34)/(ORÇAMENTO!$X$15-CÁLCULO.TotalAdmLocal)*CRONO!$E3,0),T2*$R1),SUMIF(OFFSET($R3,1,0,$Q1-2),($L1+1)&\"$\",OFFSET(T3,1,0,$Q1-2)))","v":{"$error":"#REF!"}},{"$f":"IF($Q1=2,IF(AND(ACOMPANHAMENTO=\"PLE\",ISNUMBER($E1)),SUMIF((OFFSET(CÁLCULO!$AM$15:$AW$15,$E1,0,OFFSET(ORÇAMENTO!$D$15,CRONO!$E1,0))),\"=\"&CRONO!U$12,OFFSET(CÁLCULO!$AB$15:$AL$15,$E1,0,OFFSET(ORÇAMENTO!$D$15,CRONO!$E1,0)))+IF(AND($E3<>\"\",$E3<>0),SUMIF(CÁLCULO!$AM$15:$AW$34,\"=\"&CRONO!U$12,CÁLCULO!$AB$15:$AL$34)/(ORÇAMENTO!$X$15-CÁLCULO.TotalAdmLocal)*CRONO!$E3,0),U2*$R1),SUMIF(OFFSET($R3,1,0,$Q1-2),($L1+1)&\"$\",OFFSET(U3,1,0,$Q1-2)))","v":{"$error":"#REF!"}},{"$f":"IF($Q1=2,IF(AND(ACOMPANHAMENTO=\"PLE\",ISNUMBER($E1)),SUMIF((OFFSET(CÁLCULO!$AM$15:$AW$15,$E1,0,OFFSET(ORÇAMENTO!$D$15,CRONO!$E1,0))),\"=\"&CRONO!V$12,OFFSET(CÁLCULO!$AB$15:$AL$15,$E1,0,OFFSET(ORÇAMENTO!$D$15,CRONO!$E1,0)))+IF(AND($E3<>\"\",$E3<>0),SUMIF(CÁLCULO!$AM$15:$AW$34,\"=\"&CRONO!V$12,CÁLCULO!$AB$15:$AL$34)/(ORÇAMENTO!$X$15-CÁLCULO.TotalAdmLocal)*CRONO!$E3,0),V2*$R1),SUMIF(OFFSET($R3,1,0,$Q1-2),($L1+1)&\"$\",OFFSET(V3,1,0,$Q1-2)))","v":{"$error":"#REF!"}},{"$f":"IF($Q1=2,IF(AND(ACOMPANHAMENTO=\"PLE\",ISNUMBER($E1)),SUMIF((OFFSET(CÁLCULO!$AM$15:$AW$15,$E1,0,OFFSET(ORÇAMENTO!$D$15,CRONO!$E1,0))),\"=\"&CRONO!W$12,OFFSET(CÁLCULO!$AB$15:$AL$15,$E1,0,OFFSET(ORÇAMENTO!$D$15,CRONO!$E1,0)))+IF(AND($E3<>\"\",$E3<>0),SUMIF(CÁLCULO!$AM$15:$AW$34,\"=\"&CRONO!W$12,CÁLCULO!$AB$15:$AL$34)/(ORÇAMENTO!$X$15-CÁLCULO.TotalAdmLocal)*CRONO!$E3,0),W2*$R1),SUMIF(OFFSET($R3,1,0,$Q1-2),($L1+1)&\"$\",OFFSET(W3,1,0,$Q1-2)))","v":{"$error":"#REF!"}},{"$f":"IF($Q1=2,IF(AND(ACOMPANHAMENTO=\"PLE\",ISNUMBER($E1)),SUMIF((OFFSET(CÁLCULO!$AM$15:$AW$15,$E1,0,OFFSET(ORÇAMENTO!$D$15,CRONO!$E1,0))),\"=\"&CRONO!X$12,OFFSET(CÁLCULO!$AB$15:$AL$15,$E1,0,OFFSET(ORÇAMENTO!$D$15,CRONO!$E1,0)))+IF(AND($E3<>\"\",$E3<>0),SUMIF(CÁLCULO!$AM$15:$AW$34,\"=\"&CRONO!X$12,CÁLCULO!$AB$15:$AL$34)/(ORÇAMENTO!$X$15-CÁLCULO.TotalAdmLocal)*CRONO!$E3,0),X2*$R1),SUMIF(OFFSET($R3,1,0,$Q1-2),($L1+1)&\"$\",OFFSET(X3,1,0,$Q1-2)))","v":{"$error":"#REF!"}},{"$f":"IF($Q1=2,IF(AND(ACOMPANHAMENTO=\"PLE\",ISNUMBER($E1)),SUMIF((OFFSET(CÁLCULO!$AM$15:$AW$15,$E1,0,OFFSET(ORÇAMENTO!$D$15,CRONO!$E1,0))),\"=\"&CRONO!Y$12,OFFSET(CÁLCULO!$AB$15:$AL$15,$E1,0,OFFSET(ORÇAMENTO!$D$15,CRONO!$E1,0)))+IF(AND($E3<>\"\",$E3<>0),SUMIF(CÁLCULO!$AM$15:$AW$34,\"=\"&CRONO!Y$12,CÁLCULO!$AB$15:$AL$34)/(ORÇAMENTO!$X$15-CÁLCULO.TotalAdmLocal)*CRONO!$E3,0),Y2*$R1),SUMIF(OFFSET($R3,1,0,$Q1-2),($L1+1)&\"$\",OFFSET(Y3,1,0,$Q1-2)))","v":{"$error":"#REF!"}},{"$f":"IF($Q1=2,IF(AND(ACOMPANHAMENTO=\"PLE\",ISNUMBER($E1)),SUMIF((OFFSET(CÁLCULO!$AM$15:$AW$15,$E1,0,OFFSET(ORÇAMENTO!$D$15,CRONO!$E1,0))),\"=\"&CRONO!Z$12,OFFSET(CÁLCULO!$AB$15:$AL$15,$E1,0,OFFSET(ORÇAMENTO!$D$15,CRONO!$E1,0)))+IF(AND($E3<>\"\",$E3<>0),SUMIF(CÁLCULO!$AM$15:$AW$34,\"=\"&CRONO!Z$12,CÁLCULO!$AB$15:$AL$34)/(ORÇAMENTO!$X$15-CÁLCULO.TotalAdmLocal)*CRONO!$E3,0),Z2*$R1),SUMIF(OFFSET($R3,1,0,$Q1-2),($L1+1)&\"$\",OFFSET(Z3,1,0,$Q1-2)))","v":{"$error":"#REF!"}},{"$f":"IF($Q1=2,IF(AND(ACOMPANHAMENTO=\"PLE\",ISNUMBER($E1)),SUMIF((OFFSET(CÁLCULO!$AM$15:$AW$15,$E1,0,OFFSET(ORÇAMENTO!$D$15,CRONO!$E1,0))),\"=\"&CRONO!AA$12,OFFSET(CÁLCULO!$AB$15:$AL$15,$E1,0,OFFSET(ORÇAMENTO!$D$15,CRONO!$E1,0)))+IF(AND($E3<>\"\",$E3<>0),SUMIF(CÁLCULO!$AM$15:$AW$34,\"=\"&CRONO!AA$12,CÁLCULO!$AB$15:$AL$34)/(ORÇAMENTO!$X$15-CÁLCULO.TotalAdmLocal)*CRONO!$E3,0),AA2*$R1),SUMIF(OFFSET($R3,1,0,$Q1-2),($L1+1)&\"$\",OFFSET(AA3,1,0,$Q1-2)))","v":{"$error":"#REF!"}},{"$f":"IF($Q1=2,IF(AND(ACOMPANHAMENTO=\"PLE\",ISNUMBER($E1)),SUMIF((OFFSET(CÁLCULO!$AM$15:$AW$15,$E1,0,OFFSET(ORÇAMENTO!$D$15,CRONO!$E1,0))),\"=\"&CRONO!AB$12,OFFSET(CÁLCULO!$AB$15:$AL$15,$E1,0,OFFSET(ORÇAMENTO!$D$15,CRONO!$E1,0)))+IF(AND($E3<>\"\",$E3<>0),SUMIF(CÁLCULO!$AM$15:$AW$34,\"=\"&CRONO!AB$12,CÁLCULO!$AB$15:$AL$34)/(ORÇAMENTO!$X$15-CÁLCULO.TotalAdmLocal)*CRONO!$E3,0),AB2*$R1),SUMIF(OFFSET($R3,1,0,$Q1-2),($L1+1)&\"$\",OFFSET(AB3,1,0,$Q1-2)))","v":{"$error":"#REF!"}},{"$f":"IF($Q1=2,IF(AND(ACOMPANHAMENTO=\"PLE\",ISNUMBER($E1)),SUMIF((OFFSET(CÁLCULO!$AM$15:$AW$15,$E1,0,OFFSET(ORÇAMENTO!$D$15,CRONO!$E1,0))),\"=\"&CRONO!AC$12,OFFSET(CÁLCULO!$AB$15:$AL$15,$E1,0,OFFSET(ORÇAMENTO!$D$15,CRONO!$E1,0)))+IF(AND($E3<>\"\",$E3<>0),SUMIF(CÁLCULO!$AM$15:$AW$34,\"=\"&CRONO!AC$12,CÁLCULO!$AB$15:$AL$34)/(ORÇAMENTO!$X$15-CÁLCULO.TotalAdmLocal)*CRONO!$E3,0),AC2*$R1),SUMIF(OFFSET($R3,1,0,$Q1-2),($L1+1)&\"$\",OFFSET(AC3,1,0,$Q1-2)))","v":{"$error":"#REF!"}},{"$f":"IF($Q1=2,IF(AND(ACOMPANHAMENTO=\"PLE\",ISNUMBER($E1)),SUMIF((OFFSET(CÁLCULO!$AM$15:$AW$15,$E1,0,OFFSET(ORÇAMENTO!$D$15,CRONO!$E1,0))),\"=\"&CRONO!AD$12,OFFSET(CÁLCULO!$AB$15:$AL$15,$E1,0,OFFSET(ORÇAMENTO!$D$15,CRONO!$E1,0)))+IF(AND($E3<>\"\",$E3<>0),SUMIF(CÁLCULO!$AM$15:$AW$34,\"=\"&CRONO!AD$12,CÁLCULO!$AB$15:$AL$34)/(ORÇAMENTO!$X$15-CÁLCULO.TotalAdmLocal)*CRONO!$E3,0),AD2*$R1),SUMIF(OFFSET($R3,1,0,$Q1-2),($L1+1)&\"$\",OFFSET(AD3,1,0,$Q1-2)))","v":{"$error":"#REF!"}},{"$f":"IF($Q1=2,IF(AND(ACOMPANHAMENTO=\"PLE\",ISNUMBER($E1)),SUMIF((OFFSET(CÁLCULO!$AM$15:$AW$15,$E1,0,OFFSET(ORÇAMENTO!$D$15,CRONO!$E1,0))),\"=\"&CRONO!AE$12,OFFSET(CÁLCULO!$AB$15:$AL$15,$E1,0,OFFSET(ORÇAMENTO!$D$15,CRONO!$E1,0)))+IF(AND($E3<>\"\",$E3<>0),SUMIF(CÁLCULO!$AM$15:$AW$34,\"=\"&CRONO!AE$12,CÁLCULO!$AB$15:$AL$34)/(ORÇAMENTO!$X$15-CÁLCULO.TotalAdmLocal)*CRONO!$E3,0),AE2*$R1),SUMIF(OFFSET($R3,1,0,$Q1-2),($L1+1)&\"$\",OFFSET(AE3,1,0,$Q1-2)))","v":{"$error":"#REF!"}}]
[null,null,null,null,null,null,null,null,null,null,null,null,null,null,null,null,null,{"$f":"IF(TIPOORCAMENTO=\"licitado\",\"CRONOGRAMA FÍSICO-FINANCEIRO LICITADO\",\"CRONOGRAMA FÍSICO-FINANCEIRO\")","v":"CRONOGRAMA FÍSICO-FINANCEIRO"},null,null,null,null,null,null,null,null,null,null,null,"Grau de Sigilo"]
[null,null,null,null,null,null,null,null,null,null,null,null,null,null,null,null,null,{"$f":"import.recurso","v":"OGU"},null,null,null,null,null,null,null,null,null,null,null,"#PUBLICO"]
[]
[null,null,null,null,null,null,"Níveis a Exibir no Cronograma:","Nº OPERAÇÃO",null,"Nº TGOV","PROPONENTE TOMADOR",null,null,null,null,null,null,null,null,"APELIDO EMPREENDIMENTO",null,null,null,null,{"$f":"IF(TIPOORCAMENTO=\"Licitado\",\"NOME DA EMPRESA\",\"DESCRIÇÃO DO LOTE\")","v":"DESCRIÇÃO DO LOTE"},null,null,null,null,null,{"$f":"IF(TIPOORCAMENTO=\"Licitado\",\"Nº CTEF\",\"\")","v":""}]
[null,null,null,null,null,"FILTRO",null,{"$f":"Import.CR","v":"109437911"},null,{"$f":"Import.TransfereGOV","v":"02829/2024"},{"$f":"Import.Proponente","v":"PREFEITURA MUNICIPAL DE TRAMANDAÍ "},null,null,null,null,null,null,null,null,{"$f":"Import.Apelido","v":"INFRAESTRUTURA EMEI PORTAL DAS FLORES"},null,null,null,null,{"$f":"IF(TIPOORCAMENTO=\"Licitado\",Import.empresa,Import.DescLote)","v":"CONSTRUÇÃO DA EMEI PORTAL DAS FLORES"},null,null,null,null,null,{"$f":"IF(TIPOORCAMENTO=\"Licitado\",Import.CTEF,\"\")","v":""}]
[]
[null,null,null,null,null,null,2,null,null,{"$f":"IF(MAX($A$13:$A$29)<CRONO.LinhasNecessarias,\"ERRO: NÚMERO DE LINHAS DO CRONOGRAMA INSUFICIENTE. CLIQUE EM ATUALIZAR LINHAS.\",IF(AND(ACOMPANHAMENTO=\"PLE\",ROUND(OFFSET($AF$39,0,-1),2)=0),\"CRONOGRAMA DEVE SER PREENCHIDO POR EVENTOS\",IF(ROUND(OFFSET($AF$39,0,-1),2)<>$Q$30,\"ERRO: CRONOGRAMA NÃO FECHA 100%\",\"\")))","v":""}]
[]
[null,null,null,{"$f":"OFFSET(D12,0,-1)+1","v":1},null,"↓","Falta distribuir:","Item","Descrição",null,null,null,null,null,null,null,null,"Valor (R$)","Parcelas:",1,{"$f":"OFFSET(U12,0,-1)+1","v":2},{"$f":"OFFSET(V12,0,-1)+1","v":3},4,5,6,7,8,9,10,11,12]
["Item CRONO","CP","OU",{"$f":"OFFSET(D13,0,-1)+41-DAY(OFFSET(D13,0,-1)+40)","v":{"$error":"#VALUE!"}},"Linha PO\nLinha QCI\nTotal Adm Local",null,null,null,null,null,null,"Nível",1,2,3,4,"Linhas a somar",null,null,"2025-03-01",{"$f":"OFFSET(U13,0,-1)+41-DAY(OFFSET(U13,0,-1)+40)","v":"2025-04-01"},{"$f":"OFFSET(V13,0,-1)+41-DAY(OFFSET(V13,0,-1)+40)","v":"2025-05-01"},{"$f":"OFFSET(W13,0,-1)+41-DAY(OFFSET(W13,0,-1)+40)","v":"2025-06-01"},"2025-07-01","2025-08-01","2025-09-01","2025-10-01","2025-11-01","2025-12-01","2026-01-01","2026-02-01"]
[{"$f":"OFFSET(A14,-3,0)+1","v":1},{"$f":"IF($Q14<>2,0,IF($R14=0,1,IF(E15>0,OFFSET(QCI!$M$13,SUBSTITUTE(E15,\".\",\"\"),0),OFFSET(ORÇAMENTO!$AA$15,CRONO!$E14,0))/$R14))","v":0},{"$f":"IF($Q14<>2,0,IF($R14=0,1,IF(E15>0,OFFSET(QCI!$N$13,SUBSTITUTE(E15,\".\",\"\"),0),OFFSET(ORÇAMENTO!$AB$15,CRONO!$E14,0))/$R14))","v":0},{"$f":"IF(AND($Q14=2,ACOMPANHAMENTO=\"BM\"),D15,D16/$R14)","v":0},{"$f":"IF(A14<=ORÇAMENTO.MáximoListaCrono,MATCH(A14,ORÇAMENTO.ListaCrono,0),NA())","v":1},{"$f":"IF(AND($E15<>-1,$R14>0),\"F\",\"\")","v":"F"},{"$f":"IF(OR(R14=0,R14=\"\"),\"Linha\",IF(AND(OR(ACOMPANHAMENTO=\"PLE\",$Q14<>2),$E15=0),\"Linha\",1-SUM(T14:AF14)))","v":"Linha"},{"$f":"IF($E15=0,OFFSET(ORÇAMENTO!O$15,$E14,0),IF($E15<>-1,OFFSET(QCI!$D$13,$E15,0),\"\"))","v":"1."},{"$f":"IF($E15=0,OFFSET(ORÇAMENTO!R$15,$E14,0),IF($E15<>-1,OFFSET(QCI!$G$13,$E15,0),\"\"))","v":"PAVIMENTAÇÃO E PAISAGISMO ENTORNO EMEI  PORTAL DAS FLORES"},null,null,{"$f":"IF($E15=0,OFFSET(ORÇAMENTO!C$15,$E14,0),1)","v":1},{"$f":"IF($E15=-1,0,IF(M$13<=$L14,IF(ISERROR(MATCH(M$13,OFFSET($L14,1,0,ROW($L$29)-ROW($L14)-1),0)),ROW($L$29)-ROW($L14)-1,MATCH(M$13,OFFSET($L14,1,0,ROW($L$29)-ROW($L14)-1),0)-1),0))","v":14},{"$f":"IF($E15=-1,0,IF(N$13<=$L14,IF(ISERROR(MATCH(N$13,OFFSET($L14,1,0,ROW($L$29)-ROW($L14)-1),0)),ROW($L$29)-ROW($L14)-1,MATCH(N$13,OFFSET($L14,1,0,ROW($L$29)-ROW($L14)-1),0)-1),0))","v":0},{"$f":"IF($E15=-1,0,IF(O$13<=$L14,IF(ISERROR(MATCH(O$13,OFFSET($L14,1,0,ROW($L$29)-ROW($L14)-1),0)),ROW($L$29)-ROW($L14)-1,MATCH(O$13,OFFSET($L14,1,0,ROW($L$29)-ROW($L14)-1),0)-1),0))","v":0},{"$f":"IF($E15=-1,0,IF(P$13<=$L14,IF(ISERROR(MATCH(P$13,OFFSET($L14,1,0,ROW($L$29)-ROW($L14)-1),0)),ROW($L$29)-ROW($L14)-1,MATCH(P$13,OFFSET($L14,1,0,ROW($L$29)-ROW($L14)-1),0)-1),0))","v":0},{"$f":"MIN(OFFSET(L14,0,1,,L14))","v":14},{"$f":"IF($E15=0,OFFSET(ORÇAMENTO!X$15,$E14,0),IF($E15<>-1,OFFSET(QCI!$O$13,$E15,0),\"\"))","v":196407.48},"% Período:",{"$f":"IF(AND($Q14=2,ACOMPANHAMENTO=\"BM\"),T15,T16/$R14)","v":0},0,0,0,0,0,0,0,0,1.4624799422099403E-2,0.47517367973969216,0.51020152083820836]
[null,null,null,null,{"$f":"IF(ISERROR(E14),IF(1+COUNTIF($L$13:OFFSET(L14,-1,0),1)<=MAX(QCI!$D$13:$D$24),1+COUNTIF($L$13:OFFSET(L14,-1,0),1),-1),0)","v":0},{"$f":"IF(AND($E15<>-1,$R14>0),\"F\",\"\")","v":"F"},{"$f":"IF(OR(R14=0,R14=\"\"),\"vazia\",IF(AND(OR(ACOMPANHAMENTO=\"PLE\",$Q14<>2),$E15=0),\"calculada\",\"-->\"))","v":"calculada"},null,{"$f":"IF(AND(G14<>0,ISNUMBER(G14)),\"PREENCHA ESTA LINHA -->\",\"\")","v":""}]
[null,null,null,{"$f":"IF($Q14=2,IF(AND(ACOMPANHAMENTO=\"PLE\",ISNUMBER($E14)),SUMIF((OFFSET(CÁLCULO!$AM$15:$AW$15,$E14,0,OFFSET(ORÇAMENTO!$D$15,CRONO!$E14,0))),\"=\"&CRONO!D$12,OFFSET(CÁLCULO!$AB$15:$AL$15,$E14,0,OFFSET(ORÇAMENTO!$D$15,CRONO!$E14,0)))+IF(AND($E16<>\"\",$E16<>0),SUMIF(CÁLCULO!$AM$15:$AW$34,\"=\"&CRONO!D$12,CÁLCULO!$AB$15:$AL$34)/(ORÇAMENTO!$X$15-CÁLCULO.TotalAdmLocal)*CRONO!$E16,0),D15*$R14),SUMIF(OFFSET($R16,1,0,$Q14-2),($L14+1)&\"$\",OFFSET(D16,1,0,$Q14-2)))","v":0},{"$f":"IF(OR($Q14<>2,AUTOEVENTO<>\"manual\",$E15>0),\"\",SUMIF(OFFSET(CÁLCULO!$M$15,CRONO!$E14,0,OFFSET(ORÇAMENTO!$D$15,CRONO!$E14,0)),1,OFFSET(ORÇAMENTO!$X$15,CRONO!$E14,0,OFFSET(ORÇAMENTO!$D$15,CRONO!$E14,0))))","v":""},null,null,null,null,null,null,null,null,null,null,null,null,{"$f":"L14&\"$\"","v":"1$"},null,{"$f":"IF($Q14=2,IF(AND(ACOMPANHAMENTO=\"PLE\",ISNUMBER($E14)),SUMIF((OFFSET(CÁLCULO!$AM$15:$AW$15,$E14,0,OFFSET(ORÇAMENTO!$D$15,CRONO!$E14,0))),\"<=\"&CRONO!T$12,OFFSET(CÁLCULO!$AB$15:$AL$15,$E14,0,OFFSET(ORÇAMENTO!$D$15,CRONO!$E14,0)))+IF(AND($E16<>\"\",$E16<>0),SUMIF(CÁLCULO!$AM$15:$AW$34,\"<=\"&CRONO!T$12,CÁLCULO!$AB$15:$AL$34)/(ORÇAMENTO!$X$15-CÁLCULO.TotalAdmLocal)*CRONO!$E16,0),T15*$R14),SUMIF(OFFSET($R16,1,0,$Q14-2),($L14+1)&\"$\",OFFSET(T16,1,0,$Q14-2)))","v":0},{"$f":"IF($Q14=2,IF(AND(ACOMPANHAMENTO=\"PLE\",ISNUMBER($E14)),SUMIF((OFFSET(CÁLCULO!$AM$15:$AW$15,$E14,0,OFFSET(ORÇAMENTO!$D$15,CRONO!$E14,0))),\"=\"&CRONO!U$12,OFFSET(CÁLCULO!$AB$15:$AL$15,$E14,0,OFFSET(ORÇAMENTO!$D$15,CRONO!$E14,0)))+IF(AND($E16<>\"\",$E16<>0),SUMIF(CÁLCULO!$AM$15:$AW$34,\"=\"&CRONO!U$12,CÁLCULO!$AB$15:$AL$34)/(ORÇAMENTO!$X$15-CÁLCULO.TotalAdmLocal)*CRONO!$E16,0),U15*$R14),SUMIF(OFFSET($R16,1,0,$Q14-2),($L14+1)&\"$\",OFFSET(U16,1,0,$Q14-2)))","v":0},{"$f":"IF($Q14=2,IF(AND(ACOMPANHAMENTO=\"PLE\",ISNUMBER($E14)),SUMIF((OFFSET(CÁLCULO!$AM$15:$AW$15,$E14,0,OFFSET(ORÇAMENTO!$D$15,CRONO!$E14,0))),\"=\"&CRONO!V$12,OFFSET(CÁLCULO!$AB$15:$AL$15,$E14,0,OFFSET(ORÇAMENTO!$D$15,CRONO!$E14,0)))+IF(AND($E16<>\"\",$E16<>0),SUMIF(CÁLCULO!$AM$15:$AW$34,\"=\"&CRONO!V$12,CÁLCULO!$AB$15:$AL$34)/(ORÇAMENTO!$X$15-CÁLCULO.TotalAdmLocal)*CRONO!$E16,0),V15*$R14),SUMIF(OFFSET($R16,1,0,$Q14-2),($L14+1)&\"$\",OFFSET(V16,1,0,$Q14-2)))","v":0},{"$f":"IF($Q14=2,IF(AND(ACOMPANHAMENTO=\"PLE\",ISNUMBER($E14)),SUMIF((OFFSET(CÁLCULO!$AM$15:$AW$15,$E14,0,OFFSET(ORÇAMENTO!$D$15,CRONO!$E14,0))),\"=\"&CRONO!W$12,OFFSET(CÁLCULO!$AB$15:$AL$15,$E14,0,OFFSET(ORÇAMENTO!$D$15,CRONO!$E14,0)))+IF(AND($E16<>\"\",$E16<>0),SUMIF(CÁLCULO!$AM$15:$AW$34,\"=\"&CRONO!W$12,CÁLCULO!$AB$15:$AL$34)/(ORÇAMENTO!$X$15-CÁLCULO.TotalAdmLocal)*CRONO!$E16,0),W15*$R14),SUMIF(OFFSET($R16,1,0,$Q14-2),($L14+1)&\"$\",OFFSET(W16,1,0,$Q14-2)))","v":0},{"$f":"IF($Q14=2,IF(AND(ACOMPANHAMENTO=\"PLE\",ISNUMBER($E14)),SUMIF((OFFSET(CÁLCULO!$AM$15:$AW$15,$E14,0,OFFSET(ORÇAMENTO!$D$15,CRONO!$E14,0))),\"=\"&CRONO!X$12,OFFSET(CÁLCULO!$AB$15:$AL$15,$E14,0,OFFSET(ORÇAMENTO!$D$15,CRONO!$E14,0)))+IF(AND($E16<>\"\",$E16<>0),SUMIF(CÁLCULO!$AM$15:$AW$34,\"=\"&CRONO!X$12,CÁLCULO!$AB$15:$AL$34)/(ORÇAMENTO!$X$15-CÁLCULO.TotalAdmLocal)*CRONO!$E16,0),X15*$R14),SUMIF(OFFSET($R16,1,0,$Q14-2),($L14+1)&\"$\",OFFSET(X16,1,0,$Q14-2)))","v":0},{"$f":"IF($Q14=2,IF(AND(ACOMPANHAMENTO=\"PLE\",ISNUMBER($E14)),SUMIF((OFFSET(CÁLCULO!$AM$15:$AW$15,$E14,0,OFFSET(ORÇAMENTO!$D$15,CRONO!$E14,0))),\"=\"&CRONO!Y$12,OFFSET(CÁLCULO!$AB$15:$AL$15,$E14,0,OFFSET(ORÇAMENTO!$D$15,CRONO!$E14,0)))+IF(AND($E16<>\"\",$E16<>0),SUMIF(CÁLCULO!$AM$15:$AW$34,\"=\"&CRONO!Y$12,CÁLCULO!$AB$15:$AL$34)/(ORÇAMENTO!$X$15-CÁLCULO.TotalAdmLocal)*CRONO!$E16,0),Y15*$R14),SUMIF(OFFSET($R16,1,0,$Q14-2),($L14+1)&\"$\",OFFSET(Y16,1,0,$Q14-2)))","v":0},{"$f":"IF($Q14=2,IF(AND(ACOMPANHAMENTO=\"PLE\",ISNUMBER($E14)),SUMIF((OFFSET(CÁLCULO!$AM$15:$AW$15,$E14,0,OFFSET(ORÇAMENTO!$D$15,CRONO!$E14,0))),\"=\"&CRONO!Z$12,OFFSET(CÁLCULO!$AB$15:$AL$15,$E14,0,OFFSET(ORÇAMENTO!$D$15,CRONO!$E14,0)))+IF(AND($E16<>\"\",$E16<>0),SUMIF(CÁLCULO!$AM$15:$AW$34,\"=\"&CRONO!Z$12,CÁLCULO!$AB$15:$AL$34)/(ORÇAMENTO!$X$15-CÁLCULO.TotalAdmLocal)*CRONO!$E16,0),Z15*$R14),SUMIF(OFFSET($R16,1,0,$Q14-2),($L14+1)&\"$\",OFFSET(Z16,1,0,$Q14-2)))","v":0},{"$f":"IF($Q14=2,IF(AND(ACOMPANHAMENTO=\"PLE\",ISNUMBER($E14)),SUMIF((OFFSET(CÁLCULO!$AM$15:$AW$15,$E14,0,OFFSET(ORÇAMENTO!$D$15,CRONO!$E14,0))),\"=\"&CRONO!AA$12,OFFSET(CÁLCULO!$AB$15:$AL$15,$E14,0,OFFSET(ORÇAMENTO!$D$15,CRONO!$E14,0)))+IF(AND($E16<>\"\",$E16<>0),SUMIF(CÁLCULO!$AM$15:$AW$34,\"=\"&CRONO!AA$12,CÁLCULO!$AB$15:$AL$34)/(ORÇAMENTO!$X$15-CÁLCULO.TotalAdmLocal)*CRONO!$E16,0),AA15*$R14),SUMIF(OFFSET($R16,1,0,$Q14-2),($L14+1)&\"$\",OFFSET(AA16,1,0,$Q14-2)))","v":0},{"$f":"IF($Q14=2,IF(AND(ACOMPANHAMENTO=\"PLE\",ISNUMBER($E14)),SUMIF((OFFSET(CÁLCULO!$AM$15:$AW$15,$E14,0,OFFSET(ORÇAMENTO!$D$15,CRONO!$E14,0))),\"=\"&CRONO!AB$12,OFFSET(CÁLCULO!$AB$15:$AL$15,$E14,0,OFFSET(ORÇAMENTO!$D$15,CRONO!$E14,0)))+IF(AND($E16<>\"\",$E16<>0),SUMIF(CÁLCULO!$AM$15:$AW$34,\"=\"&CRONO!AB$12,CÁLCULO!$AB$15:$AL$34)/(ORÇAMENTO!$X$15-CÁLCULO.TotalAdmLocal)*CRONO!$E16,0),AB15*$R14),SUMIF(OFFSET($R16,1,0,$Q14-2),($L14+1)&\"$\",OFFSET(AB16,1,0,$Q14-2)))","v":0},{"$f":"IF($Q14=2,IF(AND(ACOMPANHAMENTO=\"PLE\",ISNUMBER($E14)),SUMIF((OFFSET(CÁLCULO!$AM$15:$AW$15,$E14,0,OFFSET(ORÇAMENTO!$D$15,CRONO!$E14,0))),\"=\"&CRONO!AC$12,OFFSET(CÁLCULO!$AB$15:$AL$15,$E14,0,OFFSET(ORÇAMENTO!$D$15,CRONO!$E14,0)))+IF(AND($E16<>\"\",$E16<>0),SUMIF(CÁLCULO!$AM$15:$AW$34,\"=\"&CRONO!AC$12,CÁLCULO!$AB$15:$AL$34)/(ORÇAMENTO!$X$15-CÁLCULO.TotalAdmLocal)*CRONO!$E16,0),AC15*$R14),SUMIF(OFFSET($R16,1,0,$Q14-2),($L14+1)&\"$\",OFFSET(AC16,1,0,$Q14-2)))","v":2872.42},{"$f":"IF($Q14=2,IF(AND(ACOMPANHAMENTO=\"PLE\",ISNUMBER($E14)),SUMIF((OFFSET(CÁLCULO!$AM$15:$AW$15,$E14,0,OFFSET(ORÇAMENTO!$D$15,CRONO!$E14,0))),\"=\"&CRONO!AD$12,OFFSET(CÁLCULO!$AB$15:$AL$15,$E14,0,OFFSET(ORÇAMENTO!$D$15,CRONO!$E14,0)))+IF(AND($E16<>\"\",$E16<>0),SUMIF(CÁLCULO!$AM$15:$AW$34,\"=\"&CRONO!AD$12,CÁLCULO!$AB$15:$AL$34)/(ORÇAMENTO!$X$15-CÁLCULO.TotalAdmLocal)*CRONO!$E16,0),AD15*$R14),SUMIF(OFFSET($R16,1,0,$Q14-2),($L14+1)&\"$\",OFFSET(AD16,1,0,$Q14-2)))","v":93327.664999999994},{"$f":"IF($Q14=2,IF(AND(ACOMPANHAMENTO=\"PLE\",ISNUMBER($E14)),SUMIF((OFFSET(CÁLCULO!$AM$15:$AW$15,$E14,0,OFFSET(ORÇAMENTO!$D$15,CRONO!$E14,0))),\"=\"&CRONO!AE$12,OFFSET(CÁLCULO!$AB$15:$AL$15,$E14,0,OFFSET(ORÇAMENTO!$D$15,CRONO!$E14,0)))+IF(AND($E16<>\"\",$E16<>0),SUMIF(CÁLCULO!$AM$15:$AW$34,\"=\"&CRONO!AE$12,CÁLCULO!$AB$15:$AL$34)/(ORÇAMENTO!$X$15-CÁLCULO.TotalAdmLocal)*CRONO!$E16,0),AE15*$R14),SUMIF(OFFSET($R16,1,0,$Q14-2),($L14+1)&\"$\",OFFSET(AE16,1,0,$Q14-2)))","v":100207.39499999999}]
[{"$f":"OFFSET(A17,-3,0)+1","v":2},{"$f":"IF($Q17<>2,0,IF($R17=0,1,IF(E18>0,OFFSET(QCI!$M$13,SUBSTITUTE(E18,\".\",\"\"),0),OFFSET(ORÇAMENTO!$AA$15,CRONO!$E17,0))/$R17))","v":1},{"$f":"IF($Q17<>2,0,IF($R17=0,1,IF(E18>0,OFFSET(QCI!$N$13,SUBSTITUTE(E18,\".\",\"\"),0),OFFSET(ORÇAMENTO!$AB$15,CRONO!$E17,0))/$R17))","v":0},{"$f":"IF(AND($Q17=2,ACOMPANHAMENTO=\"BM\"),D18,D19/$R17)","v":0},{"$f":"IF(A17<=ORÇAMENTO.MáximoListaCrono,MATCH(A17,ORÇAMENTO.ListaCrono,0),NA())","v":2},{"$f":"IF(AND($E18<>-1,$R17>0),\"F\",\"\")","v":"F"},{"$f":"IF(OR(R17=0,R17=\"\"),\"Linha\",IF(AND(OR(ACOMPANHAMENTO=\"PLE\",$Q17<>2),$E18=0),\"Linha\",1-SUM(T17:AF17)))","v":0},{"$f":"IF($E18=0,OFFSET(ORÇAMENTO!O$15,$E17,0),IF($E18<>-1,OFFSET(QCI!$D$13,$E18,0),\"\"))","v":"1.1."},{"$f":"IF($E18=0,OFFSET(ORÇAMENTO!R$15,$E17,0),IF($E18<>-1,OFFSET(QCI!$G$13,$E18,0),\"\"))","v":"SERVIÇOS PRELIMINARES"},null,null,{"$f":"IF($E18=0,OFFSET(ORÇAMENTO!C$15,$E17,0),1)","v":2},{"$f":"IF($E18=-1,0,IF(M$13<=$L17,IF(ISERROR(MATCH(M$13,OFFSET($L17,1,0,ROW($L$29)-ROW($L17)-1),0)),ROW($L$29)-ROW($L17)-1,MATCH(M$13,OFFSET($L17,1,0,ROW($L$29)-ROW($L17)-1),0)-1),0))","v":11},{"$f":"IF($E18=-1,0,IF(N$13<=$L17,IF(ISERROR(MATCH(N$13,OFFSET($L17,1,0,ROW($L$29)-ROW($L17)-1),0)),ROW($L$29)-ROW($L17)-1,MATCH(N$13,OFFSET($L17,1,0,ROW($L$29)-ROW($L17)-1),0)-1),0))","v":2},{"$f":"IF($E18=-1,0,IF(O$13<=$L17,IF(ISERROR(MATCH(O$13,OFFSET($L17,1,0,ROW($L$29)-ROW($L17)-1),0)),ROW($L$29)-ROW($L17)-1,MATCH(O$13,OFFSET($L17,1,0,ROW($L$29)-ROW($L17)-1),0)-1),0))","v":0},{"$f":"IF($E18=-1,0,IF(P$13<=$L17,IF(ISERROR(MATCH(P$13,OFFSET($L17,1,0,ROW($L$29)-ROW($L17)-1),0)),ROW($L$29)-ROW($L17)-1,MATCH(P$13,OFFSET($L17,1,0,ROW($L$29)-ROW($L17)-1),0)-1),0))","v":0},{"$f":"MIN(OFFSET(L17,0,1,,L17))","v":2},{"$f":"IF($E18=0,OFFSET(ORÇAMENTO!X$15,$E17,0),IF($E18<>-1,OFFSET(QCI!$O$13,$E18,0),\"\"))","v":5744.84},"% Período:",{"$f":"IF(AND($Q17=2,ACOMPANHAMENTO=\"BM\"),T18,T19/$R17)","v":0},0,0,0,0,0,0,0,0,0.5,0.5,0]
[null,null,null,null,{"$f":"IF(ISERROR(E17),IF(1+COUNTIF($L$13:OFFSET(L17,-1,0),1)<=MAX(QCI!$D$13:$D$24),1+COUNTIF($L$13:OFFSET(L17,-1,0),1),-1),0)","v":0},{"$f":"IF(AND($E18<>-1,$R17>0),\"F\",\"\")","v":"F"},{"$f":"IF(OR(R17=0,R17=\"\"),\"vazia\",IF(AND(OR(ACOMPANHAMENTO=\"PLE\",$Q17<>2),$E18=0),\"calculada\",\"-->\"))","v":"-->"},null,{"$f":"IF(AND(G17<>0,ISNUMBER(G17)),\"PREENCHA ESTA LINHA -->\",\"\")","v":""},null,null,null,null,null,null,null,null,null,null,null,null,null,null,null,null,null,null,null,0.5,0.5]
[null,null,null,{"$f":"IF($Q17=2,IF(AND(ACOMPANHAMENTO=\"PLE\",ISNUMBER($E17)),SUMIF((OFFSET(CÁLCULO!$AM$15:$AW$15,$E17,0,OFFSET(ORÇAMENTO!$D$15,CRONO!$E17,0))),\"=\"&CRONO!D$12,OFFSET(CÁLCULO!$AB$15:$AL$15,$E17,0,OFFSET(ORÇAMENTO!$D$15,CRONO!$E17,0)))+IF(AND($E19<>\"\",$E19<>0),SUMIF(CÁLCULO!$AM$15:$AW$34,\"=\"&CRONO!D$12,CÁLCULO!$AB$15:$AL$34)/(ORÇAMENTO!$X$15-CÁLCULO.TotalAdmLocal)*CRONO!$E19,0),D18*$R17),SUMIF(OFFSET($R19,1,0,$Q17-2),($L17+1)&\"$\",OFFSET(D19,1,0,$Q17-2)))","v":0},{"$f":"IF(OR($Q17<>2,AUTOEVENTO<>\"manual\",$E18>0),\"\",SUMIF(OFFSET(CÁLCULO!$M$15,CRONO!$E17,0,OFFSET(ORÇAMENTO!$D$15,CRONO!$E17,0)),1,OFFSET(ORÇAMENTO!$X$15,CRONO!$E17,0,OFFSET(ORÇAMENTO!$D$15,CRONO!$E17,0))))","v":""},null,null,null,null,null,null,null,null,null,null,null,null,{"$f":"L17&\"$\"","v":"2$"},null,{"$f":"IF($Q17=2,IF(AND(ACOMPANHAMENTO=\"PLE\",ISNUMBER($E17)),SUMIF((OFFSET(CÁLCULO!$AM$15:$AW$15,$E17,0,OFFSET(ORÇAMENTO!$D$15,CRONO!$E17,0))),\"<=\"&CRONO!T$12,OFFSET(CÁLCULO!$AB$15:$AL$15,$E17,0,OFFSET(ORÇAMENTO!$D$15,CRONO!$E17,0)))+IF(AND($E19<>\"\",$E19<>0),SUMIF(CÁLCULO!$AM$15:$AW$34,\"<=\"&CRONO!T$12,CÁLCULO!$AB$15:$AL$34)/(ORÇAMENTO!$X$15-CÁLCULO.TotalAdmLocal)*CRONO!$E19,0),T18*$R17),SUMIF(OFFSET($R19,1,0,$Q17-2),($L17+1)&\"$\",OFFSET(T19,1,0,$Q17-2)))","v":0},{"$f":"IF($Q17=2,IF(AND(ACOMPANHAMENTO=\"PLE\",ISNUMBER($E17)),SUMIF((OFFSET(CÁLCULO!$AM$15:$AW$15,$E17,0,OFFSET(ORÇAMENTO!$D$15,CRONO!$E17,0))),\"=\"&CRONO!U$12,OFFSET(CÁLCULO!$AB$15:$AL$15,$E17,0,OFFSET(ORÇAMENTO!$D$15,CRONO!$E17,0)))+IF(AND($E19<>\"\",$E19<>0),SUMIF(CÁLCULO!$AM$15:$AW$34,\"=\"&CRONO!U$12,CÁLCULO!$AB$15:$AL$34)/(ORÇAMENTO!$X$15-CÁLCULO.TotalAdmLocal)*CRONO!$E19,0),U18*$R17),SUMIF(OFFSET($R19,1,0,$Q17-2),($L17+1)&\"$\",OFFSET(U19,1,0,$Q17-2)))","v":0},{"$f":"IF($Q17=2,IF(AND(ACOMPANHAMENTO=\"PLE\",ISNUMBER($E17)),SUMIF((OFFSET(CÁLCULO!$AM$15:$AW$15,$E17,0,OFFSET(ORÇAMENTO!$D$15,CRONO!$E17,0))),\"=\"&CRONO!V$12,OFFSET(CÁLCULO!$AB$15:$AL$15,$E17,0,OFFSET(ORÇAMENTO!$D$15,CRONO!$E17,0)))+IF(AND($E19<>\"\",$E19<>0),SUMIF(CÁLCULO!$AM$15:$AW$34,\"=\"&CRONO!V$12,CÁLCULO!$AB$15:$AL$34)/(ORÇAMENTO!$X$15-CÁLCULO.TotalAdmLocal)*CRONO!$E19,0),V18*$R17),SUMIF(OFFSET($R19,1,0,$Q17-2),($L17+1)&\"$\",OFFSET(V19,1,0,$Q17-2)))","v":0},{"$f":"IF($Q17=2,IF(AND(ACOMPANHAMENTO=\"PLE\",ISNUMBER($E17)),SUMIF((OFFSET(CÁLCULO!$AM$15:$AW$15,$E17,0,OFFSET(ORÇAMENTO!$D$15,CRONO!$E17,0))),\"=\"&CRONO!W$12,OFFSET(CÁLCULO!$AB$15:$AL$15,$E17,0,OFFSET(ORÇAMENTO!$D$15,CRONO!$E17,0)))+IF(AND($E19<>\"\",$E19<>0),SUMIF(CÁLCULO!$AM$15:$AW$34,\"=\"&CRONO!W$12,CÁLCULO!$AB$15:$AL$34)/(ORÇAMENTO!$X$15-CÁLCULO.TotalAdmLocal)*CRONO!$E19,0),W18*$R17),SUMIF(OFFSET($R19,1,0,$Q17-2),($L17+1)&\"$\",OFFSET(W19,1,0,$Q17-2)))","v":0},{"$f":"IF($Q17=2,IF(AND(ACOMPANHAMENTO=\"PLE\",ISNUMBER($E17)),SUMIF((OFFSET(CÁLCULO!$AM$15:$AW$15,$E17,0,OFFSET(ORÇAMENTO!$D$15,CRONO!$E17,0))),\"=\"&CRONO!X$12,OFFSET(CÁLCULO!$AB$15:$AL$15,$E17,0,OFFSET(ORÇAMENTO!$D$15,CRONO!$E17,0)))+IF(AND($E19<>\"\",$E19<>0),SUMIF(CÁLCULO!$AM$15:$AW$34,\"=\"&CRONO!X$12,CÁLCULO!$AB$15:$AL$34)/(ORÇAMENTO!$X$15-CÁLCULO.TotalAdmLocal)*CRONO!$E19,0),X18*$R17),SUMIF(OFFSET($R19,1,0,$Q17-2),($L17+1)&\"$\",OFFSET(X19,1,0,$Q17-2)))","v":0},{"$f":"IF($Q17=2,IF(AND(ACOMPANHAMENTO=\"PLE\",ISNUMBER($E17)),SUMIF((OFFSET(CÁLCULO!$AM$15:$AW$15,$E17,0,OFFSET(ORÇAMENTO!$D$15,CRONO!$E17,0))),\"=\"&CRONO!Y$12,OFFSET(CÁLCULO!$AB$15:$AL$15,$E17,0,OFFSET(ORÇAMENTO!$D$15,CRONO!$E17,0)))+IF(AND($E19<>\"\",$E19<>0),SUMIF(CÁLCULO!$AM$15:$AW$34,\"=\"&CRONO!Y$12,CÁLCULO!$AB$15:$AL$34)/(ORÇAMENTO!$X$15-CÁLCULO.TotalAdmLocal)*CRONO!$E19,0),Y18*$R17),SUMIF(OFFSET($R19,1,0,$Q17-2),($L17+1)&\"$\",OFFSET(Y19,1,0,$Q17-2)))","v":0},{"$f":"IF($Q17=2,IF(AND(ACOMPANHAMENTO=\"PLE\",ISNUMBER($E17)),SUMIF((OFFSET(CÁLCULO!$AM$15:$AW$15,$E17,0,OFFSET(ORÇAMENTO!$D$15,CRONO!$E17,0))),\"=\"&CRONO!Z$12,OFFSET(CÁLCULO!$AB$15:$AL$15,$E17,0,OFFSET(ORÇAMENTO!$D$15,CRONO!$E17,0)))+IF(AND($E19<>\"\",$E19<>0),SUMIF(CÁLCULO!$AM$15:$AW$34,\"=\"&CRONO!Z$12,CÁLCULO!$AB$15:$AL$34)/(ORÇAMENTO!$X$15-CÁLCULO.TotalAdmLocal)*CRONO!$E19,0),Z18*$R17),SUMIF(OFFSET($R19,1,0,$Q17-2),($L17+1)&\"$\",OFFSET(Z19,1,0,$Q17-2)))","v":0},{"$f":"IF($Q17=2,IF(AND(ACOMPANHAMENTO=\"PLE\",ISNUMBER($E17)),SUMIF((OFFSET(CÁLCULO!$AM$15:$AW$15,$E17,0,OFFSET(ORÇAMENTO!$D$15,CRONO!$E17,0))),\"=\"&CRONO!AA$12,OFFSET(CÁLCULO!$AB$15:$AL$15,$E17,0,OFFSET(ORÇAMENTO!$D$15,CRONO!$E17,0)))+IF(AND($E19<>\"\",$E19<>0),SUMIF(CÁLCULO!$AM$15:$AW$34,\"=\"&CRONO!AA$12,CÁLCULO!$AB$15:$AL$34)/(ORÇAMENTO!$X$15-CÁLCULO.TotalAdmLocal)*CRONO!$E19,0),AA18*$R17),SUMIF(OFFSET($R19,1,0,$Q17-2),($L17+1)&\"$\",OFFSET(AA19,1,0,$Q17-2)))","v":0},{"$f":"IF($Q17=2,IF(AND(ACOMPANHAMENTO=\"PLE\",ISNUMBER($E17)),SUMIF((OFFSET(CÁLCULO!$AM$15:$AW$15,$E17,0,OFFSET(ORÇAMENTO!$D$15,CRONO!$E17,0))),\"=\"&CRONO!AB$12,OFFSET(CÁLCULO!$AB$15:$AL$15,$E17,0,OFFSET(ORÇAMENTO!$D$15,CRONO!$E17,0)))+IF(AND($E19<>\"\",$E19<>0),SUMIF(CÁLCULO!$AM$15:$AW$34,\"=\"&CRONO!AB$12,CÁLCULO!$AB$15:$AL$34)/(ORÇAMENTO!$X$15-CÁLCULO.TotalAdmLocal)*CRONO!$E19,0),AB18*$R17),SUMIF(OFFSET($R19,1,0,$Q17-2),($L17+1)&\"$\",OFFSET(AB19,1,0,$Q17-2)))","v":0},{"$f":"IF($Q17=2,IF(AND(ACOMPANHAMENTO=\"PLE\",ISNUMBER($E17)),SUMIF((OFFSET(CÁLCULO!$AM$15:$AW$15,$E17,0,OFFSET(ORÇAMENTO!$D$15,CRONO!$E17,0))),\"=\"&CRONO!AC$12,OFFSET(CÁLCULO!$AB$15:$AL$15,$E17,0,OFFSET(ORÇAMENTO!$D$15,CRONO!$E17,0)))+IF(AND($E19<>\"\",$E19<>0),SUMIF(CÁLCULO!$AM$15:$AW$34,\"=\"&CRONO!AC$12,CÁLCULO!$AB$15:$AL$34)/(ORÇAMENTO!$X$15-CÁLCULO.TotalAdmLocal)*CRONO!$E19,0),AC18*$R17),SUMIF(OFFSET($R19,1,0,$Q17-2),($L17+1)&\"$\",OFFSET(AC19,1,0,$Q17-2)))","v":2872.42},{"$f":"IF($Q17=2,IF(AND(ACOMPANHAMENTO=\"PLE\",ISNUMBER($E17)),SUMIF((OFFSET(CÁLCULO!$AM$15:$AW$15,$E17,0,OFFSET(ORÇAMENTO!$D$15,CRONO!$E17,0))),\"=\"&CRONO!AD$12,OFFSET(CÁLCULO!$AB$15:$AL$15,$E17,0,OFFSET(ORÇAMENTO!$D$15,CRONO!$E17,0)))+IF(AND($E19<>\"\",$E19<>0),SUMIF(CÁLCULO!$AM$15:$AW$34,\"=\"&CRONO!AD$12,CÁLCULO!$AB$15:$AL$34)/(ORÇAMENTO!$X$15-CÁLCULO.TotalAdmLocal)*CRONO!$E19,0),AD18*$R17),SUMIF(OFFSET($R19,1,0,$Q17-2),($L17+1)&\"$\",OFFSET(AD19,1,0,$Q17-2)))","v":2872.42},{"$f":"IF($Q17=2,IF(AND(ACOMPANHAMENTO=\"PLE\",ISNUMBER($E17)),SUMIF((OFFSET(CÁLCULO!$AM$15:$AW$15,$E17,0,OFFSET(ORÇAMENTO!$D$15,CRONO!$E17,0))),\"=\"&CRONO!AE$12,OFFSET(CÁLCULO!$AB$15:$AL$15,$E17,0,OFFSET(ORÇAMENTO!$D$15,CRONO!$E17,0)))+IF(AND($E19<>\"\",$E19<>0),SUMIF(CÁLCULO!$AM$15:$AW$34,\"=\"&CRONO!AE$12,CÁLCULO!$AB$15:$AL$34)/(ORÇAMENTO!$X$15-CÁLCULO.TotalAdmLocal)*CRONO!$E19,0),AE18*$R17),SUMIF(OFFSET($R19,1,0,$Q17-2),($L17+1)&\"$\",OFFSET(AE19,1,0,$Q17-2)))","v":0}]
[{"$f":"OFFSET(A20,-3,0)+1","v":3},{"$f":"IF($Q20<>2,0,IF($R20=0,1,IF(E21>0,OFFSET(QCI!$M$13,SUBSTITUTE(E21,\".\",\"\"),0),OFFSET(ORÇAMENTO!$AA$15,CRONO!$E20,0))/$R20))","v":1.0000000000000002},{"$f":"IF($Q20<>2,0,IF($R20=0,1,IF(E21>0,OFFSET(QCI!$N$13,SUBSTITUTE(E21,\".\",\"\"),0),OFFSET(ORÇAMENTO!$AB$15,CRONO!$E20,0))/$R20))","v":0},{"$f":"IF(AND($Q20=2,ACOMPANHAMENTO=\"BM\"),D21,D22/$R20)","v":0},{"$f":"IF(A20<=ORÇAMENTO.MáximoListaCrono,MATCH(A20,ORÇAMENTO.ListaCrono,0),NA())","v":6},{"$f":"IF(AND($E21<>-1,$R20>0),\"F\",\"\")","v":"F"},{"$f":"IF(OR(R20=0,R20=\"\"),\"Linha\",IF(AND(OR(ACOMPANHAMENTO=\"PLE\",$Q20<>2),$E21=0),\"Linha\",1-SUM(T20:AF20)))","v":0},{"$f":"IF($E21=0,OFFSET(ORÇAMENTO!O$15,$E20,0),IF($E21<>-1,OFFSET(QCI!$D$13,$E21,0),\"\"))","v":"1.2."},{"$f":"IF($E21=0,OFFSET(ORÇAMENTO!R$15,$E20,0),IF($E21<>-1,OFFSET(QCI!$G$13,$E21,0),\"\"))","v":"PAVIMENTAÇÃO"},null,null,{"$f":"IF($E21=0,OFFSET(ORÇAMENTO!C$15,$E20,0),1)","v":2},{"$f":"IF($E21=-1,0,IF(M$13<=$L20,IF(ISERROR(MATCH(M$13,OFFSET($L20,1,0,ROW($L$29)-ROW($L20)-1),0)),ROW($L$29)-ROW($L20)-1,MATCH(M$13,OFFSET($L20,1,0,ROW($L$29)-ROW($L20)-1),0)-1),0))","v":8},{"$f":"IF($E21=-1,0,IF(N$13<=$L20,IF(ISERROR(MATCH(N$13,OFFSET($L20,1,0,ROW($L$29)-ROW($L20)-1),0)),ROW($L$29)-ROW($L20)-1,MATCH(N$13,OFFSET($L20,1,0,ROW($L$29)-ROW($L20)-1),0)-1),0))","v":2},{"$f":"IF($E21=-1,0,IF(O$13<=$L20,IF(ISERROR(MATCH(O$13,OFFSET($L20,1,0,ROW($L$29)-ROW($L20)-1),0)),ROW($L$29)-ROW($L20)-1,MATCH(O$13,OFFSET($L20,1,0,ROW($L$29)-ROW($L20)-1),0)-1),0))","v":0},{"$f":"IF($E21=-1,0,IF(P$13<=$L20,IF(ISERROR(MATCH(P$13,OFFSET($L20,1,0,ROW($L$29)-ROW($L20)-1),0)),ROW($L$29)-ROW($L20)-1,MATCH(P$13,OFFSET($L20,1,0,ROW($L$29)-ROW($L20)-1),0)-1),0))","v":0},{"$f":"MIN(OFFSET(L20,0,1,,L20))","v":2},{"$f":"IF($E21=0,OFFSET(ORÇAMENTO!X$15,$E20,0),IF($E21<>-1,OFFSET(QCI!$O$13,$E21,0),\"\"))","v":180910.49},"% Período:",{"$f":"IF(AND($Q20=2,ACOMPANHAMENTO=\"BM\"),T21,T22/$R20)","v":0},0,0,0,0,0,0,0,0,0,0.5,0.5]
[null,null,null,null,{"$f":"IF(ISERROR(E20),IF(1+COUNTIF($L$13:OFFSET(L20,-1,0),1)<=MAX(QCI!$D$13:$D$24),1+COUNTIF($L$13:OFFSET(L20,-1,0),1),-1),0)","v":0},{"$f":"IF(AND($E21<>-1,$R20>0),\"F\",\"\")","v":"F"},{"$f":"IF(OR(R20=0,R20=\"\"),\"vazia\",IF(AND(OR(ACOMPANHAMENTO=\"PLE\",$Q20<>2),$E21=0),\"calculada\",\"-->\"))","v":"-->"},null,{"$f":"IF(AND(G20<>0,ISNUMBER(G20)),\"PREENCHA ESTA LINHA -->\",\"\")","v":""},null,null,null,null,null,null,null,null,null,null,null,null,null,null,null,null,null,null,null,null,0.5,0.5]
[null,null,null,{"$f":"IF($Q20=2,IF(AND(ACOMPANHAMENTO=\"PLE\",ISNUMBER($E20)),SUMIF((OFFSET(CÁLCULO!$AM$15:$AW$15,$E20,0,OFFSET(ORÇAMENTO!$D$15,CRONO!$E20,0))),\"=\"&CRONO!D$12,OFFSET(CÁLCULO!$AB$15:$AL$15,$E20,0,OFFSET(ORÇAMENTO!$D$15,CRONO!$E20,0)))+IF(AND($E22<>\"\",$E22<>0),SUMIF(CÁLCULO!$AM$15:$AW$34,\"=\"&CRONO!D$12,CÁLCULO!$AB$15:$AL$34)/(ORÇAMENTO!$X$15-CÁLCULO.TotalAdmLocal)*CRONO!$E22,0),D21*$R20),SUMIF(OFFSET($R22,1,0,$Q20-2),($L20+1)&\"$\",OFFSET(D22,1,0,$Q20-2)))","v":0},{"$f":"IF(OR($Q20<>2,AUTOEVENTO<>\"manual\",$E21>0),\"\",SUMIF(OFFSET(CÁLCULO!$M$15,CRONO!$E20,0,OFFSET(ORÇAMENTO!$D$15,CRONO!$E20,0)),1,OFFSET(ORÇAMENTO!$X$15,CRONO!$E20,0,OFFSET(ORÇAMENTO!$D$15,CRONO!$E20,0))))","v":""},null,null,null,null,null,null,null,null,null,null,null,null,{"$f":"L20&\"$\"","v":"2$"},null,{"$f":"IF($Q20=2,IF(AND(ACOMPANHAMENTO=\"PLE\",ISNUMBER($E20)),SUMIF((OFFSET(CÁLCULO!$AM$15:$AW$15,$E20,0,OFFSET(ORÇAMENTO!$D$15,CRONO!$E20,0))),\"<=\"&CRONO!T$12,OFFSET(CÁLCULO!$AB$15:$AL$15,$E20,0,OFFSET(ORÇAMENTO!$D$15,CRONO!$E20,0)))+IF(AND($E22<>\"\",$E22<>0),SUMIF(CÁLCULO!$AM$15:$AW$34,\"<=\"&CRONO!T$12,CÁLCULO!$AB$15:$AL$34)/(ORÇAMENTO!$X$15-CÁLCULO.TotalAdmLocal)*CRONO!$E22,0),T21*$R20),SUMIF(OFFSET($R22,1,0,$Q20-2),($L20+1)&\"$\",OFFSET(T22,1,0,$Q20-2)))","v":0},{"$f":"IF($Q20=2,IF(AND(ACOMPANHAMENTO=\"PLE\",ISNUMBER($E20)),SUMIF((OFFSET(CÁLCULO!$AM$15:$AW$15,$E20,0,OFFSET(ORÇAMENTO!$D$15,CRONO!$E20,0))),\"=\"&CRONO!U$12,OFFSET(CÁLCULO!$AB$15:$AL$15,$E20,0,OFFSET(ORÇAMENTO!$D$15,CRONO!$E20,0)))+IF(AND($E22<>\"\",$E22<>0),SUMIF(CÁLCULO!$AM$15:$AW$34,\"=\"&CRONO!U$12,CÁLCULO!$AB$15:$AL$34)/(ORÇAMENTO!$X$15-CÁLCULO.TotalAdmLocal)*CRONO!$E22,0),U21*$R20),SUMIF(OFFSET($R22,1,0,$Q20-2),($L20+1)&\"$\",OFFSET(U22,1,0,$Q20-2)))","v":0},{"$f":"IF($Q20=2,IF(AND(ACOMPANHAMENTO=\"PLE\",ISNUMBER($E20)),SUMIF((OFFSET(CÁLCULO!$AM$15:$AW$15,$E20,0,OFFSET(ORÇAMENTO!$D$15,CRONO!$E20,0))),\"=\"&CRONO!V$12,OFFSET(CÁLCULO!$AB$15:$AL$15,$E20,0,OFFSET(ORÇAMENTO!$D$15,CRONO!$E20,0)))+IF(AND($E22<>\"\",$E22<>0),SUMIF(CÁLCULO!$AM$15:$AW$34,\"=\"&CRONO!V$12,CÁLCULO!$AB$15:$AL$34)/(ORÇAMENTO!$X$15-CÁLCULO.TotalAdmLocal)*CRONO!$E22,0),V21*$R20),SUMIF(OFFSET($R22,1,0,$Q20-2),($L20+1)&\"$\",OFFSET(V22,1,0,$Q20-2)))","v":0},{"$f":"IF($Q20=2,IF(AND(ACOMPANHAMENTO=\"PLE\",ISNUMBER($E20)),SUMIF((OFFSET(CÁLCULO!$AM$15:$AW$15,$E20,0,OFFSET(ORÇAMENTO!$D$15,CRONO!$E20,0))),\"=\"&CRONO!W$12,OFFSET(CÁLCULO!$AB$15:$AL$15,$E20,0,OFFSET(ORÇAMENTO!$D$15,CRONO!$E20,0)))+IF(AND($E22<>\"\",$E22<>0),SUMIF(CÁLCULO!$AM$15:$AW$34,\"=\"&CRONO!W$12,CÁLCULO!$AB$15:$AL$34)/(ORÇAMENTO!$X$15-CÁLCULO.TotalAdmLocal)*CRONO!$E22,0),W21*$R20),SUMIF(OFFSET($R22,1,0,$Q20-2),($L20+1)&\"$\",OFFSET(W22,1,0,$Q20-2)))","v":0},{"$f":"IF($Q20=2,IF(AND(ACOMPANHAMENTO=\"PLE\",ISNUMBER($E20)),SUMIF((OFFSET(CÁLCULO!$AM$15:$AW$15,$E20,0,OFFSET(ORÇAMENTO!$D$15,CRONO!$E20,0))),\"=\"&CRONO!X$12,OFFSET(CÁLCULO!$AB$15:$AL$15,$E20,0,OFFSET(ORÇAMENTO!$D$15,CRONO!$E20,0)))+IF(AND($E22<>\"\",$E22<>0),SUMIF(CÁLCULO!$AM$15:$AW$34,\"=\"&CRONO!X$12,CÁLCULO!$AB$15:$AL$34)/(ORÇAMENTO!$X$15-CÁLCULO.TotalAdmLocal)*CRONO!$E22,0),X21*$R20),SUMIF(OFFSET($R22,1,0,$Q20-2),($L20+1)&\"$\",OFFSET(X22,1,0,$Q20-2)))","v":0},{"$f":"IF($Q20=2,IF(AND(ACOMPANHAMENTO=\"PLE\",ISNUMBER($E20)),SUMIF((OFFSET(CÁLCULO!$AM$15:$AW$15,$E20,0,OFFSET(ORÇAMENTO!$D$15,CRONO!$E20,0))),\"=\"&CRONO!Y$12,OFFSET(CÁLCULO!$AB$15:$AL$15,$E20,0,OFFSET(ORÇAMENTO!$D$15,CRONO!$E20,0)))+IF(AND($E22<>\"\",$E22<>0),SUMIF(CÁLCULO!$AM$15:$AW$34,\"=\"&CRONO!Y$12,CÁLCULO!$AB$15:$AL$34)/(ORÇAMENTO!$X$15-CÁLCULO.TotalAdmLocal)*CRONO!$E22,0),Y21*$R20),SUMIF(OFFSET($R22,1,0,$Q20-2),($L20+1)&\"$\",OFFSET(Y22,1,0,$Q20-2)))","v":0},{"$f":"IF($Q20=2,IF(AND(ACOMPANHAMENTO=\"PLE\",ISNUMBER($E20)),SUMIF((OFFSET(CÁLCULO!$AM$15:$AW$15,$E20,0,OFFSET(ORÇAMENTO!$D$15,CRONO!$E20,0))),\"=\"&CRONO!Z$12,OFFSET(CÁLCULO!$AB$15:$AL$15,$E20,0,OFFSET(ORÇAMENTO!$D$15,CRONO!$E20,0)))+IF(AND($E22<>\"\",$E22<>0),SUMIF(CÁLCULO!$AM$15:$AW$34,\"=\"&CRONO!Z$12,CÁLCULO!$AB$15:$AL$34)/(ORÇAMENTO!$X$15-CÁLCULO.TotalAdmLocal)*CRONO!$E22,0),Z21*$R20),SUMIF(OFFSET($R22,1,0,$Q20-2),($L20+1)&\"$\",OFFSET(Z22,1,0,$Q20-2)))","v":0},{"$f":"IF($Q20=2,IF(AND(ACOMPANHAMENTO=\"PLE\",ISNUMBER($E20)),SUMIF((OFFSET(CÁLCULO!$AM$15:$AW$15,$E20,0,OFFSET(ORÇAMENTO!$D$15,CRONO!$E20,0))),\"=\"&CRONO!AA$12,OFFSET(CÁLCULO!$AB$15:$AL$15,$E20,0,OFFSET(ORÇAMENTO!$D$15,CRONO!$E20,0)))+IF(AND($E22<>\"\",$E22<>0),SUMIF(CÁLCULO!$AM$15:$AW$34,\"=\"&CRONO!AA$12,CÁLCULO!$AB$15:$AL$34)/(ORÇAMENTO!$X$15-CÁLCULO.TotalAdmLocal)*CRONO!$E22,0),AA21*$R20),SUMIF(OFFSET($R22,1,0,$Q20-2),($L20+1)&\"$\",OFFSET(AA22,1,0,$Q20-2)))","v":0},{"$f":"IF($Q20=2,IF(AND(ACOMPANHAMENTO=\"PLE\",ISNUMBER($E20)),SUMIF((OFFSET(CÁLCULO!$AM$15:$AW$15,$E20,0,OFFSET(ORÇAMENTO!$D$15,CRONO!$E20,0))),\"=\"&CRONO!AB$12,OFFSET(CÁLCULO!$AB$15:$AL$15,$E20,0,OFFSET(ORÇAMENTO!$D$15,CRONO!$E20,0)))+IF(AND($E22<>\"\",$E22<>0),SUMIF(CÁLCULO!$AM$15:$AW$34,\"=\"&CRONO!AB$12,CÁLCULO!$AB$15:$AL$34)/(ORÇAMENTO!$X$15-CÁLCULO.TotalAdmLocal)*CRONO!$E22,0),AB21*$R20),SUMIF(OFFSET($R22,1,0,$Q20-2),($L20+1)&\"$\",OFFSET(AB22,1,0,$Q20-2)))","v":0},{"$f":"IF($Q20=2,IF(AND(ACOMPANHAMENTO=\"PLE\",ISNUMBER($E20)),SUMIF((OFFSET(CÁLCULO!$AM$15:$AW$15,$E20,0,OFFSET(ORÇAMENTO!$D$15,CRONO!$E20,0))),\"=\"&CRONO!AC$12,OFFSET(CÁLCULO!$AB$15:$AL$15,$E20,0,OFFSET(ORÇAMENTO!$D$15,CRONO!$E20,0)))+IF(AND($E22<>\"\",$E22<>0),SUMIF(CÁLCULO!$AM$15:$AW$34,\"=\"&CRONO!AC$12,CÁLCULO!$AB$15:$AL$34)/(ORÇAMENTO!$X$15-CÁLCULO.TotalAdmLocal)*CRONO!$E22,0),AC21*$R20),SUMIF(OFFSET($R22,1,0,$Q20-2),($L20+1)&\"$\",OFFSET(AC22,1,0,$Q20-2)))","v":0},{"$f":"IF($Q20=2,IF(AND(ACOMPANHAMENTO=\"PLE\",ISNUMBER($E20)),SUMIF((OFFSET(CÁLCULO!$AM$15:$AW$15,$E20,0,OFFSET(ORÇAMENTO!$D$15,CRONO!$E20,0))),\"=\"&CRONO!AD$12,OFFSET(CÁLCULO!$AB$15:$AL$15,$E20,0,OFFSET(ORÇAMENTO!$D$15,CRONO!$E20,0)))+IF(AND($E22<>\"\",$E22<>0),SUMIF(CÁLCULO!$AM$15:$AW$34,\"=\"&CRONO!AD$12,CÁLCULO!$AB$15:$AL$34)/(ORÇAMENTO!$X$15-CÁLCULO.TotalAdmLocal)*CRONO!$E22,0),AD21*$R20),SUMIF(OFFSET($R22,1,0,$Q20-2),($L20+1)&\"$\",OFFSET(AD22,1,0,$Q20-2)))","v":90455.244999999995},{"$f":"IF($Q20=2,IF(AND(ACOMPANHAMENTO=\"PLE\",ISNUMBER($E20)),SUMIF((OFFSET(CÁLCULO!$AM$15:$AW$15,$E20,0,OFFSET(ORÇAMENTO!$D$15,CRONO!$E20,0))),\"=\"&CRONO!AE$12,OFFSET(CÁLCULO!$AB$15:$AL$15,$E20,0,OFFSET(ORÇAMENTO!$D$15,CRONO!$E20,0)))+IF(AND($E22<>\"\",$E22<>0),SUMIF(CÁLCULO!$AM$15:$AW$34,\"=\"&CRONO!AE$12,CÁLCULO!$AB$15:$AL$34)/(ORÇAMENTO!$X$15-CÁLCULO.TotalAdmLocal)*CRONO!$E22,0),AE21*$R20),SUMIF(OFFSET($R22,1,0,$Q20-2),($L20+1)&\"$\",OFFSET(AE22,1,0,$Q20-2)))","v":90455.244999999995}]
[{"$f":"OFFSET(A23,-3,0)+1","v":4},{"$f":"IF($Q23<>2,0,IF($R23=0,1,IF(E24>0,OFFSET(QCI!$M$13,SUBSTITUTE(E24,\".\",\"\"),0),OFFSET(ORÇAMENTO!$AA$15,CRONO!$E23,0))/$R23))","v":1},{"$f":"IF($Q23<>2,0,IF($R23=0,1,IF(E24>0,OFFSET(QCI!$N$13,SUBSTITUTE(E24,\".\",\"\"),0),OFFSET(ORÇAMENTO!$AB$15,CRONO!$E23,0))/$R23))","v":0},{"$f":"IF(AND($Q23=2,ACOMPANHAMENTO=\"BM\"),D24,D25/$R23)","v":0},{"$f":"IF(A23<=ORÇAMENTO.MáximoListaCrono,MATCH(A23,ORÇAMENTO.ListaCrono,0),NA())","v":13},{"$f":"IF(AND($E24<>-1,$R23>0),\"F\",\"\")","v":"F"},{"$f":"IF(OR(R23=0,R23=\"\"),\"Linha\",IF(AND(OR(ACOMPANHAMENTO=\"PLE\",$Q23<>2),$E24=0),\"Linha\",1-SUM(T23:AF23)))","v":0},{"$f":"IF($E24=0,OFFSET(ORÇAMENTO!O$15,$E23,0),IF($E24<>-1,OFFSET(QCI!$D$13,$E24,0),\"\"))","v":"1.3."},{"$f":"IF($E24=0,OFFSET(ORÇAMENTO!R$15,$E23,0),IF($E24<>-1,OFFSET(QCI!$G$13,$E24,0),\"\"))","v":"PAISAGISMO"},null,null,{"$f":"IF($E24=0,OFFSET(ORÇAMENTO!C$15,$E23,0),1)","v":2},{"$f":"IF($E24=-1,0,IF(M$13<=$L23,IF(ISERROR(MATCH(M$13,OFFSET($L23,1,0,ROW($L$29)-ROW($L23)-1),0)),ROW($L$29)-ROW($L23)-1,MATCH(M$13,OFFSET($L23,1,0,ROW($L$29)-ROW($L23)-1),0)-1),0))","v":5},{"$f":"IF($E24=-1,0,IF(N$13<=$L23,IF(ISERROR(MATCH(N$13,OFFSET($L23,1,0,ROW($L$29)-ROW($L23)-1),0)),ROW($L$29)-ROW($L23)-1,MATCH(N$13,OFFSET($L23,1,0,ROW($L$29)-ROW($L23)-1),0)-1),0))","v":2},{"$f":"IF($E24=-1,0,IF(O$13<=$L23,IF(ISERROR(MATCH(O$13,OFFSET($L23,1,0,ROW($L$29)-ROW($L23)-1),0)),ROW($L$29)-ROW($L23)-1,MATCH(O$13,OFFSET($L23,1,0,ROW($L$29)-ROW($L23)-1),0)-1),0))","v":0},{"$f":"IF($E24=-1,0,IF(P$13<=$L23,IF(ISERROR(MATCH(P$13,OFFSET($L23,1,0,ROW($L$29)-ROW($L23)-1),0)),ROW($L$29)-ROW($L23)-1,MATCH(P$13,OFFSET($L23,1,0,ROW($L$29)-ROW($L23)-1),0)-1),0))","v":0},{"$f":"MIN(OFFSET(L23,0,1,,L23))","v":2},{"$f":"IF($E24=0,OFFSET(ORÇAMENTO!X$15,$E23,0),IF($E24<>-1,OFFSET(QCI!$O$13,$E24,0),\"\"))","v":1827.65},"% Período:",{"$f":"IF(AND($Q23=2,ACOMPANHAMENTO=\"BM\"),T24,T25/$R23)","v":0},0,0,0,0,0,0,0,0,0,0,1]
[null,null,null,null,{"$f":"IF(ISERROR(E23),IF(1+COUNTIF($L$13:OFFSET(L23,-1,0),1)<=MAX(QCI!$D$13:$D$24),1+COUNTIF($L$13:OFFSET(L23,-1,0),1),-1),0)","v":0},{"$f":"IF(AND($E24<>-1,$R23>0),\"F\",\"\")","v":"F"},{"$f":"IF(OR(R23=0,R23=\"\"),\"vazia\",IF(AND(OR(ACOMPANHAMENTO=\"PLE\",$Q23<>2),$E24=0),\"calculada\",\"-->\"))","v":"-->"},null,{"$f":"IF(AND(G23<>0,ISNUMBER(G23)),\"PREENCHA ESTA LINHA -->\",\"\")","v":""},null,null,null,null,null,null,null,null,null,null,null,null,null,null,null,null,null,null,null,null,null,1]
[null,null,null,{"$f":"IF($Q23=2,IF(AND(ACOMPANHAMENTO=\"PLE\",ISNUMBER($E23)),SUMIF((OFFSET(CÁLCULO!$AM$15:$AW$15,$E23,0,OFFSET(ORÇAMENTO!$D$15,CRONO!$E23,0))),\"=\"&CRONO!D$12,OFFSET(CÁLCULO!$AB$15:$AL$15,$E23,0,OFFSET(ORÇAMENTO!$D$15,CRONO!$E23,0)))+IF(AND($E25<>\"\",$E25<>0),SUMIF(CÁLCULO!$AM$15:$AW$34,\"=\"&CRONO!D$12,CÁLCULO!$AB$15:$AL$34)/(ORÇAMENTO!$X$15-CÁLCULO.TotalAdmLocal)*CRONO!$E25,0),D24*$R23),SUMIF(OFFSET($R25,1,0,$Q23-2),($L23+1)&\"$\",OFFSET(D25,1,0,$Q23-2)))","v":0},{"$f":"IF(OR($Q23<>2,AUTOEVENTO<>\"manual\",$E24>0),\"\",SUMIF(OFFSET(CÁLCULO!$M$15,CRONO!$E23,0,OFFSET(ORÇAMENTO!$D$15,CRONO!$E23,0)),1,OFFSET(ORÇAMENTO!$X$15,CRONO!$E23,0,OFFSET(ORÇAMENTO!$D$15,CRONO!$E23,0))))","v":""},null,null,null,null,null,null,null,null,null,null,null,null,{"$f":"L23&\"$\"","v":"2$"},null,{"$f":"IF($Q23=2,IF(AND(ACOMPANHAMENTO=\"PLE\",ISNUMBER($E23)),SUMIF((OFFSET(CÁLCULO!$AM$15:$AW$15,$E23,0,OFFSET(ORÇAMENTO!$D$15,CRONO!$E23,0))),\"<=\"&CRONO!T$12,OFFSET(CÁLCULO!$AB$15:$AL$15,$E23,0,OFFSET(ORÇAMENTO!$D$15,CRONO!$E23,0)))+IF(AND($E25<>\"\",$E25<>0),SUMIF(CÁLCULO!$AM$15:$AW$34,\"<=\"&CRONO!T$12,CÁLCULO!$AB$15:$AL$34)/(ORÇAMENTO!$X$15-CÁLCULO.TotalAdmLocal)*CRONO!$E25,0),T24*$R23),SUMIF(OFFSET($R25,1,0,$Q23-2),($L23+1)&\"$\",OFFSET(T25,1,0,$Q23-2)))","v":0},{"$f":"IF($Q23=2,IF(AND(ACOMPANHAMENTO=\"PLE\",ISNUMBER($E23)),SUMIF((OFFSET(CÁLCULO!$AM$15:$AW$15,$E23,0,OFFSET(ORÇAMENTO!$D$15,CRONO!$E23,0))),\"=\"&CRONO!U$12,OFFSET(CÁLCULO!$AB$15:$AL$15,$E23,0,OFFSET(ORÇAMENTO!$D$15,CRONO!$E23,0)))+IF(AND($E25<>\"\",$E25<>0),SUMIF(CÁLCULO!$AM$15:$AW$34,\"=\"&CRONO!U$12,CÁLCULO!$AB$15:$AL$34)/(ORÇAMENTO!$X$15-CÁLCULO.TotalAdmLocal)*CRONO!$E25,0),U24*$R23),SUMIF(OFFSET($R25,1,0,$Q23-2),($L23+1)&\"$\",OFFSET(U25,1,0,$Q23-2)))","v":0},{"$f":"IF($Q23=2,IF(AND(ACOMPANHAMENTO=\"PLE\",ISNUMBER($E23)),SUMIF((OFFSET(CÁLCULO!$AM$15:$AW$15,$E23,0,OFFSET(ORÇAMENTO!$D$15,CRONO!$E23,0))),\"=\"&CRONO!V$12,OFFSET(CÁLCULO!$AB$15:$AL$15,$E23,0,OFFSET(ORÇAMENTO!$D$15,CRONO!$E23,0)))+IF(AND($E25<>\"\",$E25<>0),SUMIF(CÁLCULO!$AM$15:$AW$34,\"=\"&CRONO!V$12,CÁLCULO!$AB$15:$AL$34)/(ORÇAMENTO!$X$15-CÁLCULO.TotalAdmLocal)*CRONO!$E25,0),V24*$R23),SUMIF(OFFSET($R25,1,0,$Q23-2),($L23+1)&\"$\",OFFSET(V25,1,0,$Q23-2)))","v":0},{"$f":"IF($Q23=2,IF(AND(ACOMPANHAMENTO=\"PLE\",ISNUMBER($E23)),SUMIF((OFFSET(CÁLCULO!$AM$15:$AW$15,$E23,0,OFFSET(ORÇAMENTO!$D$15,CRONO!$E23,0))),\"=\"&CRONO!W$12,OFFSET(CÁLCULO!$AB$15:$AL$15,$E23,0,OFFSET(ORÇAMENTO!$D$15,CRONO!$E23,0)))+IF(AND($E25<>\"\",$E25<>0),SUMIF(CÁLCULO!$AM$15:$AW$34,\"=\"&CRONO!W$12,CÁLCULO!$AB$15:$AL$34)/(ORÇAMENTO!$X$15-CÁLCULO.TotalAdmLocal)*CRONO!$E25,0),W24*$R23),SUMIF(OFFSET($R25,1,0,$Q23-2),($L23+1)&\"$\",OFFSET(W25,1,0,$Q23-2)))","v":0},{"$f":"IF($Q23=2,IF(AND(ACOMPANHAMENTO=\"PLE\",ISNUMBER($E23)),SUMIF((OFFSET(CÁLCULO!$AM$15:$AW$15,$E23,0,OFFSET(ORÇAMENTO!$D$15,CRONO!$E23,0))),\"=\"&CRONO!X$12,OFFSET(CÁLCULO!$AB$15:$AL$15,$E23,0,OFFSET(ORÇAMENTO!$D$15,CRONO!$E23,0)))+IF(AND($E25<>\"\",$E25<>0),SUMIF(CÁLCULO!$AM$15:$AW$34,\"=\"&CRONO!X$12,CÁLCULO!$AB$15:$AL$34)/(ORÇAMENTO!$X$15-CÁLCULO.TotalAdmLocal)*CRONO!$E25,0),X24*$R23),SUMIF(OFFSET($R25,1,0,$Q23-2),($L23+1)&\"$\",OFFSET(X25,1,0,$Q23-2)))","v":0},{"$f":"IF($Q23=2,IF(AND(ACOMPANHAMENTO=\"PLE\",ISNUMBER($E23)),SUMIF((OFFSET(CÁLCULO!$AM$15:$AW$15,$E23,0,OFFSET(ORÇAMENTO!$D$15,CRONO!$E23,0))),\"=\"&CRONO!Y$12,OFFSET(CÁLCULO!$AB$15:$AL$15,$E23,0,OFFSET(ORÇAMENTO!$D$15,CRONO!$E23,0)))+IF(AND($E25<>\"\",$E25<>0),SUMIF(CÁLCULO!$AM$15:$AW$34,\"=\"&CRONO!Y$12,CÁLCULO!$AB$15:$AL$34)/(ORÇAMENTO!$X$15-CÁLCULO.TotalAdmLocal)*CRONO!$E25,0),Y24*$R23),SUMIF(OFFSET($R25,1,0,$Q23-2),($L23+1)&\"$\",OFFSET(Y25,1,0,$Q23-2)))","v":0},{"$f":"IF($Q23=2,IF(AND(ACOMPANHAMENTO=\"PLE\",ISNUMBER($E23)),SUMIF((OFFSET(CÁLCULO!$AM$15:$AW$15,$E23,0,OFFSET(ORÇAMENTO!$D$15,CRONO!$E23,0))),\"=\"&CRONO!Z$12,OFFSET(CÁLCULO!$AB$15:$AL$15,$E23,0,OFFSET(ORÇAMENTO!$D$15,CRONO!$E23,0)))+IF(AND($E25<>\"\",$E25<>0),SUMIF(CÁLCULO!$AM$15:$AW$34,\"=\"&CRONO!Z$12,CÁLCULO!$AB$15:$AL$34)/(ORÇAMENTO!$X$15-CÁLCULO.TotalAdmLocal)*CRONO!$E25,0),Z24*$R23),SUMIF(OFFSET($R25,1,0,$Q23-2),($L23+1)&\"$\",OFFSET(Z25,1,0,$Q23-2)))","v":0},{"$f":"IF($Q23=2,IF(AND(ACOMPANHAMENTO=\"PLE\",ISNUMBER($E23)),SUMIF((OFFSET(CÁLCULO!$AM$15:$AW$15,$E23,0,OFFSET(ORÇAMENTO!$D$15,CRONO!$E23,0))),\"=\"&CRONO!AA$12,OFFSET(CÁLCULO!$AB$15:$AL$15,$E23,0,OFFSET(ORÇAMENTO!$D$15,CRONO!$E23,0)))+IF(AND($E25<>\"\",$E25<>0),SUMIF(CÁLCULO!$AM$15:$AW$34,\"=\"&CRONO!AA$12,CÁLCULO!$AB$15:$AL$34)/(ORÇAMENTO!$X$15-CÁLCULO.TotalAdmLocal)*CRONO!$E25,0),AA24*$R23),SUMIF(OFFSET($R25,1,0,$Q23-2),($L23+1)&\"$\",OFFSET(AA25,1,0,$Q23-2)))","v":0},{"$f":"IF($Q23=2,IF(AND(ACOMPANHAMENTO=\"PLE\",ISNUMBER($E23)),SUMIF((OFFSET(CÁLCULO!$AM$15:$AW$15,$E23,0,OFFSET(ORÇAMENTO!$D$15,CRONO!$E23,0))),\"=\"&CRONO!AB$12,OFFSET(CÁLCULO!$AB$15:$AL$15,$E23,0,OFFSET(ORÇAMENTO!$D$15,CRONO!$E23,0)))+IF(AND($E25<>\"\",$E25<>0),SUMIF(CÁLCULO!$AM$15:$AW$34,\"=\"&CRONO!AB$12,CÁLCULO!$AB$15:$AL$34)/(ORÇAMENTO!$X$15-CÁLCULO.TotalAdmLocal)*CRONO!$E25,0),AB24*$R23),SUMIF(OFFSET($R25,1,0,$Q23-2),($L23+1)&\"$\",OFFSET(AB25,1,0,$Q23-2)))","v":0},{"$f":"IF($Q23=2,IF(AND(ACOMPANHAMENTO=\"PLE\",ISNUMBER($E23)),SUMIF((OFFSET(CÁLCULO!$AM$15:$AW$15,$E23,0,OFFSET(ORÇAMENTO!$D$15,CRONO!$E23,0))),\"=\"&CRONO!AC$12,OFFSET(CÁLCULO!$AB$15:$AL$15,$E23,0,OFFSET(ORÇAMENTO!$D$15,CRONO!$E23,0)))+IF(AND($E25<>\"\",$E25<>0),SUMIF(CÁLCULO!$AM$15:$AW$34,\"=\"&CRONO!AC$12,CÁLCULO!$AB$15:$AL$34)/(ORÇAMENTO!$X$15-CÁLCULO.TotalAdmLocal)*CRONO!$E25,0),AC24*$R23),SUMIF(OFFSET($R25,1,0,$Q23-2),($L23+1)&\"$\",OFFSET(AC25,1,0,$Q23-2)))","v":0},{"$f":"IF($Q23=2,IF(AND(ACOMPANHAMENTO=\"PLE\",ISNUMBER($E23)),SUMIF((OFFSET(CÁLCULO!$AM$15:$AW$15,$E23,0,OFFSET(ORÇAMENTO!$D$15,CRONO!$E23,0))),\"=\"&CRONO!AD$12,OFFSET(CÁLCULO!$AB$15:$AL$15,$E23,0,OFFSET(ORÇAMENTO!$D$15,CRONO!$E23,0)))+IF(AND($E25<>\"\",$E25<>0),SUMIF(CÁLCULO!$AM$15:$AW$34,\"=\"&CRONO!AD$12,CÁLCULO!$AB$15:$AL$34)/(ORÇAMENTO!$X$15-CÁLCULO.TotalAdmLocal)*CRONO!$E25,0),AD24*$R23),SUMIF(OFFSET($R25,1,0,$Q23-2),($L23+1)&\"$\",OFFSET(AD25,1,0,$Q23-2)))","v":0},{"$f":"IF($Q23=2,IF(AND(ACOMPANHAMENTO=\"PLE\",ISNUMBER($E23)),SUMIF((OFFSET(CÁLCULO!$AM$15:$AW$15,$E23,0,OFFSET(ORÇAMENTO!$D$15,CRONO!$E23,0))),\"=\"&CRONO!AE$12,OFFSET(CÁLCULO!$AB$15:$AL$15,$E23,0,OFFSET(ORÇAMENTO!$D$15,CRONO!$E23,0)))+IF(AND($E25<>\"\",$E25<>0),SUMIF(CÁLCULO!$AM$15:$AW$34,\"=\"&CRONO!AE$12,CÁLCULO!$AB$15:$AL$34)/(ORÇAMENTO!$X$15-CÁLCULO.TotalAdmLocal)*CRONO!$E25,0),AE24*$R23),SUMIF(OFFSET($R25,1,0,$Q23-2),($L23+1)&\"$\",OFFSET(AE25,1,0,$Q23-2)))","v":1827.65}]
[{"$f":"OFFSET(A26,-3,0)+1","v":5},{"$f":"IF($Q26<>2,0,IF($R26=0,1,IF(E27>0,OFFSET(QCI!$M$13,SUBSTITUTE(E27,\".\",\"\"),0),OFFSET(ORÇAMENTO!$AA$15,CRONO!$E26,0))/$R26))","v":1},{"$f":"IF($Q26<>2,0,IF($R26=0,1,IF(E27>0,OFFSET(QCI!$N$13,SUBSTITUTE(E27,\".\",\"\"),0),OFFSET(ORÇAMENTO!$AB$15,CRONO!$E26,0))/$R26))","v":0},{"$f":"IF(AND($Q26=2,ACOMPANHAMENTO=\"BM\"),D27,D28/$R26)","v":0},{"$f":"IF(A26<=ORÇAMENTO.MáximoListaCrono,MATCH(A26,ORÇAMENTO.ListaCrono,0),NA())","v":15},{"$f":"IF(AND($E27<>-1,$R26>0),\"F\",\"\")","v":"F"},{"$f":"IF(OR(R26=0,R26=\"\"),\"Linha\",IF(AND(OR(ACOMPANHAMENTO=\"PLE\",$Q26<>2),$E27=0),\"Linha\",1-SUM(T26:AF26)))","v":0},{"$f":"IF($E27=0,OFFSET(ORÇAMENTO!O$15,$E26,0),IF($E27<>-1,OFFSET(QCI!$D$13,$E27,0),\"\"))","v":"1.4."},{"$f":"IF($E27=0,OFFSET(ORÇAMENTO!R$15,$E26,0),IF($E27<>-1,OFFSET(QCI!$G$13,$E27,0),\"\"))","v":"LIMPEZA DA OBRA"},null,null,{"$f":"IF($E27=0,OFFSET(ORÇAMENTO!C$15,$E26,0),1)","v":2},{"$f":"IF($E27=-1,0,IF(M$13<=$L26,IF(ISERROR(MATCH(M$13,OFFSET($L26,1,0,ROW($L$29)-ROW($L26)-1),0)),ROW($L$29)-ROW($L26)-1,MATCH(M$13,OFFSET($L26,1,0,ROW($L$29)-ROW($L26)-1),0)-1),0))","v":2},{"$f":"IF($E27=-1,0,IF(N$13<=$L26,IF(ISERROR(MATCH(N$13,OFFSET($L26,1,0,ROW($L$29)-ROW($L26)-1),0)),ROW($L$29)-ROW($L26)-1,MATCH(N$13,OFFSET($L26,1,0,ROW($L$29)-ROW($L26)-1),0)-1),0))","v":2},{"$f":"IF($E27=-1,0,IF(O$13<=$L26,IF(ISERROR(MATCH(O$13,OFFSET($L26,1,0,ROW($L$29)-ROW($L26)-1),0)),ROW($L$29)-ROW($L26)-1,MATCH(O$13,OFFSET($L26,1,0,ROW($L$29)-ROW($L26)-1),0)-1),0))","v":0},{"$f":"IF($E27=-1,0,IF(P$13<=$L26,IF(ISERROR(MATCH(P$13,OFFSET($L26,1,0,ROW($L$29)-ROW($L26)-1),0)),ROW($L$29)-ROW($L26)-1,MATCH(P$13,OFFSET($L26,1,0,ROW($L$29)-ROW($L26)-1),0)-1),0))","v":0},{"$f":"MIN(OFFSET(L26,0,1,,L26))","v":2},{"$f":"IF($E27=0,OFFSET(ORÇAMENTO!X$15,$E26,0),IF($E27<>-1,OFFSET(QCI!$O$13,$E27,0),\"\"))","v":7924.5},"% Período:",{"$f":"IF(AND($Q26=2,ACOMPANHAMENTO=\"BM\"),T27,T28/$R26)","v":0},0,0,0,0,0,0,0,0,0,0,1]
[null,null,null,null,{"$f":"IF(ISERROR(E26),IF(1+COUNTIF($L$13:OFFSET(L26,-1,0),1)<=MAX(QCI!$D$13:$D$24),1+COUNTIF($L$13:OFFSET(L26,-1,0),1),-1),0)","v":0},{"$f":"IF(AND($E27<>-1,$R26>0),\"F\",\"\")","v":"F"},{"$f":"IF(OR(R26=0,R26=\"\"),\"vazia\",IF(AND(OR(ACOMPANHAMENTO=\"PLE\",$Q26<>2),$E27=0),\"calculada\",\"-->\"))","v":"-->"},null,{"$f":"IF(AND(G26<>0,ISNUMBER(G26)),\"PREENCHA ESTA LINHA -->\",\"\")","v":""},null,null,null,null,null,null,null,null,null,null,null,null,null,null,null,null,null,null,null,null,null,1]
[null,null,null,{"$f":"IF($Q26=2,IF(AND(ACOMPANHAMENTO=\"PLE\",ISNUMBER($E26)),SUMIF((OFFSET(CÁLCULO!$AM$15:$AW$15,$E26,0,OFFSET(ORÇAMENTO!$D$15,CRONO!$E26,0))),\"=\"&CRONO!D$12,OFFSET(CÁLCULO!$AB$15:$AL$15,$E26,0,OFFSET(ORÇAMENTO!$D$15,CRONO!$E26,0)))+IF(AND($E28<>\"\",$E28<>0),SUMIF(CÁLCULO!$AM$15:$AW$34,\"=\"&CRONO!D$12,CÁLCULO!$AB$15:$AL$34)/(ORÇAMENTO!$X$15-CÁLCULO.TotalAdmLocal)*CRONO!$E28,0),D27*$R26),SUMIF(OFFSET($R28,1,0,$Q26-2),($L26+1)&\"$\",OFFSET(D28,1,0,$Q26-2)))","v":0},{"$f":"IF(OR($Q26<>2,AUTOEVENTO<>\"manual\",$E27>0),\"\",SUMIF(OFFSET(CÁLCULO!$M$15,CRONO!$E26,0,OFFSET(ORÇAMENTO!$D$15,CRONO!$E26,0)),1,OFFSET(ORÇAMENTO!$X$15,CRONO!$E26,0,OFFSET(ORÇAMENTO!$D$15,CRONO!$E26,0))))","v":""},null,null,null,null,null,null,null,null,null,null,null,null,{"$f":"L26&\"$\"","v":"2$"},null,{"$f":"IF($Q26=2,IF(AND(ACOMPANHAMENTO=\"PLE\",ISNUMBER($E26)),SUMIF((OFFSET(CÁLCULO!$AM$15:$AW$15,$E26,0,OFFSET(ORÇAMENTO!$D$15,CRONO!$E26,0))),\"<=\"&CRONO!T$12,OFFSET(CÁLCULO!$AB$15:$AL$15,$E26,0,OFFSET(ORÇAMENTO!$D$15,CRONO!$E26,0)))+IF(AND($E28<>\"\",$E28<>0),SUMIF(CÁLCULO!$AM$15:$AW$34,\"<=\"&CRONO!T$12,CÁLCULO!$AB$15:$AL$34)/(ORÇAMENTO!$X$15-CÁLCULO.TotalAdmLocal)*CRONO!$E28,0),T27*$R26),SUMIF(OFFSET($R28,1,0,$Q26-2),($L26+1)&\"$\",OFFSET(T28,1,0,$Q26-2)))","v":0},{"$f":"IF($Q26=2,IF(AND(ACOMPANHAMENTO=\"PLE\",ISNUMBER($E26)),SUMIF((OFFSET(CÁLCULO!$AM$15:$AW$15,$E26,0,OFFSET(ORÇAMENTO!$D$15,CRONO!$E26,0))),\"=\"&CRONO!U$12,OFFSET(CÁLCULO!$AB$15:$AL$15,$E26,0,OFFSET(ORÇAMENTO!$D$15,CRONO!$E26,0)))+IF(AND($E28<>\"\",$E28<>0),SUMIF(CÁLCULO!$AM$15:$AW$34,\"=\"&CRONO!U$12,CÁLCULO!$AB$15:$AL$34)/(ORÇAMENTO!$X$15-CÁLCULO.TotalAdmLocal)*CRONO!$E28,0),U27*$R26),SUMIF(OFFSET($R28,1,0,$Q26-2),($L26+1)&\"$\",OFFSET(U28,1,0,$Q26-2)))","v":0},{"$f":"IF($Q26=2,IF(AND(ACOMPANHAMENTO=\"PLE\",ISNUMBER($E26)),SUMIF((OFFSET(CÁLCULO!$AM$15:$AW$15,$E26,0,OFFSET(ORÇAMENTO!$D$15,CRONO!$E26,0))),\"=\"&CRONO!V$12,OFFSET(CÁLCULO!$AB$15:$AL$15,$E26,0,OFFSET(ORÇAMENTO!$D$15,CRONO!$E26,0)))+IF(AND($E28<>\"\",$E28<>0),SUMIF(CÁLCULO!$AM$15:$AW$34,\"=\"&CRONO!V$12,CÁLCULO!$AB$15:$AL$34)/(ORÇAMENTO!$X$15-CÁLCULO.TotalAdmLocal)*CRONO!$E28,0),V27*$R26),SUMIF(OFFSET($R28,1,0,$Q26-2),($L26+1)&\"$\",OFFSET(V28,1,0,$Q26-2)))","v":0},{"$f":"IF($Q26=2,IF(AND(ACOMPANHAMENTO=\"PLE\",ISNUMBER($E26)),SUMIF((OFFSET(CÁLCULO!$AM$15:$AW$15,$E26,0,OFFSET(ORÇAMENTO!$D$15,CRONO!$E26,0))),\"=\"&CRONO!W$12,OFFSET(CÁLCULO!$AB$15:$AL$15,$E26,0,OFFSET(ORÇAMENTO!$D$15,CRONO!$E26,0)))+IF(AND($E28<>\"\",$E28<>0),SUMIF(CÁLCULO!$AM$15:$AW$34,\"=\"&CRONO!W$12,CÁLCULO!$AB$15:$AL$34)/(ORÇAMENTO!$X$15-CÁLCULO.TotalAdmLocal)*CRONO!$E28,0),W27*$R26),SUMIF(OFFSET($R28,1,0,$Q26-2),($L26+1)&\"$\",OFFSET(W28,1,0,$Q26-2)))","v":0},{"$f":"IF($Q26=2,IF(AND(ACOMPANHAMENTO=\"PLE\",ISNUMBER($E26)),SUMIF((OFFSET(CÁLCULO!$AM$15:$AW$15,$E26,0,OFFSET(ORÇAMENTO!$D$15,CRONO!$E26,0))),\"=\"&CRONO!X$12,OFFSET(CÁLCULO!$AB$15:$AL$15,$E26,0,OFFSET(ORÇAMENTO!$D$15,CRONO!$E26,0)))+IF(AND($E28<>\"\",$E28<>0),SUMIF(CÁLCULO!$AM$15:$AW$34,\"=\"&CRONO!X$12,CÁLCULO!$AB$15:$AL$34)/(ORÇAMENTO!$X$15-CÁLCULO.TotalAdmLocal)*CRONO!$E28,0),X27*$R26),SUMIF(OFFSET($R28,1,0,$Q26-2),($L26+1)&\"$\",OFFSET(X28,1,0,$Q26-2)))","v":0},{"$f":"IF($Q26=2,IF(AND(ACOMPANHAMENTO=\"PLE\",ISNUMBER($E26)),SUMIF((OFFSET(CÁLCULO!$AM$15:$AW$15,$E26,0,OFFSET(ORÇAMENTO!$D$15,CRONO!$E26,0))),\"=\"&CRONO!Y$12,OFFSET(CÁLCULO!$AB$15:$AL$15,$E26,0,OFFSET(ORÇAMENTO!$D$15,CRONO!$E26,0)))+IF(AND($E28<>\"\",$E28<>0),SUMIF(CÁLCULO!$AM$15:$AW$34,\"=\"&CRONO!Y$12,CÁLCULO!$AB$15:$AL$34)/(ORÇAMENTO!$X$15-CÁLCULO.TotalAdmLocal)*CRONO!$E28,0),Y27*$R26),SUMIF(OFFSET($R28,1,0,$Q26-2),($L26+1)&\"$\",OFFSET(Y28,1,0,$Q26-2)))","v":0},{"$f":"IF($Q26=2,IF(AND(ACOMPANHAMENTO=\"PLE\",ISNUMBER($E26)),SUMIF((OFFSET(CÁLCULO!$AM$15:$AW$15,$E26,0,OFFSET(ORÇAMENTO!$D$15,CRONO!$E26,0))),\"=\"&CRONO!Z$12,OFFSET(CÁLCULO!$AB$15:$AL$15,$E26,0,OFFSET(ORÇAMENTO!$D$15,CRONO!$E26,0)))+IF(AND($E28<>\"\",$E28<>0),SUMIF(CÁLCULO!$AM$15:$AW$34,\"=\"&CRONO!Z$12,CÁLCULO!$AB$15:$AL$34)/(ORÇAMENTO!$X$15-CÁLCULO.TotalAdmLocal)*CRONO!$E28,0),Z27*$R26),SUMIF(OFFSET($R28,1,0,$Q26-2),($L26+1)&\"$\",OFFSET(Z28,1,0,$Q26-2)))","v":0},{"$f":"IF($Q26=2,IF(AND(ACOMPANHAMENTO=\"PLE\",ISNUMBER($E26)),SUMIF((OFFSET(CÁLCULO!$AM$15:$AW$15,$E26,0,OFFSET(ORÇAMENTO!$D$15,CRONO!$E26,0))),\"=\"&CRONO!AA$12,OFFSET(CÁLCULO!$AB$15:$AL$15,$E26,0,OFFSET(ORÇAMENTO!$D$15,CRONO!$E26,0)))+IF(AND($E28<>\"\",$E28<>0),SUMIF(CÁLCULO!$AM$15:$AW$34,\"=\"&CRONO!AA$12,CÁLCULO!$AB$15:$AL$34)/(ORÇAMENTO!$X$15-CÁLCULO.TotalAdmLocal)*CRONO!$E28,0),AA27*$R26),SUMIF(OFFSET($R28,1,0,$Q26-2),($L26+1)&\"$\",OFFSET(AA28,1,0,$Q26-2)))","v":0},{"$f":"IF($Q26=2,IF(AND(ACOMPANHAMENTO=\"PLE\",ISNUMBER($E26)),SUMIF((OFFSET(CÁLCULO!$AM$15:$AW$15,$E26,0,OFFSET(ORÇAMENTO!$D$15,CRONO!$E26,0))),\"=\"&CRONO!AB$12,OFFSET(CÁLCULO!$AB$15:$AL$15,$E26,0,OFFSET(ORÇAMENTO!$D$15,CRONO!$E26,0)))+IF(AND($E28<>\"\",$E28<>0),SUMIF(CÁLCULO!$AM$15:$AW$34,\"=\"&CRONO!AB$12,CÁLCULO!$AB$15:$AL$34)/(ORÇAMENTO!$X$15-CÁLCULO.TotalAdmLocal)*CRONO!$E28,0),AB27*$R26),SUMIF(OFFSET($R28,1,0,$Q26-2),($L26+1)&\"$\",OFFSET(AB28,1,0,$Q26-2)))","v":0},{"$f":"IF($Q26=2,IF(AND(ACOMPANHAMENTO=\"PLE\",ISNUMBER($E26)),SUMIF((OFFSET(CÁLCULO!$AM$15:$AW$15,$E26,0,OFFSET(ORÇAMENTO!$D$15,CRONO!$E26,0))),\"=\"&CRONO!AC$12,OFFSET(CÁLCULO!$AB$15:$AL$15,$E26,0,OFFSET(ORÇAMENTO!$D$15,CRONO!$E26,0)))+IF(AND($E28<>\"\",$E28<>0),SUMIF(CÁLCULO!$AM$15:$AW$34,\"=\"&CRONO!AC$12,CÁLCULO!$AB$15:$AL$34)/(ORÇAMENTO!$X$15-CÁLCULO.TotalAdmLocal)*CRONO!$E28,0),AC27*$R26),SUMIF(OFFSET($R28,1,0,$Q26-2),($L26+1)&\"$\",OFFSET(AC28,1,0,$Q26-2)))","v":0},{"$f":"IF($Q26=2,IF(AND(ACOMPANHAMENTO=\"PLE\",ISNUMBER($E26)),SUMIF((OFFSET(CÁLCULO!$AM$15:$AW$15,$E26,0,OFFSET(ORÇAMENTO!$D$15,CRONO!$E26,0))),\"=\"&CRONO!AD$12,OFFSET(CÁLCULO!$AB$15:$AL$15,$E26,0,OFFSET(ORÇAMENTO!$D$15,CRONO!$E26,0)))+IF(AND($E28<>\"\",$E28<>0),SUMIF(CÁLCULO!$AM$15:$AW$34,\"=\"&CRONO!AD$12,CÁLCULO!$AB$15:$AL$34)/(ORÇAMENTO!$X$15-CÁLCULO.TotalAdmLocal)*CRONO!$E28,0),AD27*$R26),SUMIF(OFFSET($R28,1,0,$Q26-2),($L26+1)&\"$\",OFFSET(AD28,1,0,$Q26-2)))","v":0},{"$f":"IF($Q26=2,IF(AND(ACOMPANHAMENTO=\"PLE\",ISNUMBER($E26)),SUMIF((OFFSET(CÁLCULO!$AM$15:$AW$15,$E26,0,OFFSET(ORÇAMENTO!$D$15,CRONO!$E26,0))),\"=\"&CRONO!AE$12,OFFSET(CÁLCULO!$AB$15:$AL$15,$E26,0,OFFSET(ORÇAMENTO!$D$15,CRONO!$E26,0)))+IF(AND($E28<>\"\",$E28<>0),SUMIF(CÁLCULO!$AM$15:$AW$34,\"=\"&CRONO!AE$12,CÁLCULO!$AB$15:$AL$34)/(ORÇAMENTO!$X$15-CÁLCULO.TotalAdmLocal)*CRONO!$E28,0),AE27*$R26),SUMIF(OFFSET($R28,1,0,$Q26-2),($L26+1)&\"$\",OFFSET(AE28,1,0,$Q26-2)))","v":7924.5}]
[null,null,null,null,null,"F",null,null,null,null,null,"#"]
[null,null,null,{"$f":"D34/$Q$30","v":0},null,"F",null,{"$f":"\"Total:    R$ \"&TEXT(Q30,\"#.##0,00\")","v":"Total:    R$ 196.407,48"},null,null,null,null,null,null,null,null,{"$f":"SUMIF(L12:L29,1,R12:R29)","v":196407.48},null,"%:",{"$f":"ROUND(T34,2)/$Q$30","v":0},0,0,0,0,0,0,0,0,1.4624799422099403E-2,0.47517370519697105,0.5102014953809294]
[null,null,null,{"$f":"ROUND(D36,2)-ROUND(C36,2)","v":0},null,"F",null,null,null,null,null,null,null,null,null,null,null,null,{"$f":"IF(import.recurso=\"FGTS\",\"Financiamento:\",\"Repasse:\")","v":"Repasse:"},{"$f":"ROUND(T36,2)","v":0},{"$f":"ROUND(U36,2)-ROUND(T36,2)","v":0},0,0,0,0,0,0,0,0,0,0]
[null,null,null,{"$f":"ROUND(D37,2)-ROUND(C37,2)","v":0},null,"F",null,null,null,null,"Período:",null,null,null,null,null,null,null,"Contrapartida:",{"$f":"ROUND(T37,2)","v":0},{"$f":"ROUND(U37,2)-ROUND(T37,2)","v":0},0,0,0,0,0,0,0,2872.42,93327.67,100207.39000000001]
[null,null,null,{"$f":"ROUND(D38,2)-ROUND(C38,2)","v":0},null,"F",null,null,null,null,null,null,null,null,null,null,null,null,"Outros:",{"$f":"ROUND(T38,2)","v":0},{"$f":"ROUND(U38,2)-ROUND(T38,2)","v":0},0,0,0,0,0,0,0,0,0,0]
[null,null,null,{"$f":"ROUND(D39,2)-ROUND(C39,2)","v":0},null,"F",null,null,null,null,null,null,null,null,null,null,null,null,"Investimento:",{"$f":"ROUND(T39,2)","v":0},{"$f":"ROUND(U39,2)-ROUND(T39,2)","v":0},0,0,0,0,0,0,0,2872.42,93327.67,100207.39000000001]
[null,null,null,{"$f":"D39/$Q$30","v":0},null,"F",null,null,null,null,null,null,null,null,null,null,null,null,"%:",{"$f":"ROUND(T39,2)/$Q$30","v":0},{"$f":"ROUND(U39,2)/$Q$30","v":0},0,0,0,0,0,0,0,1.4624799422099403E-2,0.48979850461907048,1]
[null,null,null,{"$f":"ROUND(D39-D38-D37,2)","v":0},null,"F",null,null,null,null,null,null,null,null,null,null,null,null,{"$f":"IF(import.recurso=\"FGTS\",\"Financiamento:\",\"Repasse:\")","v":"Repasse:"},{"$f":"ROUND(T39-T38-T37,2)","v":0},{"$f":"ROUND(U39-U38-U37,2)","v":0},0,0,0,0,0,0,0,0,0,0,{"$f":"AE36+SUMPRODUCT((OFFSET($B$13,1,0):OFFSET($B$29,-3,0))*IF(ISNUMBER(OFFSET(AF$11,5,0):OFFSET(AF$29,-1,0)),OFFSET(AF$11,5,0):OFFSET(AF$29,-1,0),0))","v":0}]
[null,null,null,{"$f":"C37+SUM((OFFSET($B$13,1,0):OFFSET($B$29,-3,0))*IF(ISNUMBER(OFFSET(D$11,5,0):OFFSET(D$29,-1,0)),OFFSET(D$11,5,0):OFFSET(D$29,-1,0),0))","v":0},null,"F",null,null,null,null,"Acumulado:",null,null,null,null,null,null,null,"Contrapartida:",{"$f":"SUM((OFFSET($B$13,1,0):OFFSET($B$29,-3,0))*IF(ISNUMBER(OFFSET(T$11,5,0):OFFSET(T$29,-1,0)),OFFSET(T$11,5,0):OFFSET(T$29,-1,0),0))","v":0},{"$f":"T37+SUM((OFFSET($B$13,1,0):OFFSET($B$29,-3,0))*IF(ISNUMBER(OFFSET(U$11,5,0):OFFSET(U$29,-1,0)),OFFSET(U$11,5,0):OFFSET(U$29,-1,0),0))","v":0},{"$f":"U37+SUM((OFFSET($B$13,1,0):OFFSET($B$29,-3,0))*IF(ISNUMBER(OFFSET(V$11,5,0):OFFSET(V$29,-1,0)),OFFSET(V$11,5,0):OFFSET(V$29,-1,0),0))","v":0},{"$f":"V37+SUM((OFFSET($B$13,1,0):OFFSET($B$29,-3,0))*IF(ISNUMBER(OFFSET(W$11,5,0):OFFSET(W$29,-1,0)),OFFSET(W$11,5,0):OFFSET(W$29,-1,0),0))","v":0},{"$f":"W37+SUM((OFFSET($B$13,1,0):OFFSET($B$29,-3,0))*IF(ISNUMBER(OFFSET(X$11,5,0):OFFSET(X$29,-1,0)),OFFSET(X$11,5,0):OFFSET(X$29,-1,0),0))","v":0},{"$f":"X37+SUM((OFFSET($B$13,1,0):OFFSET($B$29,-3,0))*IF(ISNUMBER(OFFSET(Y$11,5,0):OFFSET(Y$29,-1,0)),OFFSET(Y$11,5,0):OFFSET(Y$29,-1,0),0))","v":0},{"$f":"Y37+SUM((OFFSET($B$13,1,0):OFFSET($B$29,-3,0))*IF(ISNUMBER(OFFSET(Z$11,5,0):OFFSET(Z$29,-1,0)),OFFSET(Z$11,5,0):OFFSET(Z$29,-1,0),0))","v":0},{"$f":"Z37+SUM((OFFSET($B$13,1,0):OFFSET($B$29,-3,0))*IF(ISNUMBER(OFFSET(AA$11,5,0):OFFSET(AA$29,-1,0)),OFFSET(AA$11,5,0):OFFSET(AA$29,-1,0),0))","v":0},{"$f":"AA37+SUM((OFFSET($B$13,1,0):OFFSET($B$29,-3,0))*IF(ISNUMBER(OFFSET(AB$11,5,0):OFFSET(AB$29,-1,0)),OFFSET(AB$11,5,0):OFFSET(AB$29,-1,0),0))","v":0},{"$f":"AB37+SUM((OFFSET($B$13,1,0):OFFSET($B$29,-3,0))*IF(ISNUMBER(OFFSET(AC$11,5,0):OFFSET(AC$29,-1,0)),OFFSET(AC$11,5,0):OFFSET(AC$29,-1,0),0))","v":2872.42},{"$f":"AC37+SUM((OFFSET($B$13,1,0):OFFSET($B$29,-3,0))*IF(ISNUMBER(OFFSET(AD$11,5,0):OFFSET(AD$29,-1,0)),OFFSET(AD$11,5,0):OFFSET(AD$29,-1,0),0))","v":96200.085000000006},{"$f":"AD37+SUM((OFFSET($B$13,1,0):OFFSET($B$29,-3,0))*IF(ISNUMBER(OFFSET(AE$11,5,0):OFFSET(AE$29,-1,0)),OFFSET(AE$11,5,0):OFFSET(AE$29,-1,0),0))","v":196407.48},{"$f":"AE37+SUMPRODUCT((OFFSET($C$13,1,0):OFFSET($C$29,-3,0))*IF(ISNUMBER(OFFSET(AF$11,5,0):OFFSET(AF$29,-1,0)),OFFSET(AF$11,5,0):OFFSET(AF$29,-1,0),0))","v":196407.48}]
[null,null,null,{"$f":"C38+SUM((OFFSET($C$13,1,0):OFFSET($C$29,-3,0))*IF(ISNUMBER(OFFSET(D$11,5,0):OFFSET(D$29,-1,0)),OFFSET(D$11,5,0):OFFSET(D$29,-1,0),0))","v":0},null,"F",null,null,null,null,null,null,null,null,null,null,null,null,"Outros:",{"$f":"SUM((OFFSET($C$13,1,0):OFFSET($C$29,-3,0))*IF(ISNUMBER(OFFSET(T$11,5,0):OFFSET(T$29,-1,0)),OFFSET(T$11,5,0):OFFSET(T$29,-1,0),0))","v":0},{"$f":"T38+SUM((OFFSET($C$13,1,0):OFFSET($C$29,-3,0))*IF(ISNUMBER(OFFSET(U$11,5,0):OFFSET(U$29,-1,0)),OFFSET(U$11,5,0):OFFSET(U$29,-1,0),0))","v":0},{"$f":"U38+SUM((OFFSET($C$13,1,0):OFFSET($C$29,-3,0))*IF(ISNUMBER(OFFSET(V$11,5,0):OFFSET(V$29,-1,0)),OFFSET(V$11,5,0):OFFSET(V$29,-1,0),0))","v":0},{"$f":"V38+SUM((OFFSET($C$13,1,0):OFFSET($C$29,-3,0))*IF(ISNUMBER(OFFSET(W$11,5,0):OFFSET(W$29,-1,0)),OFFSET(W$11,5,0):OFFSET(W$29,-1,0),0))","v":0},{"$f":"W38+SUM((OFFSET($C$13,1,0):OFFSET($C$29,-3,0))*IF(ISNUMBER(OFFSET(X$11,5,0):OFFSET(X$29,-1,0)),OFFSET(X$11,5,0):OFFSET(X$29,-1,0),0))","v":0},{"$f":"X38+SUM((OFFSET($C$13,1,0):OFFSET($C$29,-3,0))*IF(ISNUMBER(OFFSET(Y$11,5,0):OFFSET(Y$29,-1,0)),OFFSET(Y$11,5,0):OFFSET(Y$29,-1,0),0))","v":0},{"$f":"Y38+SUM((OFFSET($C$13,1,0):OFFSET($C$29,-3,0))*IF(ISNUMBER(OFFSET(Z$11,5,0):OFFSET(Z$29,-1,0)),OFFSET(Z$11,5,0):OFFSET(Z$29,-1,0),0))","v":0},{"$f":"Z38+SUM((OFFSET($C$13,1,0):OFFSET($C$29,-3,0))*IF(ISNUMBER(OFFSET(AA$11,5,0):OFFSET(AA$29,-1,0)),OFFSET(AA$11,5,0):OFFSET(AA$29,-1,0),0))","v":0},{"$f":"AA38+SUM((OFFSET($C$13,1,0):OFFSET($C$29,-3,0))*IF(ISNUMBER(OFFSET(AB$11,5,0):OFFSET(AB$29,-1,0)),OFFSET(AB$11,5,0):OFFSET(AB$29,-1,0),0))","v":0},{"$f":"AB38+SUM((OFFSET($C$13,1,0):OFFSET($C$29,-3,0))*IF(ISNUMBER(OFFSET(AC$11,5,0):OFFSET(AC$29,-1,0)),OFFSET(AC$11,5,0):OFFSET(AC$29,-1,0),0))","v":0},{"$f":"AC38+SUM((OFFSET($C$13,1,0):OFFSET($C$29,-3,0))*IF(ISNUMBER(OFFSET(AD$11,5,0):OFFSET(AD$29,-1,0)),OFFSET(AD$11,5,0):OFFSET(AD$29,-1,0),0))","v":0},{"$f":"AD38+SUM((OFFSET($C$13,1,0):OFFSET($C$29,-3,0))*IF(ISNUMBER(OFFSET(AE$11,5,0):OFFSET(AE$29,-1,0)),OFFSET(AE$11,5,0):OFFSET(AE$29,-1,0),0))","v":0},{"$f":"ROUND(AF39-AF36-AF37,2)","v":0}]
[null,null,null,{"$f":"C39+SUMIF($R$12:$R$29,\"1$\",D12:D29)","v":0},null,"F",null,null,null,null,null,null,null,null,null,null,null,null,"Investimento:",{"$f":"SUMIF($R$12:$R$29,\"1$\",T12:T29)","v":0},{"$f":"T39+SUMIF($R$12:$R$29,\"1$\",U12:U29)","v":0},0,0,0,0,0,0,0,2872.42,96200.084999999992,196407.47999999998,196407.47999999998]
[null,null,null,null,null,"F"]
[null,null,null,null,null,"F",null,{"$f":"Import.Município","v":"TRAMANDAÍ/RS"}]
[null,null,null,null,null,"F",null,"Local",null,null,null,null,null,null,null,null,null,null,null,null,null,null,null,null,null,"Responsável Técnico"]
[null,null,null,null,null,"F",null,null,null,null,null,null,null,null,null,null,null,null,null,null,null,null,null,null,null,{"$f":"OFFSET(Import.RespOrçamento,0,-1) & \" \" & Import.RespOrçamento","v":"Nome: PAULO RICARDO VIEGAS ALVES"}]
[null,null,null,null,null,"F",null,{"$f":"DADOS!$F$25","v":"2025-03-14"},null,null,null,null,null,null,null,null,null,null,null,null,null,null,null,null,null,"CREA/CAU: A86.107-3"]
[null,null,null,null,null,"F",null,"Data",null,null,null,null,null,null,null,null,null,null,null,null,null,null,null,null,null,"ART/RRT: RRT 15101062"]

{"sheet":"CRONOPLE","index":8,"n_rows":19,"n_cols":31,"rows_kept":19,"cut":false,"hidden":false,"merged":[[11,1,12,1],[11,2,12,2]]}
[{"$f":"IF(AUTOEVENTO=\"Manual\",IF(OFFSET(EVENTOS!$F$14,CRONOPLE!$B1,0)>0,\"F\",\"\"),IF(CRONOPLE!B1<=MAX(CÁLCULO!$M$15:$M$34),\"F\",\"\"))","v":{"$error":"#REF!"}},{"$f":"OFFSET(B1,-1,0)+1","v":{"$error":"#REF!"}},{"$f":"IF(AUTOEVENTO=\"Manual\",IF($B1<>1,OFFSET(EVENTOS!$D$14,$B1,0),0),IF(B1<=MAX(CÁLCULO!$M$15:$M$34),VLOOKUP($B1,CÁLCULO!$M$15:$N$34,2,FALSE),0))","v":{"$error":"#REF!"}}]
[]
[]
[]
[null,"CRONOGRAMA PREVISTO PLE"]
[]
[null,"1. Digite nas células em amarelo o número do período em que os eventos serão concluídos:"]
[]
[null,{"$f":"IF(ACOMPANHAMENTO=\"BM\",\"NO ACOMPANHAMENTO POR BM, UTILIZE A ABA CRONO\",IF(MAX($B$14:$B$20)<MAX(CÁLCULO!$M$15:$M$34),\"ERRO: NÚMERO DE EVENTOS INSUFICIENTE, CLIQUE EM ATUALIZAR LINHAS\",IF(ROUND(OFFSET(CRONO!$AF$39,0,-1),2)<>CRONO!$Q$30,\"ERRO: CRONOGRAMA NÃO FECHA 100%\",\"\")))","v":"NO ACOMPANHAMENTO POR BM, UTILIZE A ABA CRONO"}]
[]
[null,null,null,null,{"$f":"IF(E$12>CÁLCULO.NúmeroDeFrentes,\"\",OFFSET(CÁLCULO!$P$12,0,E$12))","v":0},null,{"$f":"IF(G$12>CÁLCULO.NúmeroDeFrentes,\"\",OFFSET(CÁLCULO!$P$12,0,G$12))","v":0},{"$f":"IF(H$12>CÁLCULO.NúmeroDeFrentes,\"\",OFFSET(CÁLCULO!$P$12,0,H$12))","v":0},{"$f":"IF(I$12>CÁLCULO.NúmeroDeFrentes,\"\",OFFSET(CÁLCULO!$P$12,0,I$12))","v":0},{"$f":"IF(J$12>CÁLCULO.NúmeroDeFrentes,\"\",OFFSET(CÁLCULO!$P$12,0,J$12))","v":0},{"$f":"IF(K$12>CÁLCULO.NúmeroDeFrentes,\"\",OFFSET(CÁLCULO!$P$12,0,K$12))","v":0},{"$f":"IF(L$12>CÁLCULO.NúmeroDeFrentes,\"\",OFFSET(CÁLCULO!$P$12,0,L$12))","v":0},{"$f":"IF(M$12>CÁLCULO.NúmeroDeFrentes,\"\",OFFSET(CÁLCULO!$P$12,0,M$12))","v":0},{"$f":"IF(N$12>CÁLCULO.NúmeroDeFrentes,\"\",OFFSET(CÁLCULO!$P$12,0,N$12))","v":0},{"$f":"IF(O$12>CÁLCULO.NúmeroDeFrentes,\"\",OFFSET(CÁLCULO!$P$12,0,O$12))","v":0},{"$f":"IF(P$12>CÁLCULO.NúmeroDeFrentes,\"\",OFFSET(CÁLCULO!$P$12,0,P$12))","v":0},{"$f":"IF(Q$12>CÁLCULO.NúmeroDeFrentes,\"\",OFFSET(CÁLCULO!$P$12,0,Q$12))","v":""},{"$f":"IF(R$12>CÁLCULO.NúmeroDeFrentes,\"\",OFFSET(CÁLCULO!$P$12,0,R$12))","v":""},{"$f":"IF(S$12>CÁLCULO.NúmeroDeFrentes,\"\",OFFSET(CÁLCULO!$P$12,0,S$12))","v":""},{"$f":"IF(T$12>CÁLCULO.NúmeroDeFrentes,\"\",OFFSET(CÁLCULO!$P$12,0,T$12))","v":""},{"$f":"IF(U$12>CÁLCULO.NúmeroDeFrentes,\"\",OFFSET(CÁLCULO!$P$12,0,U$12))","v":""},{"$f":"IF(V$12>CÁLCULO.NúmeroDeFrentes,\"\",OFFSET(CÁLCULO!$P$12,0,V$12))","v":""},{"$f":"IF(W$12>CÁLCULO.NúmeroDeFrentes,\"\",OFFSET(CÁLCULO!$P$12,0,W$12))","v":""},{"$f":"IF(X$12>CÁLCULO.NúmeroDeFrentes,\"\",OFFSET(CÁLCULO!$P$12,0,X$12))","v":""},{"$f":"IF(Y$12>CÁLCULO.NúmeroDeFrentes,\"\",OFFSET(CÁLCULO!$P$12,0,Y$12))","v":""},{"$f":"IF(Z$12>CÁLCULO.NúmeroDeFrentes,\"\",OFFSET(CÁLCULO!$P$12,0,Z$12))","v":""},{"$f":"IF(AA$12>CÁLCULO.NúmeroDeFrentes,\"\",OFFSET(CÁLCULO!$P$12,0,AA$12))","v":""},{"$f":"IF(AB$12>CÁLCULO.NúmeroDeFrentes,\"\",OFFSET(CÁLCULO!$P$12,0,AB$12))","v":""},{"$f":"IF(AC$12>CÁLCULO.NúmeroDeFrentes,\"\",OFFSET(CÁLCULO!$P$12,0,AC$12))","v":""},{"$f":"IF(AD$12>CÁLCULO.NúmeroDeFrentes,\"\",OFFSET(CÁLCULO!$P$12,0,AD$12))","v":""},{"$f":"IF(AE$12>CÁLCULO.NúmeroDeFrentes,\"\",OFFSET(CÁLCULO!$P$12,0,AE$12))","v":""}]
[null,"Nº do Evento","Título dos Eventos",null,{"$f":"OFFSET(E12,0,-1)+1","v":1},null,{"$f":"OFFSET(G12,0,-1)+1","v":1},{"$f":"OFFSET(H12,0,-1)+1","v":2},{"$f":"OFFSET(I12,0,-1)+1","v":3},4,5,6,7,8,9,10,11,12,13,14,15,16,17,18,19,20,21,22,23,24,25]
[null,null,null,null,null,null,null,null,null,null,null,null,"Informe abaixo o NÚMERO DO PERÍODO em que os eventos serão concluídos"]
[]
[null,1,"Administração Local",null,null,null,{"$f":"IF(AUTOEVENTO=\"MANUAL\",\"A administração local será proporcional a execução dos demais eventos, independente de frentes de obra.\",\"Para aplicação de Adm. Local é necessário definir os eventos manualmente.\")","v":"Para aplicação de Adm. Local é necessário definir os eventos manualmente."}]
[{"$f":"IF(AUTOEVENTO=\"Manual\",IF(OFFSET(EVENTOS!$F$14,CRONOPLE!$B16,0)>0,\"F\",\"\"),IF(CRONOPLE!B16<=MAX(CÁLCULO!$M$15:$M$34),\"F\",\"\"))","v":"F"},{"$f":"OFFSET(B16,-1,0)+1","v":2},{"$f":"IF(AUTOEVENTO=\"Manual\",IF($B16<>1,OFFSET(EVENTOS!$D$14,$B16,0),0),IF(B16<=MAX(CÁLCULO!$M$15:$M$34),VLOOKUP($B16,CÁLCULO!$M$15:$N$34,2,FALSE),0))","v":"SERVIÇOS PRELIMINARES"}]
[{"$f":"IF(AUTOEVENTO=\"Manual\",IF(OFFSET(EVENTOS!$F$14,CRONOPLE!$B17,0)>0,\"F\",\"\"),IF(CRONOPLE!B17<=MAX(CÁLCULO!$M$15:$M$34),\"F\",\"\"))","v":"F"},3,{"$f":"IF(AUTOEVENTO=\"Manual\",IF($B17<>1,OFFSET(EVENTOS!$D$14,$B17,0),0),IF(B17<=MAX(CÁLCULO!$M$15:$M$34),VLOOKUP($B17,CÁLCULO!$M$15:$N$34,2,FALSE),0))","v":"PAVIMENTAÇÃO"}]
[{"$f":"IF(AUTOEVENTO=\"Manual\",IF(OFFSET(EVENTOS!$F$14,CRONOPLE!$B18,0)>0,\"F\",\"\"),IF(CRONOPLE!B18<=MAX(CÁLCULO!$M$15:$M$34),\"F\",\"\"))","v":"F"},4,{"$f":"IF(AUTOEVENTO=\"Manual\",IF($B18<>1,OFFSET(EVENTOS!$D$14,$B18,0),0),IF(B18<=MAX(CÁLCULO!$M$15:$M$34),VLOOKUP($B18,CÁLCULO!$M$15:$N$34,2,FALSE),0))","v":"PAISAGISMO"}]
[{"$f":"IF(AUTOEVENTO=\"Manual\",IF(OFFSET(EVENTOS!$F$14,CRONOPLE!$B19,0)>0,\"F\",\"\"),IF(CRONOPLE!B19<=MAX(CÁLCULO!$M$15:$M$34),\"F\",\"\"))","v":"F"},5,{"$f":"IF(AUTOEVENTO=\"Manual\",IF($B19<>1,OFFSET(EVENTOS!$D$14,$B19,0),0),IF(B19<=MAX(CÁLCULO!$M$15:$M$34),VLOOKUP($B19,CÁLCULO!$M$15:$N$34,2,FALSE),0))","v":"LIMPEZA DA OBRA"}]

{"sheet":"PLE","index":9,"n_rows":35,"n_cols":32,"rows_kept":35,"cut":false,"hidden":false,"merged":[[0,2,0,3],[2,29,2,31],[3,29,3,31],[5,30,5,31],[6,7,6,13],[6,14,6,20],[10,2,10,3],[11,2,12,3],[8,9,8,10],[8,13,8,19],[6,1,6,2],[6,30,6,31],[6,21,6,29],[8,24,8,25],[8,30,8,31],[21,8,21,31],[11,1,12,1],[22,14,22,15],[14,2,14,3],[15,2,15,3],[16,2,16,3],[17,2,17,3],[18,2,18,3],[24,28,24,29],[24,30,24,31],[22,26,22,27],[22,24,22,25],[23,30,23,31],[23,28,23,29],[23,26,23,27],[23,20,23,21],[23,16,23,17],[23,18,23,19],[22,20,22,21],[22,30,22,31],[22,28,22,29],[22,22,22,23],[23,24,23,25],[22,16,22,17],[22,18,22,19],[27,10,27,11],[26,10,26,11],[26,8,26,9],[25,10,25,11],[25,8,25,9],[27,14,27,15],[26,18,26,19],[32,1,32,3],[29,1,29,3],[26,3,27,3],[26,12,26,13],[27,12,27,13],[27,8,27,9],[26,14,26,15],[25,30,25,31],[27,30,27,31],[27,16,27,17],[27,24,27,25],[27,26,27,27],[25,14,25,15],[25,16,25,17],[26,30,26,31],[26,16,26,17],[25,22,25,23],[27,18,27,19],[25,24,25,25],[25,20,25,21],[27,22,27,23],[26,22,26,23],[26,20,26,21],[26,24,26,25],[27,20,27,21],[27,28,27,29],[25,28,25,29],[26,28,26,29],[26,26,26,27],[23,10,23,11],[23,12,23,13],[23,14,23,15],[23,22,23,23],[25,12,25,13],[25,26,25,27],[25,18,25,19],[24,14,24,15],[22,10,22,11],[24,10,24,11],[24,26,24,27],[24,12,24,13],[24,24,24,25],[24,22,24,23],[24,20,24,21],[24,16,24,17],[24,18,24,19],[22,12,22,13],[23,8,23,9],[24,8,24,9],[22,8,22,9],[24,3,25,3]]}
[{"$f":"IF(AUTOEVENTO=\"Manual\",IF(OFFSET(EVENTOS!$F$14,PLE!$B1,0)>0,\"F\",\"\"),IF(PLE!B1<=MAX(CÁLCULO!$M$15:$M$34),\"F\",\"\"))","v":{"$error":"#REF!"}},{"$f":"OFFSET(B1,-1,0)+1","v":{"$error":"#REF!"}},{"$f":"IF(AUTOEVENTO=\"Manual\",IF($B1<>1,OFFSET(EVENTOS!$D$14,$B1,0),0),IF(B1<=MAX(CÁLCULO!$M$15:$M$34),VLOOKUP($B1,CÁLCULO!$M$15:$N$34,2,FALSE),0))","v":{"$error":"#REF!"}}]
[]
[null,null,null,null,null,null,null,"PLE - PLANILHA DE LEVANTAMENTO DE EVENTOS",null,null,null,null,null,null,null,null,null,null,null,null,null,null,null,null,null,null,null,null,null,"Grau de Sigilo"]
[null,null,null,null,null,null,null,{"$f":"import.recurso","v":"OGU"},null,null,null,null,null,null,null,null,null,null,null,null,null,null,null,null,null,null,null,null,null,"#PUBLICO"]
[]
[null,"Nº OPERAÇÃO",null,"Nº TransfereGOV",null,null,null,"PROPONENTE TOMADOR",null,null,null,null,null,null,"APELIDO EMPREENDIMENTO",null,null,null,null,null,null,{"$f":"IF(TIPOORCAMENTO=\"Licitado\",\"NOME DA EMPRESA\",\"DESCRIÇÃO DO LOTE\")","v":"DESCRIÇÃO DO LOTE"},null,null,null,null,null,null,null,null,{"$f":"IF(TIPOORCAMENTO=\"Licitado\",\"Nº CTEF\",\"\")","v":""}]
[null,{"$f":"Import.CR","v":"109437911"},null,{"$f":"Import.TransfereGOV","v":"02829/2024"},null,null,null,{"$f":"Import.Proponente","v":"PREFEITURA MUNICIPAL DE TRAMANDAÍ "},null,null,null,null,null,null,{"$f":"Import.Apelido","v":"INFRAESTRUTURA EMEI PORTAL DAS FLORES"},null,null,null,null,null,null,{"$f":"IF(TIPOORCAMENTO=\"Licitado\",Import.empresa,Import.DescLote)","v":"CONSTRUÇÃO DA EMEI PORTAL DAS FLORES"},null,null,null,null,null,null,null,null,{"$f":"IF(TIPOORCAMENTO=\"Licitado\",Import.CTEF,\"\")","v":""}]
[]
[0,null,null,null,null,null,null,null,"Medição:",1,null,null,"Período:",{"$f":"TEXT(IF(PLE.Medicao=1,Import.DataInicioObra,OFFSET($H$23,0,1+(PLE.Medicao-$I$24)*2-2)+1),\"dd/mm/aaaa\")&\" a \"&TEXT(OFFSET($H$23,0,1+(PLE.Medicao-$I$24)*2),\"dd/mm/aaaa\")","v":"00/01/1900 a 00/01/1900"},null,null,null,null,null,null,null,null,null,"% Realizado Período.:",{"$f":"OFFSET($I$24,1+8*(ROUNDUP(($J$9-0)/((COLUMN($AG$14)-COLUMN($G$14)-1)/25*12),0)-1),ROUNDDOWN((($J$9-0)-OFFSET($I$24,8*(ROUNDUP(($J$9-0)/((COLUMN($AG$14)-COLUMN($G$14)-1)/25*12),0)-1),0))*(2+1/12),0))","v":0},null,null,null,null,"% Realizado Acum.:",{"$f":"OFFSET($I$24,3+8*(ROUNDUP(($J$9-0)/((COLUMN($AG$14)-COLUMN($G$14)-1)/25*12),0)-1),ROUNDDOWN((($J$9-0)-OFFSET($I$24,8*(ROUNDUP(($J$9-0)/((COLUMN($AG$14)-COLUMN($G$14)-1)/25*12),0)-1),0))*(2+1/12),0))","v":0}]
[]
["Filtro",null,{"$f":"IF(TIPOORCAMENTO=\"proposto\",\"ALTERE O TIPO DE ORÇAMENTO NA ABA 'MENU' PARA LICITADO.\",IF(ACOMPANHAMENTO=\"BM\",\"FOI SELECIONADO NA ABA 'MENU' O ACOMPANHAMENTO POR BM.\",\"\"))","v":"ALTERE O TIPO DE ORÇAMENTO NA ABA 'MENU' PARA LICITADO."},null,null,{"$f":"IF(F$12>CÁLCULO.NúmeroDeFrentes,\"\",OFFSET(CÁLCULO!$P$12,0,F$12))","v":0},null,{"$f":"IF(H$12>CÁLCULO.NúmeroDeFrentes,\"\",OFFSET(CÁLCULO!$P$12,0,H$12))","v":0},{"$f":"IF(I$12>CÁLCULO.NúmeroDeFrentes,\"\",OFFSET(CÁLCULO!$P$12,0,I$12))","v":0},{"$f":"IF(J$12>CÁLCULO.NúmeroDeFrentes,\"\",OFFSET(CÁLCULO!$P$12,0,J$12))","v":0},{"$f":"IF(K$12>CÁLCULO.NúmeroDeFrentes,\"\",OFFSET(CÁLCULO!$P$12,0,K$12))","v":0},{"$f":"IF(L$12>CÁLCULO.NúmeroDeFrentes,\"\",OFFSET(CÁLCULO!$P$12,0,L$12))","v":0},{"$f":"IF(M$12>CÁLCULO.NúmeroDeFrentes,\"\",OFFSET(CÁLCULO!$P$12,0,M$12))","v":0},{"$f":"IF(N$12>CÁLCULO.NúmeroDeFrentes,\"\",OFFSET(CÁLCULO!$P$12,0,N$12))","v":0},{"$f":"IF(O$12>CÁLCULO.NúmeroDeFrentes,\"\",OFFSET(CÁLCULO!$P$12,0,O$12))","v":0},{"$f":"IF(P$12>CÁLCULO.NúmeroDeFrentes,\"\",OFFSET(CÁLCULO!$P$12,0,P$12))","v":0},{"$f":"IF(Q$12>CÁLCULO.NúmeroDeFrentes,\"\",OFFSET(CÁLCULO!$P$12,0,Q$12))","v":0},{"$f":"IF(R$12>CÁLCULO.NúmeroDeFrentes,\"\",OFFSET(CÁLCULO!$P$12,0,R$12))","v":""},{"$f":"IF(S$12>CÁLCULO.NúmeroDeFrentes,\"\",OFFSET(CÁLCULO!$P$12,0,S$12))","v":""},{"$f":"IF(T$12>CÁLCULO.NúmeroDeFrentes,\"\",OFFSET(CÁLCULO!$P$12,0,T$12))","v":""},{"$f":"IF(U$12>CÁLCULO.NúmeroDeFrentes,\"\",OFFSET(CÁLCULO!$P$12,0,U$12))","v":""},{"$f":"IF(V$12>CÁLCULO.NúmeroDeFrentes,\"\",OFFSET(CÁLCULO!$P$12,0,V$12))","v":""},{"$f":"IF(W$12>CÁLCULO.NúmeroDeFrentes,\"\",OFFSET(CÁLCULO!$P$12,0,W$12))","v":""},{"$f":"IF(X$12>CÁLCULO.NúmeroDeFrentes,\"\",OFFSET(CÁLCULO!$P$12,0,X$12))","v":""},{"$f":"IF(Y$12>CÁLCULO.NúmeroDeFrentes,\"\",OFFSET(CÁLCULO!$P$12,0,Y$12))","v":""},{"$f":"IF(Z$12>CÁLCULO.NúmeroDeFrentes,\"\",OFFSET(CÁLCULO!$P$12,0,Z$12))","v":""},{"$f":"IF(AA$12>CÁLCULO.NúmeroDeFrentes,\"\",OFFSET(CÁLCULO!$P$12,0,AA$12))","v":""},{"$f":"IF(AB$12>CÁLCULO.NúmeroDeFrentes,\"\",OFFSET(CÁLCULO!$P$12,0,AB$12))","v":""},{"$f":"IF(AC$12>CÁLCULO.NúmeroDeFrentes,\"\",OFFSET(CÁLCULO!$P$12,0,AC$12))","v":""},{"$f":"IF(AD$12>CÁLCULO.NúmeroDeFrentes,\"\",OFFSET(CÁLCULO!$P$12,0,AD$12))","v":""},{"$f":"IF(AE$12>CÁLCULO.NúmeroDeFrentes,\"\",OFFSET(CÁLCULO!$P$12,0,AE$12))","v":""},{"$f":"IF(AF$12>CÁLCULO.NúmeroDeFrentes,\"\",OFFSET(CÁLCULO!$P$12,0,AF$12))","v":""}]
["↓","Nº do Evento","Título dos Eventos",null,null,{"$f":"OFFSET(F12,0,-1)+1","v":1},null,{"$f":"OFFSET(H12,0,-1)+1","v":1},{"$f":"OFFSET(I12,0,-1)+1","v":2},{"$f":"OFFSET(J12,0,-1)+1","v":3},4,5,6,7,8,9,10,11,12,13,14,15,16,17,18,19,20,21,22,23,24,25]
[null,null,null,null,null,null,null,null,null,null,null,null,null,"Informe abaixo o NÚMERO DA MEDIÇÃO em que os eventos foram concluídos"]
["F"]
[{"$f":"IF(AND(AUTOEVENTO=\"Manual\",OFFSET(EVENTOS!$F$14,1,0)>0),\"F\",\"\")","v":""},1,"Administração Local",null,null,null,null,{"$f":"IF(AUTOEVENTO=\"MANUAL\",\"A administração local será proporcional a execução dos demais eventos, independente de frentes de obra.\",\"Para aplicação de Adm. Local é necessário definir os eventos manualmente.\")","v":"Para aplicação de Adm. Local é necessário definir os eventos manualmente."}]
[{"$f":"IF(AUTOEVENTO=\"Manual\",IF(OFFSET(EVENTOS!$F$14,PLE!$B16,0)>0,\"F\",\"\"),IF(PLE!B16<=MAX(CÁLCULO!$M$15:$M$34),\"F\",\"\"))","v":"F"},{"$f":"OFFSET(B16,-1,0)+1","v":2},{"$f":"IF(AUTOEVENTO=\"Manual\",IF($B16<>1,OFFSET(EVENTOS!$D$14,$B16,0),0),IF(B16<=MAX(CÁLCULO!$M$15:$M$34),VLOOKUP($B16,CÁLCULO!$M$15:$N$34,2,FALSE),0))","v":"SERVIÇOS PRELIMINARES"}]
[{"$f":"IF(AUTOEVENTO=\"Manual\",IF(OFFSET(EVENTOS!$F$14,PLE!$B17,0)>0,\"F\",\"\"),IF(PLE!B17<=MAX(CÁLCULO!$M$15:$M$34),\"F\",\"\"))","v":"F"},3,{"$f":"IF(AUTOEVENTO=\"Manual\",IF($B17<>1,OFFSET(EVENTOS!$D$14,$B17,0),0),IF(B17<=MAX(CÁLCULO!$M$15:$M$34),VLOOKUP($B17,CÁLCULO!$M$15:$N$34,2,FALSE),0))","v":"PAVIMENTAÇÃO"}]
[{"$f":"IF(AUTOEVENTO=\"Manual\",IF(OFFSET(EVENTOS!$F$14,PLE!$B18,0)>0,\"F\",\"\"),IF(PLE!B18<=MAX(CÁLCULO!$M$15:$M$34),\"F\",\"\"))","v":"F"},4,{"$f":"IF(AUTOEVENTO=\"Manual\",IF($B18<>1,OFFSET(EVENTOS!$D$14,$B18,0),0),IF(B18<=MAX(CÁLCULO!$M$15:$M$34),VLOOKUP($B18,CÁLCULO!$M$15:$N$34,2,FALSE),0))","v":"PAISAGISMO"}]
[{"$f":"IF(AUTOEVENTO=\"Manual\",IF(OFFSET(EVENTOS!$F$14,PLE!$B19,0)>0,\"F\",\"\"),IF(PLE!B19<=MAX(CÁLCULO!$M$15:$M$34),\"F\",\"\"))","v":"F"},5,{"$f":"IF(AUTOEVENTO=\"Manual\",IF($B19<>1,OFFSET(EVENTOS!$D$14,$B19,0),0),IF(B19<=MAX(CÁLCULO!$M$15:$M$34),VLOOKUP($B19,CÁLCULO!$M$15:$N$34,2,FALSE),0))","v":"LIMPEZA DA OBRA"}]
["F"]
["F"]
["F",null,null,null,null,null,null,null,"Data das Medições"]
["F"]
["F",null,null,"Medições",null,null,null,null,{"$f":"IF(PLE.Medicao<=12,1,TRUNC((PLE.Medicao - 2)/11,0) * 11 + 1)","v":1},null,{"$f":"I24+1","v":2},null,{"$f":"K24+1","v":3},null,{"$f":"M24+1","v":4},null,{"$f":"O24+1","v":5},null,{"$f":"Q24+1","v":6},null,{"$f":"S24+1","v":7},null,{"$f":"U24+1","v":8},null,{"$f":"W24+1","v":9},null,{"$f":"Y24+1","v":10},null,{"$f":"AA24+1","v":11},null,{"$f":"AC24+1","v":12}]
["F",null,null,"Período:",null,null,null,"%",{"$f":"ROUND(I26,2)/ORÇAMENTO!$X$15","v":0},null,{"$f":"ROUND(K26,2)/ORÇAMENTO!$X$15","v":0},null,{"$f":"ROUND(M26,2)/ORÇAMENTO!$X$15","v":0},null,{"$f":"ROUND(O26,2)/ORÇAMENTO!$X$15","v":0},null,{"$f":"ROUND(Q26,2)/ORÇAMENTO!$X$15","v":0},null,{"$f":"ROUND(S26,2)/ORÇAMENTO!$X$15","v":0},null,{"$f":"ROUND(U26,2)/ORÇAMENTO!$X$15","v":0},null,{"$f":"ROUND(W26,2)/ORÇAMENTO!$X$15","v":0},null,{"$f":"ROUND(Y26,2)/ORÇAMENTO!$X$15","v":0},null,{"$f":"ROUND(AA26,2)/ORÇAMENTO!$X$15","v":0},null,{"$f":"ROUND(AC26,2)/ORÇAMENTO!$X$15","v":0},null,{"$f":"ROUND(AE26,2)/ORÇAMENTO!$X$15","v":0}]
["F",null,null,null,null,null,null,"R$",{"$f":"IF(I24=1,I28,ROUND(I28,2)-ROUND(SUMIF(CÁLCULO!$AX$15:$BH$34,\"<=\"&PLE!I24-1,CÁLCULO!$AB$15:$AL$34)*(1+CÁLCULO.TotalAdmLocal/(ORÇAMENTO!$X$15-CÁLCULO.TotalAdmLocal)),2))","v":0},null,{"$f":"ROUND(K28,2)-ROUND(I28,2)","v":0},null,{"$f":"ROUND(M28,2)-ROUND(K28,2)","v":0},null,{"$f":"ROUND(O28,2)-ROUND(M28,2)","v":0},null,{"$f":"ROUND(Q28,2)-ROUND(O28,2)","v":0},null,{"$f":"ROUND(S28,2)-ROUND(Q28,2)","v":0},null,{"$f":"ROUND(U28,2)-ROUND(S28,2)","v":0},null,{"$f":"ROUND(W28,2)-ROUND(U28,2)","v":0},null,{"$f":"ROUND(Y28,2)-ROUND(W28,2)","v":0},null,{"$f":"ROUND(AA28,2)-ROUND(Y28,2)","v":0},null,{"$f":"ROUND(AC28,2)-ROUND(AA28,2)","v":0},null,{"$f":"ROUND(AE28,2)-ROUND(AC28,2)","v":0}]
["F",null,null,"Acumulado:",null,null,null,"%",{"$f":"ROUND(I28,2)/ORÇAMENTO!$X$15","v":0},null,{"$f":"ROUND(K28,2)/ORÇAMENTO!$X$15","v":0},null,{"$f":"ROUND(M28,2)/ORÇAMENTO!$X$15","v":0},null,{"$f":"ROUND(O28,2)/ORÇAMENTO!$X$15","v":0},null,{"$f":"ROUND(Q28,2)/ORÇAMENTO!$X$15","v":0},null,{"$f":"ROUND(S28,2)/ORÇAMENTO!$X$15","v":0},null,{"$f":"ROUND(U28,2)/ORÇAMENTO!$X$15","v":0},null,{"$f":"ROUND(W28,2)/ORÇAMENTO!$X$15","v":0},null,{"$f":"ROUND(Y28,2)/ORÇAMENTO!$X$15","v":0},null,{"$f":"ROUND(AA28,2)/ORÇAMENTO!$X$15","v":0},null,{"$f":"ROUND(AC28,2)/ORÇAMENTO!$X$15","v":0},null,{"$f":"ROUND(AE28,2)/ORÇAMENTO!$X$15","v":0}]
["F",null,null,null,null,null,null,"R$",{"$f":"SUMIF(CÁLCULO!$AX$15:$BH$34,\"<=\"&PLE!I24,CÁLCULO!$AB$15:$AL$34)*(1+CÁLCULO.TotalAdmLocal/(ORÇAMENTO!$X$15-CÁLCULO.TotalAdmLocal))","v":0},null,{"$f":"SUMIF(CÁLCULO!$AX$15:$BH$34,\"<=\"&PLE!K24,CÁLCULO!$AB$15:$AL$34)*(1+CÁLCULO.TotalAdmLocal/(ORÇAMENTO!$X$15-CÁLCULO.TotalAdmLocal))","v":0},null,{"$f":"SUMIF(CÁLCULO!$AX$15:$BH$34,\"<=\"&PLE!M24,CÁLCULO!$AB$15:$AL$34)*(1+CÁLCULO.TotalAdmLocal/(ORÇAMENTO!$X$15-CÁLCULO.TotalAdmLocal))","v":0},null,{"$f":"SUMIF(CÁLCULO!$AX$15:$BH$34,\"<=\"&PLE!O24,CÁLCULO!$AB$15:$AL$34)*(1+CÁLCULO.TotalAdmLocal/(ORÇAMENTO!$X$15-CÁLCULO.TotalAdmLocal))","v":0},null,{"$f":"SUMIF(CÁLCULO!$AX$15:$BH$34,\"<=\"&PLE!Q24,CÁLCULO!$AB$15:$AL$34)*(1+CÁLCULO.TotalAdmLocal/(ORÇAMENTO!$X$15-CÁLCULO.TotalAdmLocal))","v":0},null,{"$f":"SUMIF(CÁLCULO!$AX$15:$BH$34,\"<=\"&PLE!S24,CÁLCULO!$AB$15:$AL$34)*(1+CÁLCULO.TotalAdmLocal/(ORÇAMENTO!$X$15-CÁLCULO.TotalAdmLocal))","v":0},null,{"$f":"SUMIF(CÁLCULO!$AX$15:$BH$34,\"<=\"&PLE!U24,CÁLCULO!$AB$15:$AL$34)*(1+CÁLCULO.TotalAdmLocal/(ORÇAMENTO!$X$15-CÁLCULO.TotalAdmLocal))","v":0},null,{"$f":"SUMIF(CÁLCULO!$AX$15:$BH$34,\"<=\"&PLE!W24,CÁLCULO!$AB$15:$AL$34)*(1+CÁLCULO.TotalAdmLocal/(ORÇAMENTO!$X$15-CÁLCULO.TotalAdmLocal))","v":0},null,{"$f":"SUMIF(CÁLCULO!$AX$15:$BH$34,\"<=\"&PLE!Y24,CÁLCULO!$AB$15:$AL$34)*(1+CÁLCULO.TotalAdmLocal/(ORÇAMENTO!$X$15-CÁLCULO.TotalAdmLocal))","v":0},null,{"$f":"SUMIF(CÁLCULO!$AX$15:$BH$34,\"<=\"&PLE!AA24,CÁLCULO!$AB$15:$AL$34)*(1+CÁLCULO.TotalAdmLocal/(ORÇAMENTO!$X$15-CÁLCULO.TotalAdmLocal))","v":0},null,{"$f":"SUMIF(CÁLCULO!$AX$15:$BH$34,\"<=\"&PLE!AC24,CÁLCULO!$AB$15:$AL$34)*(1+CÁLCULO.TotalAdmLocal/(ORÇAMENTO!$X$15-CÁLCULO.TotalAdmLocal))","v":0},null,{"$f":"SUMIF(CÁLCULO!$AX$15:$BH$34,\"<=\"&PLE!AE24,CÁLCULO!$AB$15:$AL$34)*(1+CÁLCULO.TotalAdmLocal/(ORÇAMENTO!$X$15-CÁLCULO.TotalAdmLocal))","v":0}]
["F"]
["F",{"$f":"Import.Município","v":"TRAMANDAÍ/RS"}]
["F","Local",null,null,null,null,null,null,null,null,null,null,null,null,null,null,null,null,null,null,"Responsável Técnico pela Fiscalização"]
["F",null,null,null,null,null,null,null,null,null,null,null,null,null,null,null,null,null,null,null,"Nome:",null,{"$f":"Import.RespFiscalização","v":0}]
["F",{"$f":"DADOS!$F$48","v":"2025-03-14"},null,null,null,null,null,null,null,null,null,null,null,null,null,null,null,null,null,null,"Profissão:",null,0]
["F","Data",null,null,null,null,null,null,null,null,null,null,null,null,null,null,null,null,null,null,"CREA/CAU:",null,0]
[null,null,null,null,null,null,null,null,null,null,null,null,null,null,null,null,null,null,null,null,"ART/RRT:",null,0]

{"sheet":"QCI","index":10,"n_rows":37,"n_cols":31,"rows_kept":37,"cut":false,"hidden":false,"merged":[[2,3,2,4],[2,6,2,8],[2,9,2,11],[2,12,3,14],[3,3,3,4],[3,6,3,8],[3,9,3,11],[9,29,9,30],[23,10,24,10],[6,2,10,2],[8,6,9,9],[8,10,9,10],[8,29,8,30],[6,3,6,10],[5,3,5,10],[9,0,10,0],[9,25,9,27],[35,3,35,5],[27,3,29,14],[32,3,32,5]]}
[null,null,null,null,null,"QCI - Quadro de Composição do Investimento"]
[null,null,null,null,null,null,null,null,null,null,null,null,null,null,null,null,null,null,null,null,null,null,null,null,null,"% Maior:","% Rateio CP Fin:"]
[null,null,null,"Nº OPERAÇÃO",null,"Nº TransfereGOV","PROPONENTE / TOMADOR",null,null,"MUNICÍPIO / UF",null,null,"VALORES CONTRATADOS (R$):",null,null,null,null,null,null,null,null,null,null,null,null,{"$f":"MAX(Z7:AB7)","v":1},{"$f":"IF(OR($O$24=ORÇAMENTO.SumINVMANUAL+QCI.SumINVMANUAL,$O$24=0),0,MIN(MAX(0,($Z$3*$O$24-ORÇAMENTO.SumCPMANUAL-QCI.SumCPMANUAL)/($O$24-ORÇAMENTO.SumINVMANUAL-QCI.SumINVMANUAL)),1))","v":1}]
[null,null,null,{"$f":"Import.CR","v":"109437911"},null,{"$f":"Import.TransfereGOV","v":"02829/2024"},{"$f":"Import.Proponente","v":"PREFEITURA MUNICIPAL DE TRAMANDAÍ "},null,null,{"$f":"Import.Município","v":"TRAMANDAÍ/RS"}]
[]
[null,null,null,"APELIDO DO EMPREENDIMENTO",null,null,null,null,null,null,null,"RECURSO",{"$f":"IF(import.recurso=\"FGTS\",\"FINANCIAMENTO\",\"REPASSE\")","v":"REPASSE"},"CONTRAPARTIDA","INVESTIMENTO",null,null,null,null,null,null,null,null,null,null,"% CP Min Prog:","% CP Absoluta:","% CP Max Rep:"]
[null,null,"FILTRO",{"$f":"Import.Apelido","v":"INFRAESTRUTURA EMEI PORTAL DAS FLORES"},null,null,null,null,null,null,null,{"$f":"import.recurso","v":"OGU"},{"$f":"Import.Repasse","v":0},{"$f":"Import.Contrapartida","v":0},{"$f":"M7+N7","v":0},null,null,null,null,null,null,null,null,null,null,{"$f":"ROUND(Import.CPMinPerc,4)","v":0},{"$f":"IF($O$24=0,0,Import.CPMinAbsoluta/$O$24)","v":0},{"$f":"IF($O$24=0,0,($O$24-$AB$24-Import.Repasse)/($O$24))","v":1}]
[]
[null,null,null,null,null,null,{"$f":"CHOOSE(1+LOG(1+2*(AND($O$24>0,$M$25>Import.CPMaxPerc,Import.CPMaxPerc>0))+4*(OR(AND($O$24>0,$M$25<QCI!$Z$7),$M$24<ROUND(Import.CPMinAbsoluta,2)))+8*(OR($L$10<0,$M$10<0))+16*(COUNTIF($L$13:$L$24,\"<0\")>0)+32*(OFFSET($A$24,-1,0)<OFFSET(ORÇAMENTO!$E$34,-1,0)),2),\"\",\"ERRO: CONTRAPARTIDA MAIOR QUE A MÁXIMA\",\"ERRO: CONTRAPARTIDA MENOR QUE A MÍNIMA\",\"ERRO: SALDO NEGATIVO\",\"ERRO: VALORES DE REPASSE NEGATIVOS\",\"ERRO: NÚMERO DE LINHAS DO QCI INSUFICIENTE. CLIQUE NO BOTÃO ADICIONAR LINHAS\")","v":"ERRO: SALDO NEGATIVO"},null,null,null,"Saldo a Reprogramar",{"$f":"$L$13","v":"Repasse (R$)"},"Contrapartida (R$)"]
["Ordem Meta",null,null,null,null,null,null,null,null,null,null,{"$f":"Import.Repasse-L24","v":0},{"$f":"Import.Contrapartida-M24","v":-196407.48},null,null,null,null,null,null,null,null,null,null,null,null,"Valores não Arredondados",null,null,null,"Arred"]
[null,null,null,null,null,null,null,null,null,null,null,null,null,null,null,null,null,null,null,null,null,null,null,null,null,"Repasse (R$)","Contrapartida (R$)","Outros (R$)"]
[{"$f":"IF(NOT(ISBLANK(QCI.DescManual)),OFFSET(A12,-1,0),D12)","v":-1},{"$f":"IF(NOT(ISBLANK(QCI.DescManual)),IF(QCI.Divisao=\"Calculado\",\"Manual\",\"SemiAuto\"),IF(ISERROR(MATCH($A12,ORÇAMENTO!$E$15:$E$34,0)),\"Branco\",\"Automático\"))","v":"Branco"},{"$f":"IF(O12>0,\"F\",\"\")","v":""},{"$f":"ROW()-ROW($D$13)","v":-1},null,null,{"$f":"IF(OR($B12=\"Manual\",$B12=\"SemiAuto\"),QCI.DescManual,IF($B12=\"Automático\",INDEX(ORÇAMENTO!$R$15:$R$34,MATCH($A12,ORÇAMENTO!$E$15:$E$34,0)),\"\"))","v":""},null,null,{"$f":"IF(AND(ISBLANK(E12),ISBLANK(F12)),\"\",VLOOKUP($F12,OFFSET(DADOS!$A$2,1,MATCH(QCI!$E12,DADOS!$2:$2,0)-1,100,50),2,FALSE))","v":""},{"$f":"IF(OR($B12=\"Manual\",$B12=\"SemiAuto\"),QCI.LoteManual,IF($B12=\"Automático\",IF(TIPOORCAMENTO=\"Licitado\",Import.CTEF,\"LOTE 1\"),\"\"))","v":""},{"$f":"ROUND($O12,2)-ROUND($M12,2)-ROUND($N12,2)","v":0},{"$f":"ROUND($AA12,2)-ROUND($AE12,2)","v":0},{"$f":"ROUND($AB12,2)","v":0},{"$f":"IF($B12=\"Branco\",0,IF(OR($B12=\"Manual\",$B12=\"SemiAuto\"),QCI.InvManual,INDEX(ORÇAMENTO!X$15:X$34,MATCH($A12,ORÇAMENTO!$E$15:$E$34,0))))","v":0},null,null,null,null,null,null,"Proporcional",{"$f":"$O12","v":0},0,null,{"$f":"$O12-$AA12-$AB12","v":0},{"$f":"IF($B12=\"Branco\",0,IF($B12=\"Manual\",QCI.CPManual,IF($B12=\"SemiAuto\",ROUND(QCI!$AA$3*QCI.InvManual,2),INDEX(ORÇAMENTO!$AA$15:$AA$34,MATCH($A12,ORÇAMENTO!$E$15:$E$34,0)))))","v":0},{"$f":"IF($B12=\"Branco\",0,IF($B12=\"Manual\",QCI.OutrosManual,IF($B12=\"SemiAuto\",0,INDEX(ORÇAMENTO!$AB$15:$AB$34,MATCH($A12,ORÇAMENTO!$E$15:$E$34,0)))))","v":0},null,{"$f":"AND($AA$3>0,$AA$3<1,$O12>0,OR($B12=\"Automático\",$B12=\"SemiAuto\"),OR(QCI!$Z$3=QCI!$Z$7,QCI!$Z$3=QCI!$AA$7,QCI!$Z$3=QCI!$AB$7))","v":false},{"$f":"IF(AND($AD12,$O12>0,COUNTIF(OFFSET($AD12,1,0):$AD$24,TRUE)=0),CHOOSE(1+LOG(1+2*(QCI!$Z$3=QCI!$Z$7)+4*(QCI!$Z$3=QCI!$AA$7)+8*(QCI!$Z$3=QCI!$AB$7),2),0,$AA$24-ROUND(Import.CPMinPerc*$O$24,2),$AA$24-Import.CPMinAbsoluta,Import.Repasse-$Z$24),0)","v":0}]
[0,"Busca","↓","Meta","Item de Investimento","Subitem de Investimento","Descrição da Meta","Situação","Quantidade","Unid.","Lote de Licitação / nº do CTEF",{"$f":"IF(import.recurso=\"FGTS\",\"Financiamento (R$)\",\"Repasse (R$)\")","v":"Repasse (R$)"},"Contrapartida Financeira (R$)","Outros (R$)","Investimento (R$)",null,null,"Descrição da Meta",null,"Lote de Licitação / nº do CTEF","Investimento (R$)","Divisão do Investimento","Contrapartida Financeira (R$)","Outros (R$)"]
[{"$f":"IF(NOT(ISBLANK(QCI.DescManual)),OFFSET(A14,-1,0),D14)","v":1},{"$f":"IF(NOT(ISBLANK(QCI.DescManual)),IF(QCI.Divisao=\"Calculado\",\"Manual\",\"SemiAuto\"),IF(ISERROR(MATCH($A14,ORÇAMENTO!$E$15:$E$34,0)),\"Branco\",\"Automático\"))","v":"Automático"},{"$f":"IF(O14>0,\"F\",\"\")","v":"F"},{"$f":"ROW()-ROW($D$13)","v":1},null,null,{"$f":"IF(OR($B14=\"Manual\",$B14=\"SemiAuto\"),QCI.DescManual,IF($B14=\"Automático\",INDEX(ORÇAMENTO!$R$15:$R$34,MATCH($A14,ORÇAMENTO!$E$15:$E$34,0)),\"\"))","v":"PAVIMENTAÇÃO E PAISAGISMO ENTORNO EMEI  PORTAL DAS FLORES"},null,null,{"$f":"IF(AND(ISBLANK(E14),ISBLANK(F14)),\"\",VLOOKUP($F14,OFFSET(DADOS!$A$2,1,MATCH(QCI!$E14,DADOS!$2:$2,0)-1,100,50),2,FALSE))","v":""},{"$f":"IF(OR($B14=\"Manual\",$B14=\"SemiAuto\"),QCI.LoteManual,IF($B14=\"Automático\",IF(TIPOORCAMENTO=\"Licitado\",Import.CTEF,\"LOTE 1\"),\"\"))","v":"LOTE 1"},{"$f":"ROUND($O14,2)-ROUND($M14,2)-ROUND($N14,2)","v":0},{"$f":"ROUND($AA14,2)-ROUND($AE14,2)","v":196407.48},{"$f":"ROUND($AB14,2)","v":0},{"$f":"IF($B14=\"Branco\",0,IF(OR($B14=\"Manual\",$B14=\"SemiAuto\"),QCI.InvManual,INDEX(ORÇAMENTO!X$15:X$34,MATCH($A14,ORÇAMENTO!$E$15:$E$34,0))))","v":196407.48},null,null,null,null,null,null,"Proporcional",{"$f":"$O14","v":196407.48},0,null,{"$f":"$O14-$AA14-$AB14","v":0},{"$f":"IF($B14=\"Branco\",0,IF($B14=\"Manual\",QCI.CPManual,IF($B14=\"SemiAuto\",ROUND(QCI!$AA$3*QCI.InvManual,2),INDEX(ORÇAMENTO!$AA$15:$AA$34,MATCH($A14,ORÇAMENTO!$E$15:$E$34,0)))))","v":196407.48},{"$f":"IF($B14=\"Branco\",0,IF($B14=\"Manual\",QCI.OutrosManual,IF($B14=\"SemiAuto\",0,INDEX(ORÇAMENTO!$AB$15:$AB$34,MATCH($A14,ORÇAMENTO!$E$15:$E$34,0)))))","v":0},null,{"$f":"AND($AA$3>0,$AA$3<1,$O14>0,OR($B14=\"Automático\",$B14=\"SemiAuto\"),OR(QCI!$Z$3=QCI!$Z$7,QCI!$Z$3=QCI!$AA$7,QCI!$Z$3=QCI!$AB$7))","v":false},{"$f":"IF(AND($AD14,$O14>0,COUNTIF(OFFSET($AD14,1,0):$AD$24,TRUE)=0),CHOOSE(1+LOG(1+2*(QCI!$Z$3=QCI!$Z$7)+4*(QCI!$Z$3=QCI!$AA$7)+8*(QCI!$Z$3=QCI!$AB$7),2),0,$AA$24-ROUND(Import.CPMinPerc*$O$24,2),$AA$24-Import.CPMinAbsoluta,Import.Repasse-$Z$24),0)","v":0}]
[2,{"$f":"IF(NOT(ISBLANK(QCI.DescManual)),IF(QCI.Divisao=\"Calculado\",\"Manual\",\"SemiAuto\"),IF(ISERROR(MATCH($A15,ORÇAMENTO!$E$15:$E$34,0)),\"Branco\",\"Automático\"))","v":"Branco"},"",2,null,null,{"$f":"IF(OR($B15=\"Manual\",$B15=\"SemiAuto\"),QCI.DescManual,IF($B15=\"Automático\",INDEX(ORÇAMENTO!$R$15:$R$34,MATCH($A15,ORÇAMENTO!$E$15:$E$34,0)),\"\"))","v":""},null,null,{"$f":"IF(AND(ISBLANK(E15),ISBLANK(F15)),\"\",VLOOKUP($F15,OFFSET(DADOS!$A$2,1,MATCH(QCI!$E15,DADOS!$2:$2,0)-1,100,50),2,FALSE))","v":""},{"$f":"IF(OR($B15=\"Manual\",$B15=\"SemiAuto\"),QCI.LoteManual,IF($B15=\"Automático\",IF(TIPOORCAMENTO=\"Licitado\",Import.CTEF,\"LOTE 1\"),\"\"))","v":""},0,0,0,{"$f":"IF($B15=\"Branco\",0,IF(OR($B15=\"Manual\",$B15=\"SemiAuto\"),QCI.InvManual,INDEX(ORÇAMENTO!X$15:X$34,MATCH($A15,ORÇAMENTO!$E$15:$E$34,0))))","v":0},null,null,null,null,null,null,"Proporcional",0,0,null,0,{"$f":"IF($B15=\"Branco\",0,IF($B15=\"Manual\",QCI.CPManual,IF($B15=\"SemiAuto\",ROUND(QCI!$AA$3*QCI.InvManual,2),INDEX(ORÇAMENTO!$AA$15:$AA$34,MATCH($A15,ORÇAMENTO!$E$15:$E$34,0)))))","v":0},{"$f":"IF($B15=\"Branco\",0,IF($B15=\"Manual\",QCI.OutrosManual,IF($B15=\"SemiAuto\",0,INDEX(ORÇAMENTO!$AB$15:$AB$34,MATCH($A15,ORÇAMENTO!$E$15:$E$34,0)))))","v":0},null,{"$f":"AND($AA$3>0,$AA$3<1,$O15>0,OR($B15=\"Automático\",$B15=\"SemiAuto\"),OR(QCI!$Z$3=QCI!$Z$7,QCI!$Z$3=QCI!$AA$7,QCI!$Z$3=QCI!$AB$7))","v":false},{"$f":"IF(AND($AD15,$O15>0,COUNTIF(OFFSET($AD15,1,0):$AD$24,TRUE)=0),CHOOSE(1+LOG(1+2*(QCI!$Z$3=QCI!$Z$7)+4*(QCI!$Z$3=QCI!$AA$7)+8*(QCI!$Z$3=QCI!$AB$7),2),0,$AA$24-ROUND(Import.CPMinPerc*$O$24,2),$AA$24-Import.CPMinAbsoluta,Import.Repasse-$Z$24),0)","v":0}]
[3,{"$f":"IF(NOT(ISBLANK(QCI.DescManual)),IF(QCI.Divisao=\"Calculado\",\"Manual\",\"SemiAuto\"),IF(ISERROR(MATCH($A16,ORÇAMENTO!$E$15:$E$34,0)),\"Branco\",\"Automático\"))","v":"Branco"},"",3,null,null,{"$f":"IF(OR($B16=\"Manual\",$B16=\"SemiAuto\"),QCI.DescManual,IF($B16=\"Automático\",INDEX(ORÇAMENTO!$R$15:$R$34,MATCH($A16,ORÇAMENTO!$E$15:$E$34,0)),\"\"))","v":""},null,null,{"$f":"IF(AND(ISBLANK(E16),ISBLANK(F16)),\"\",VLOOKUP($F16,OFFSET(DADOS!$A$2,1,MATCH(QCI!$E16,DADOS!$2:$2,0)-1,100,50),2,FALSE))","v":""},{"$f":"IF(OR($B16=\"Manual\",$B16=\"SemiAuto\"),QCI.LoteManual,IF($B16=\"Automático\",IF(TIPOORCAMENTO=\"Licitado\",Import.CTEF,\"LOTE 1\"),\"\"))","v":""},0,0,0,{"$f":"IF($B16=\"Branco\",0,IF(OR($B16=\"Manual\",$B16=\"SemiAuto\"),QCI.InvManual,INDEX(ORÇAMENTO!X$15:X$34,MATCH($A16,ORÇAMENTO!$E$15:$E$34,0))))","v":0},null,null,null,null,null,null,"Proporcional",0,0,null,0,{"$f":"IF($B16=\"Branco\",0,IF($B16=\"Manual\",QCI.CPManual,IF($B16=\"SemiAuto\",ROUND(QCI!$AA$3*QCI.InvManual,2),INDEX(ORÇAMENTO!$AA$15:$AA$34,MATCH($A16,ORÇAMENTO!$E$15:$E$34,0)))))","v":0},{"$f":"IF($B16=\"Branco\",0,IF($B16=\"Manual\",QCI.OutrosManual,IF($B16=\"SemiAuto\",0,INDEX(ORÇAMENTO!$AB$15:$AB$34,MATCH($A16,ORÇAMENTO!$E$15:$E$34,0)))))","v":0},null,{"$f":"AND($AA$3>0,$AA$3<1,$O16>0,OR($B16=\"Automático\",$B16=\"SemiAuto\"),OR(QCI!$Z$3=QCI!$Z$7,QCI!$Z$3=QCI!$AA$7,QCI!$Z$3=QCI!$AB$7))","v":false},{"$f":"IF(AND($AD16,$O16>0,COUNTIF(OFFSET($AD16,1,0):$AD$24,TRUE)=0),CHOOSE(1+LOG(1+2*(QCI!$Z$3=QCI!$Z$7)+4*(QCI!$Z$3=QCI!$AA$7)+8*(QCI!$Z$3=QCI!$AB$7),2),0,$AA$24-ROUND(Import.CPMinPerc*$O$24,2),$AA$24-Import.CPMinAbsoluta,Import.Repasse-$Z$24),0)","v":0}]
[4,{"$f":"IF(NOT(ISBLANK(QCI.DescManual)),IF(QCI.Divisao=\"Calculado\",\"Manual\",\"SemiAuto\"),IF(ISERROR(MATCH($A17,ORÇAMENTO!$E$15:$E$34,0)),\"Branco\",\"Automático\"))","v":"Branco"},"",4,null,null,{"$f":"IF(OR($B17=\"Manual\",$B17=\"SemiAuto\"),QCI.DescManual,IF($B17=\"Automático\",INDEX(ORÇAMENTO!$R$15:$R$34,MATCH($A17,ORÇAMENTO!$E$15:$E$34,0)),\"\"))","v":""},null,null,{"$f":"IF(AND(ISBLANK(E17),ISBLANK(F17)),\"\",VLOOKUP($F17,OFFSET(DADOS!$A$2,1,MATCH(QCI!$E17,DADOS!$2:$2,0)-1,100,50),2,FALSE))","v":""},{"$f":"IF(OR($B17=\"Manual\",$B17=\"SemiAuto\"),QCI.LoteManual,IF($B17=\"Automático\",IF(TIPOORCAMENTO=\"Licitado\",Import.CTEF,\"LOTE 1\"),\"\"))","v":""},0,0,0,{"$f":"IF($B17=\"Branco\",0,IF(OR($B17=\"Manual\",$B17=\"SemiAuto\"),QCI.InvManual,INDEX(ORÇAMENTO!X$15:X$34,MATCH($A17,ORÇAMENTO!$E$15:$E$34,0))))","v":0},null,null,null,null,null,null,"Proporcional",0,0,null,0,{"$f":"IF($B17=\"Branco\",0,IF($B17=\"Manual\",QCI.CPManual,IF($B17=\"SemiAuto\",ROUND(QCI!$AA$3*QCI.InvManual,2),INDEX(ORÇAMENTO!$AA$15:$AA$34,MATCH($A17,ORÇAMENTO!$E$15:$E$34,0)))))","v":0},{"$f":"IF($B17=\"Branco\",0,IF($B17=\"Manual\",QCI.OutrosManual,IF($B17=\"SemiAuto\",0,INDEX(ORÇAMENTO!$AB$15:$AB$34,MATCH($A17,ORÇAMENTO!$E$15:$E$34,0)))))","v":0},null,{"$f":"AND($AA$3>0,$AA$3<1,$O17>0,OR($B17=\"Automático\",$B17=\"SemiAuto\"),OR(QCI!$Z$3=QCI!$Z$7,QCI!$Z$3=QCI!$AA$7,QCI!$Z$3=QCI!$AB$7))","v":false},{"$f":"IF(AND($AD17,$O17>0,COUNTIF(OFFSET($AD17,1,0):$AD$24,TRUE)=0),CHOOSE(1+LOG(1+2*(QCI!$Z$3=QCI!$Z$7)+4*(QCI!$Z$3=QCI!$AA$7)+8*(QCI!$Z$3=QCI!$AB$7),2),0,$AA$24-ROUND(Import.CPMinPerc*$O$24,2),$AA$24-Import.CPMinAbsoluta,Import.Repasse-$Z$24),0)","v":0}]
[5,{"$f":"IF(NOT(ISBLANK(QCI.DescManual)),IF(QCI.Divisao=\"Calculado\",\"Manual\",\"SemiAuto\"),IF(ISERROR(MATCH($A18,ORÇAMENTO!$E$15:$E$34,0)),\"Branco\",\"Automático\"))","v":"Branco"},"",5,null,null,{"$f":"IF(OR($B18=\"Manual\",$B18=\"SemiAuto\"),QCI.DescManual,IF($B18=\"Automático\",INDEX(ORÇAMENTO!$R$15:$R$34,MATCH($A18,ORÇAMENTO!$E$15:$E$34,0)),\"\"))","v":""},null,null,{"$f":"IF(AND(ISBLANK(E18),ISBLANK(F18)),\"\",VLOOKUP($F18,OFFSET(DADOS!$A$2,1,MATCH(QCI!$E18,DADOS!$2:$2,0)-1,100,50),2,FALSE))","v":""},{"$f":"IF(OR($B18=\"Manual\",$B18=\"SemiAuto\"),QCI.LoteManual,IF($B18=\"Automático\",IF(TIPOORCAMENTO=\"Licitado\",Import.CTEF,\"LOTE 1\"),\"\"))","v":""},0,0,0,{"$f":"IF($B18=\"Branco\",0,IF(OR($B18=\"Manual\",$B18=\"SemiAuto\"),QCI.InvManual,INDEX(ORÇAMENTO!X$15:X$34,MATCH($A18,ORÇAMENTO!$E$15:$E$34,0))))","v":0},null,null,null,null,null,null,"Proporcional",0,0,null,0,{"$f":"IF($B18=\"Branco\",0,IF($B18=\"Manual\",QCI.CPManual,IF($B18=\"SemiAuto\",ROUND(QCI!$AA$3*QCI.InvManual,2),INDEX(ORÇAMENTO!$AA$15:$AA$34,MATCH($A18,ORÇAMENTO!$E$15:$E$34,0)))))","v":0},{"$f":"IF($B18=\"Branco\",0,IF($B18=\"Manual\",QCI.OutrosManual,IF($B18=\"SemiAuto\",0,INDEX(ORÇAMENTO!$AB$15:$AB$34,MATCH($A18,ORÇAMENTO!$E$15:$E$34,0)))))","v":0},null,{"$f":"AND($AA$3>0,$AA$3<1,$O18>0,OR($B18=\"Automático\",$B18=\"SemiAuto\"),OR(QCI!$Z$3=QCI!$Z$7,QCI!$Z$3=QCI!$AA$7,QCI!$Z$3=QCI!$AB$7))","v":false},{"$f":"IF(AND($AD18,$O18>0,COUNTIF(OFFSET($AD18,1,0):$AD$24,TRUE)=0),CHOOSE(1+LOG(1+2*(QCI!$Z$3=QCI!$Z$7)+4*(QCI!$Z$3=QCI!$AA$7)+8*(QCI!$Z$3=QCI!$AB$7),2),0,$AA$24-ROUND(Import.CPMinPerc*$O$24,2),$AA$24-Import.CPMinAbsoluta,Import.Repasse-$Z$24),0)","v":0}]
[6,{"$f":"IF(NOT(ISBLANK(QCI.DescManual)),IF(QCI.Divisao=\"Calculado\",\"Manual\",\"SemiAuto\"),IF(ISERROR(MATCH($A19,ORÇAMENTO!$E$15:$E$34,0)),\"Branco\",\"Automático\"))","v":"Branco"},"",6,null,null,{"$f":"IF(OR($B19=\"Manual\",$B19=\"SemiAuto\"),QCI.DescManual,IF($B19=\"Automático\",INDEX(ORÇAMENTO!$R$15:$R$34,MATCH($A19,ORÇAMENTO!$E$15:$E$34,0)),\"\"))","v":""},null,null,{"$f":"IF(AND(ISBLANK(E19),ISBLANK(F19)),\"\",VLOOKUP($F19,OFFSET(DADOS!$A$2,1,MATCH(QCI!$E19,DADOS!$2:$2,0)-1,100,50),2,FALSE))","v":""},{"$f":"IF(OR($B19=\"Manual\",$B19=\"SemiAuto\"),QCI.LoteManual,IF($B19=\"Automático\",IF(TIPOORCAMENTO=\"Licitado\",Import.CTEF,\"LOTE 1\"),\"\"))","v":""},0,0,0,{"$f":"IF($B19=\"Branco\",0,IF(OR($B19=\"Manual\",$B19=\"SemiAuto\"),QCI.InvManual,INDEX(ORÇAMENTO!X$15:X$34,MATCH($A19,ORÇAMENTO!$E$15:$E$34,0))))","v":0},null,null,null,null,null,null,"Proporcional",0,0,null,0,{"$f":"IF($B19=\"Branco\",0,IF($B19=\"Manual\",QCI.CPManual,IF($B19=\"SemiAuto\",ROUND(QCI!$AA$3*QCI.InvManual,2),INDEX(ORÇAMENTO!$AA$15:$AA$34,MATCH($A19,ORÇAMENTO!$E$15:$E$34,0)))))","v":0},{"$f":"IF($B19=\"Branco\",0,IF($B19=\"Manual\",QCI.OutrosManual,IF($B19=\"SemiAuto\",0,INDEX(ORÇAMENTO!$AB$15:$AB$34,MATCH($A19,ORÇAMENTO!$E$15:$E$34,0)))))","v":0},null,{"$f":"AND($AA$3>0,$AA$3<1,$O19>0,OR($B19=\"Automático\",$B19=\"SemiAuto\"),OR(QCI!$Z$3=QCI!$Z$7,QCI!$Z$3=QCI!$AA$7,QCI!$Z$3=QCI!$AB$7))","v":false},{"$f":"IF(AND($AD19,$O19>0,COUNTIF(OFFSET($AD19,1,0):$AD$24,TRUE)=0),CHOOSE(1+LOG(1+2*(QCI!$Z$3=QCI!$Z$7)+4*(QCI!$Z$3=QCI!$AA$7)+8*(QCI!$Z$3=QCI!$AB$7),2),0,$AA$24-ROUND(Import.CPMinPerc*$O$24,2),$AA$24-Import.CPMinAbsoluta,Import.Repasse-$Z$24),0)","v":0}]
[7,{"$f":"IF(NOT(ISBLANK(QCI.DescManual)),IF(QCI.Divisao=\"Calculado\",\"Manual\",\"SemiAuto\"),IF(ISERROR(MATCH($A20,ORÇAMENTO!$E$15:$E$34,0)),\"Branco\",\"Automático\"))","v":"Branco"},"",7,null,null,{"$f":"IF(OR($B20=\"Manual\",$B20=\"SemiAuto\"),QCI.DescManual,IF($B20=\"Automático\",INDEX(ORÇAMENTO!$R$15:$R$34,MATCH($A20,ORÇAMENTO!$E$15:$E$34,0)),\"\"))","v":""},null,null,{"$f":"IF(AND(ISBLANK(E20),ISBLANK(F20)),\"\",VLOOKUP($F20,OFFSET(DADOS!$A$2,1,MATCH(QCI!$E20,DADOS!$2:$2,0)-1,100,50),2,FALSE))","v":""},{"$f":"IF(OR($B20=\"Manual\",$B20=\"SemiAuto\"),QCI.LoteManual,IF($B20=\"Automático\",IF(TIPOORCAMENTO=\"Licitado\",Import.CTEF,\"LOTE 1\"),\"\"))","v":""},0,0,0,{"$f":"IF($B20=\"Branco\",0,IF(OR($B20=\"Manual\",$B20=\"SemiAuto\"),QCI.InvManual,INDEX(ORÇAMENTO!X$15:X$34,MATCH($A20,ORÇAMENTO!$E$15:$E$34,0))))","v":0},null,null,null,null,null,null,"Proporcional",0,0,null,0,{"$f":"IF($B20=\"Branco\",0,IF($B20=\"Manual\",QCI.CPManual,IF($B20=\"SemiAuto\",ROUND(QCI!$AA$3*QCI.InvManual,2),INDEX(ORÇAMENTO!$AA$15:$AA$34,MATCH($A20,ORÇAMENTO!$E$15:$E$34,0)))))","v":0},{"$f":"IF($B20=\"Branco\",0,IF($B20=\"Manual\",QCI.OutrosManual,IF($B20=\"SemiAuto\",0,INDEX(ORÇAMENTO!$AB$15:$AB$34,MATCH($A20,ORÇAMENTO!$E$15:$E$34,0)))))","v":0},null,{"$f":"AND($AA$3>0,$AA$3<1,$O20>0,OR($B20=\"Automático\",$B20=\"SemiAuto\"),OR(QCI!$Z$3=QCI!$Z$7,QCI!$Z$3=QCI!$AA$7,QCI!$Z$3=QCI!$AB$7))","v":false},{"$f":"IF(AND($AD20,$O20>0,COUNTIF(OFFSET($AD20,1,0):$AD$24,TRUE)=0),CHOOSE(1+LOG(1+2*(QCI!$Z$3=QCI!$Z$7)+4*(QCI!$Z$3=QCI!$AA$7)+8*(QCI!$Z$3=QCI!$AB$7),2),0,$AA$24-ROUND(Import.CPMinPerc*$O$24,2),$AA$24-Import.CPMinAbsoluta,Import.Repasse-$Z$24),0)","v":0}]
[8,{"$f":"IF(NOT(ISBLANK(QCI.DescManual)),IF(QCI.Divisao=\"Calculado\",\"Manual\",\"SemiAuto\"),IF(ISERROR(MATCH($A21,ORÇAMENTO!$E$15:$E$34,0)),\"Branco\",\"Automático\"))","v":"Branco"},"",8,null,null,{"$f":"IF(OR($B21=\"Manual\",$B21=\"SemiAuto\"),QCI.DescManual,IF($B21=\"Automático\",INDEX(ORÇAMENTO!$R$15:$R$34,MATCH($A21,ORÇAMENTO!$E$15:$E$34,0)),\"\"))","v":""},null,null,{"$f":"IF(AND(ISBLANK(E21),ISBLANK(F21)),\"\",VLOOKUP($F21,OFFSET(DADOS!$A$2,1,MATCH(QCI!$E21,DADOS!$2:$2,0)-1,100,50),2,FALSE))","v":""},{"$f":"IF(OR($B21=\"Manual\",$B21=\"SemiAuto\"),QCI.LoteManual,IF($B21=\"Automático\",IF(TIPOORCAMENTO=\"Licitado\",Import.CTEF,\"LOTE 1\"),\"\"))","v":""},0,0,0,{"$f":"IF($B21=\"Branco\",0,IF(OR($B21=\"Manual\",$B21=\"SemiAuto\"),QCI.InvManual,INDEX(ORÇAMENTO!X$15:X$34,MATCH($A21,ORÇAMENTO!$E$15:$E$34,0))))","v":0},null,null,null,null,null,null,"Proporcional",0,0,null,0,{"$f":"IF($B21=\"Branco\",0,IF($B21=\"Manual\",QCI.CPManual,IF($B21=\"SemiAuto\",ROUND(QCI!$AA$3*QCI.InvManual,2),INDEX(ORÇAMENTO!$AA$15:$AA$34,MATCH($A21,ORÇAMENTO!$E$15:$E$34,0)))))","v":0},{"$f":"IF($B21=\"Branco\",0,IF($B21=\"Manual\",QCI.OutrosManual,IF($B21=\"SemiAuto\",0,INDEX(ORÇAMENTO!$AB$15:$AB$34,MATCH($A21,ORÇAMENTO!$E$15:$E$34,0)))))","v":0},null,{"$f":"AND($AA$3>0,$AA$3<1,$O21>0,OR($B21=\"Automático\",$B21=\"SemiAuto\"),OR(QCI!$Z$3=QCI!$Z$7,QCI!$Z$3=QCI!$AA$7,QCI!$Z$3=QCI!$AB$7))","v":false},{"$f":"IF(AND($AD21,$O21>0,COUNTIF(OFFSET($AD21,1,0):$AD$24,TRUE)=0),CHOOSE(1+LOG(1+2*(QCI!$Z$3=QCI!$Z$7)+4*(QCI!$Z$3=QCI!$AA$7)+8*(QCI!$Z$3=QCI!$AB$7),2),0,$AA$24-ROUND(Import.CPMinPerc*$O$24,2),$AA$24-Import.CPMinAbsoluta,Import.Repasse-$Z$24),0)","v":0}]
[9,{"$f":"IF(NOT(ISBLANK(QCI.DescManual)),IF(QCI.Divisao=\"Calculado\",\"Manual\",\"SemiAuto\"),IF(ISERROR(MATCH($A22,ORÇAMENTO!$E$15:$E$34,0)),\"Branco\",\"Automático\"))","v":"Branco"},"",9,null,null,{"$f":"IF(OR($B22=\"Manual\",$B22=\"SemiAuto\"),QCI.DescManual,IF($B22=\"Automático\",INDEX(ORÇAMENTO!$R$15:$R$34,MATCH($A22,ORÇAMENTO!$E$15:$E$34,0)),\"\"))","v":""},null,null,{"$f":"IF(AND(ISBLANK(E22),ISBLANK(F22)),\"\",VLOOKUP($F22,OFFSET(DADOS!$A$2,1,MATCH(QCI!$E22,DADOS!$2:$2,0)-1,100,50),2,FALSE))","v":""},{"$f":"IF(OR($B22=\"Manual\",$B22=\"SemiAuto\"),QCI.LoteManual,IF($B22=\"Automático\",IF(TIPOORCAMENTO=\"Licitado\",Import.CTEF,\"LOTE 1\"),\"\"))","v":""},0,0,0,{"$f":"IF($B22=\"Branco\",0,IF(OR($B22=\"Manual\",$B22=\"SemiAuto\"),QCI.InvManual,INDEX(ORÇAMENTO!X$15:X$34,MATCH($A22,ORÇAMENTO!$E$15:$E$34,0))))","v":0},null,null,null,null,null,null,"Proporcional",0,0,null,0,{"$f":"IF($B22=\"Branco\",0,IF($B22=\"Manual\",QCI.CPManual,IF($B22=\"SemiAuto\",ROUND(QCI!$AA$3*QCI.InvManual,2),INDEX(ORÇAMENTO!$AA$15:$AA$34,MATCH($A22,ORÇAMENTO!$E$15:$E$34,0)))))","v":0},{"$f":"IF($B22=\"Branco\",0,IF($B22=\"Manual\",QCI.OutrosManual,IF($B22=\"SemiAuto\",0,INDEX(ORÇAMENTO!$AB$15:$AB$34,MATCH($A22,ORÇAMENTO!$E$15:$E$34,0)))))","v":0},null,{"$f":"AND($AA$3>0,$AA$3<1,$O22>0,OR($B22=\"Automático\",$B22=\"SemiAuto\"),OR(QCI!$Z$3=QCI!$Z$7,QCI!$Z$3=QCI!$AA$7,QCI!$Z$3=QCI!$AB$7))","v":false},{"$f":"IF(AND($AD22,$O22>0,COUNTIF(OFFSET($AD22,1,0):$AD$24,TRUE)=0),CHOOSE(1+LOG(1+2*(QCI!$Z$3=QCI!$Z$7)+4*(QCI!$Z$3=QCI!$AA$7)+8*(QCI!$Z$3=QCI!$AB$7),2),0,$AA$24-ROUND(Import.CPMinPerc*$O$24,2),$AA$24-Import.CPMinAbsoluta,Import.Repasse-$Z$24),0)","v":0}]
[10,{"$f":"IF(NOT(ISBLANK(QCI.DescManual)),IF(QCI.Divisao=\"Calculado\",\"Manual\",\"SemiAuto\"),IF(ISERROR(MATCH($A23,ORÇAMENTO!$E$15:$E$34,0)),\"Branco\",\"Automático\"))","v":"Branco"},{"$f":"IF(O23>0,\"F\",\"\")","v":""},{"$f":"ROW()-ROW($D$13)","v":10},null,null,{"$f":"IF(OR($B23=\"Manual\",$B23=\"SemiAuto\"),QCI.DescManual,IF($B23=\"Automático\",INDEX(ORÇAMENTO!$R$15:$R$34,MATCH($A23,ORÇAMENTO!$E$15:$E$34,0)),\"\"))","v":""},null,null,{"$f":"IF(AND(ISBLANK(E23),ISBLANK(F23)),\"\",VLOOKUP($F23,OFFSET(DADOS!$A$2,1,MATCH(QCI!$E23,DADOS!$2:$2,0)-1,100,50),2,FALSE))","v":""},{"$f":"IF(OR($B23=\"Manual\",$B23=\"SemiAuto\"),QCI.LoteManual,IF($B23=\"Automático\",IF(TIPOORCAMENTO=\"Licitado\",Import.CTEF,\"LOTE 1\"),\"\"))","v":""},{"$f":"ROUND($O23,2)-ROUND($M23,2)-ROUND($N23,2)","v":0},{"$f":"ROUND($AA23,2)-ROUND($AE23,2)","v":0},{"$f":"ROUND($AB23,2)","v":0},{"$f":"IF($B23=\"Branco\",0,IF(OR($B23=\"Manual\",$B23=\"SemiAuto\"),QCI.InvManual,INDEX(ORÇAMENTO!X$15:X$34,MATCH($A23,ORÇAMENTO!$E$15:$E$34,0))))","v":0},null,null,null,null,null,null,"Proporcional",{"$f":"$O23","v":0},0,null,{"$f":"$O23-$AA23-$AB23","v":0},{"$f":"IF($B23=\"Branco\",0,IF($B23=\"Manual\",QCI.CPManual,IF($B23=\"SemiAuto\",ROUND(QCI!$AA$3*QCI.InvManual,2),INDEX(ORÇAMENTO!$AA$15:$AA$34,MATCH($A23,ORÇAMENTO!$E$15:$E$34,0)))))","v":0},{"$f":"IF($B23=\"Branco\",0,IF($B23=\"Manual\",QCI.OutrosManual,IF($B23=\"SemiAuto\",0,INDEX(ORÇAMENTO!$AB$15:$AB$34,MATCH($A23,ORÇAMENTO!$E$15:$E$34,0)))))","v":0},null,{"$f":"AND($AA$3>0,$AA$3<1,$O23>0,OR($B23=\"Automático\",$B23=\"SemiAuto\"),OR(QCI!$Z$3=QCI!$Z$7,QCI!$Z$3=QCI!$AA$7,QCI!$Z$3=QCI!$AB$7))","v":false},{"$f":"IF(AND($AD23,$O23>0,COUNTIF(OFFSET($AD23,1,0):$AD$24,TRUE)=0),CHOOSE(1+LOG(1+2*(QCI!$Z$3=QCI!$Z$7)+4*(QCI!$Z$3=QCI!$AA$7)+8*(QCI!$Z$3=QCI!$AB$7),2),0,$AA$24-ROUND(Import.CPMinPerc*$O$24,2),$AA$24-Import.CPMinAbsoluta,Import.Repasse-$Z$24),0)","v":0}]
[null,"TR$","F",null,null,null,null,null,null,null,"TOTAL",{"$f":"SUM(L13:OFFSET(L24,-1,0))","v":0},{"$f":"SUM(M13:OFFSET(M24,-1,0))","v":196407.48},{"$f":"SUM(N13:OFFSET(N24,-1,0))","v":0},{"$f":"SUM(O13:OFFSET(O24,-1,0))","v":196407.48},null,null,null,null,null,null,null,null,null,null,{"$f":"SUMPRODUCT(ROUND(Z13:OFFSET(Z24,-1,0),2))","v":0},{"$f":"SUMPRODUCT(ROUND(AA13:OFFSET(AA24,-1,0),2))","v":196407.48},{"$f":"SUM(AB13:OFFSET(AB24,-1,0))","v":0}]
[null,"T%","F",null,null,null,null,null,null,null,null,{"$f":"IF(ISERROR(L24/$O24),0,ROUND(L24/$O24,4))","v":0},{"$f":"IF(ISERROR(M24/$O24),0,ROUND(M24/$O24,4))","v":1},{"$f":"IF(ISERROR(N24/$O24),0,ROUND(N24/$O24,4))","v":0},{"$f":"IF(ISERROR(O24/$O24),0,ROUND(O24/$O24,4))","v":1}]
[]
[null,null,null,"Observações:"]
[]
[]
[]
[]
[]
[null,null,null,{"$f":"Import.Município","v":"TRAMANDAÍ/RS"}]
[null,null,null,"Local",null,null,null,null,"Representante Tomador"]
[null,null,null,null,null,null,null,null,{"$f":"\"Nome:\" &  \" \" & DADOS!F28","v":"Nome: "}]
[null,null,null,{"$f":"DADOS!$F$25","v":"2025-03-14"},null,null,null,null,{"$f":"\"Cargo:\"  & \" \" & DADOS!F29","v":"Cargo: "}]
[null,null,null,"Data"]

{"sheet":"BM","index":11,"n_rows":49,"n_cols":41,"rows_kept":49,"cut":false,"hidden":false,"merged":[[4,3,4,4],[4,5,4,7],[4,9,4,13],[2,0,2,1],[3,3,3,4],[3,5,3,7],[3,9,3,13],[7,2,11,2],[7,5,7,7],[7,8,7,11],[7,12,7,13],[9,4,10,8],[9,13,10,14],[10,27,10,38],[11,9,11,11],[11,12,11,14],[11,16,11,17],[6,5,6,7],[6,8,6,11],[6,12,6,13],[10,19,10,20],[40,3,40,11],[41,3,41,8],[14,27,14,38],[35,3,35,14],[35,19,35,25],[36,3,38,14],[36,19,38,25],[14,3,14,4],[47,23,47,25],[42,3,42,14],[43,9,43,12],[43,22,43,25],[45,23,45,25],[46,23,46,25]]}
[null,null,null,null,{"$f":"IF(CAIXA.Modo,\"BA - Boletim de Aferição\",\"BM - Boletim de Medição\")","v":"BM - Boletim de Medição"},null,null,null,null,null,null,null,null,null,"Grau de Sigilo"]
["Modo CAIXA",null,null,null,{"$f":"IF(Import.RegimeExecução=\"(SELECIONAR)\",\"Selecione o Regime de Execução na Aba Dados\",Import.RegimeExecução&\" - \"&import.recurso)","v":"Selecione o Regime de Execução na Aba Dados"},null,null,null,null,null,null,null,null,null,"#PUBLICO"]
[false]
[null,null,null,"PROPONENTE / TOMADOR",null,"Nº OPERAÇÃO",null,null,"Nº TransfereGOV","APELIDO DO EMPREENDIMENTO",null,null,null,null,"INÍCIO DE OBRA"]
["Regime ",null,null,{"$f":"Import.Proponente","v":"PREFEITURA MUNICIPAL DE TRAMANDAÍ "},null,{"$f":"Import.CR","v":"109437911"},null,null,{"$f":"Import.TransfereGOV","v":"02829/2024"},{"$f":"Import.Apelido","v":"INFRAESTRUTURA EMEI PORTAL DAS FLORES"},null,null,null,null,{"$f":"Import.DataInicioObra","v":"00:00:00"},null,null,null,null,null,null,null,null,null,null,null,null,null,null,null,null,null,null,null,null,null,null,null,null,null,"Fórmula CopMed"]
[]
[{"$f":"RegimeExecucao","v":"Unitário"},null,null,"Nº CTEF","EMPRESA EXECUTORA","CNPJ",null,null,{"$f":"IF(TIPOORCAMENTO=\"Licitado\",\"REGIME DE EXECUÇÃO\",\"MUNICÍPIO / UF\")","v":"MUNICÍPIO / UF"},null,null,null,"PERÍODO DA MEDIÇÃO",null,"Nº MEDIÇÃO",null,null,null,null,null,null,null,null,null,null,null,null,null,null,null,null,null,null,null,null,null,null,null,null,null,{"$f":"BM.MEDAcumulado","v":0}]
["ARREDMED",null,"FILTRO",{"$f":"Import.CTEF","v":0},{"$f":"Import.empresa","v":0},{"$f":"Import.CNPJ","v":0},null,null,{"$f":"IF(TIPOORCAMENTO=\"Licitado\",Import.RegimeExecução,Import.Município)","v":"TRAMANDAÍ/RS"},null,null,null,{"$f":"TEXT(IF(BM.medicao=1,Import.DataInicioObra,OFFSET($AB$12,0,BM.medicao-1-$AB$13)+1),\"dd/mm/aaaa\")&\" a \"&TEXT(OFFSET($AB$12,0,BM.medicao-$AB$13),\"dd/mm/aaaa\")","v":"00/01/1900 a 00/01/1900"},null,1]
[true]
[null,null,null,null,{"$f":"IF(ACOMPANHAMENTO=\"PLE\",\"Foi selecionado na aba 'MENU' o acompanhamento por PLE.\",IF(TIPOORCAMENTO=\"Proposto\",\"Altere na aba 'MENU' o tipo de orçamento para 'Licitado'.\",\"\"))","v":"Altere na aba 'MENU' o tipo de orçamento para 'Licitado'."},null,null,null,null,null,null,null,null,{"$f":"\"Realizado Acumulado: \"&TEXT(ROUND($O$15/($I$15+10^-12),4),\"0,00%\")","v":"Realizado Acumulado: 0,00%"}]
[null,null,null,null,null,null,null,null,null,null,null,null,null,null,null,null,null,null,null,"Anexo",null,null,null,null,null,null,null,"Datas das Medições"]
[null,null,null,null,"Orçamento Contratado",null,null,null,null,{"$f":"\"Evolução Física \"&CHOOSE(MATCH(RegimeExecucao,{\"Unitário\",\"Global\"},0),\"(Qtde.)\",\"(%)\")","v":"Evolução Física (Qtde.)"},null,null,"Evolução Financeira (R$)",null,null,null,{"$f":"\"Aferido (CAIXA) \"&CHOOSE(MATCH(RegimeExecucao,{\"Unitário\",\"Global\"},0),\"(Qtde.)\",\"(%)\")","v":"Aferido (CAIXA) (Qtde.)"},null,null,"Quadro de Glosas"]
["n1","Altura","↓","Item","Descrição","Unidade","Quantidade","Preço Unitário (com BDI) (R$)","Preço Total\n(R$)","Acum. Anterior","Período","Acum. Incluindo o Período","Acum. Anterior","Período","Acum. Incluindo o Período",null,"Acum. Anterior","Acum. Incluindo o Período",null,"Item","Descrição",{"$f":"IF(RegimeExecucao=\"Unitário\",\"Unidade\",\"\")","v":"Unidade"},{"$f":"CHOOSE(MATCH(RegimeExecucao,{\"Unitário\",\"Global\"},0),\"Quant. Glosada (unid)\",\"Percentual Glosado (%)\")","v":"Quant. Glosada (unid)"},{"$f":"CHOOSE(MATCH(RegimeExecucao,{\"Unitário\",\"Global\"},0),\"Preço Unitário (R$)\",\"Valor Total do Item (R$)\")","v":"Preço Unitário (R$)"},"Valor Total Glosado (R$)","Motivo da Glosa",null,{"$f":"IF(BM.medicao<=12,1,TRUNC((BM.medicao - 2)/11,0) * 11 + 1)","v":1},{"$f":"OFFSET(AC13,0,-1)+1","v":2},{"$f":"OFFSET(AD13,0,-1)+1","v":3},4,5,6,7,8,9,10,11,12,null,"Valor Total Medido (R$)"]
[{"$f":"ORÇAMENTO!C14","v":"S"},{"$f":"ORÇAMENTO!D14","v":0},{"$f":"IF(OR($I14>0,$A14=1,$A14=2,$A14=3,$A14=4),\"F\",\"\")","v":""},{"$f":"ORÇAMENTO!O14","v":"-"},{"$f":"ORÇAMENTO.Descricao","v":"(Sem Código)"},{"$f":"IF(RegimeExecucao=\"Global\",\"\",ORÇAMENTO.Unidade)","v":"-"},{"$f":"IF(RegimeExecucao=\"Global\",\"\",ORÇAMENTO!T14)","v":0},{"$f":"IF(RegimeExecucao=\"Global\",\"\",ORÇAMENTO!W14)","v":0},{"$f":"ORÇAMENTO!X14","v":0},{"$f":"IF($A14=\"S\",IF(CAIXA.Modo,BM.AFAnterior,BM.MEDAnterior),IF(AND(RegimeExecucao=\"Global\",$I14>0,COUNTIF($AB$13:$AM$13,BM.medicao-1)>0),M14/$I14*100,0))","v":0},{"$f":"L14-J14","v":0},{"$f":"IF($A14=\"S\",IF(CAIXA.Modo,BM.AFAcumulado,BM.MEDAcumulado),IF(AND(RegimeExecucao=\"Global\",$I14>0,COUNTIF($AB$13:$AM$13,BM.medicao)>0),O14/$I14*100,0))","v":0},{"$f":"IF($A14=\"S\",VTOTALBM,IF($A14=0,0,ROUND(SomaAgrupBM,15-13*ORÇAMENTO!$AF$11)))","v":0},{"$f":"O14-M14","v":0},{"$f":"IF($A14=\"S\",VTOTALBM,IF($A14=0,0,ROUND(SomaAgrupBM,15-13*ORÇAMENTO!$AF$11)))","v":0},null,null,null,null,{"$f":"IF($W14>0,$D14,\"\")","v":""},{"$f":"IF($W14>0,$E14,\"\")","v":""},{"$f":"IF(AND($W14>0,RegimeExecucao=\"Unitário\"),$F14,\"\")","v":""},{"$f":"IF($Y14>0,CHOOSE(MATCH(RegimeExecucao,{\"Unitário\",\"Global\"},0),IF($A14=\"S\",$Y14/$X14,\"\"),($Y14/$X14)*100),0)","v":0},{"$f":"IF($Y14>0,CHOOSE(MATCH(RegimeExecucao,{\"Unitário\",\"Global\"},0),IF($A14=\"S\",ROUND($H14,ORÇAMENTO!$AF$10),\"\"),ROUND($I14,ORÇAMENTO!$AF$11)),\"\")","v":""},{"$f":"AO14-O14","v":0},null,null,null,null,null,null,null,null,null,null,null,null,null,null,null,{"$f":"IF($A14=\"S\",IF(BM!$I14=0,0,CHOOSE(MATCH(RegimeExecucao,{\"Global\",\"Unitário\"},0),ROUND(ROUND(BM.MEDAcumulado,15-13*BM!$A$9)/100*BM!$I14,15-13*ORÇAMENTO!$AF$11),ROUND(ROUND(BM.MEDAcumulado,15-13*BM!$A$9)*ROUND(BM!$H14,15-13*ORÇAMENTO!$AF$10),15-13*ORÇAMENTO!$AF$11))),IF($A14=0,0,ROUND(SomaAgrupBM,15-13*ORÇAMENTO!$AF$11)))","v":0}]
[null,null,"F",{"$f":"\"Objeto do CTEF: \"&Import.DescLote","v":"Objeto do CTEF: CONSTRUÇÃO DA EMEI PORTAL DAS FLORES"},null,null,null,"TOTAL:",{"$f":"IF(OR(ACOMPANHAMENTO=\"PLE\",TIPOORCAMENTO=\"Proposto\"),0,ORÇAMENTO!$X$15)","v":0},{"$f":"IF(M$15=0,0,IF(RegimeExecucao=\"Global\",M$15/$I$15*100,0))","v":0},{"$f":"L15-J15","v":0},{"$f":"IF(O$15=0,0,IF(RegimeExecucao=\"Global\",O$15/$I$15*100,0))","v":0},{"$f":"IF(OR(ACOMPANHAMENTO=\"PLE\",TIPOORCAMENTO=\"Proposto\"),0,SUMIF(OFFSET($A15,1,0):$A$34,\"S\",OFFSET(M15,1,0):M$34))","v":0},{"$f":"O15-M15","v":0},{"$f":"IF(OR(ACOMPANHAMENTO=\"PLE\",TIPOORCAMENTO=\"Proposto\"),0,SUMIF(OFFSET($A15,1,0):$A$34,\"S\",OFFSET(O15,1,0):O$34))","v":0},null,null,null,null,null,null,null,null,null,null,null,null,{"$f":"\"Preencher abaixo com a \"&CHOOSE(MATCH(RegimeExecucao,{\"Unitário\",\"Global\"},0),\"QUANTIDADE\",\"PORCENTAGEM\")&\" executada no PERÍODO\"","v":"Preencher abaixo com a QUANTIDADE executada no PERÍODO"}]
[{"$f":"ORÇAMENTO!C16","v":1},{"$f":"ORÇAMENTO!D16","v":18},{"$f":"IF(OR($I16>0,$A16=1,$A16=2,$A16=3,$A16=4),\"F\",\"\")","v":"F"},{"$f":"ORÇAMENTO!O16","v":"1."},{"$f":"ORÇAMENTO.Descricao","v":"PAVIMENTAÇÃO E PAISAGISMO ENTORNO EMEI  PORTAL DAS FLORES"},{"$f":"IF(RegimeExecucao=\"Global\",\"\",ORÇAMENTO.Unidade)","v":"-"},{"$f":"IF(RegimeExecucao=\"Global\",\"\",ORÇAMENTO!T16)","v":0},{"$f":"IF(RegimeExecucao=\"Global\",\"\",ORÇAMENTO!W16)","v":0},{"$f":"ORÇAMENTO!X16","v":196407.48},{"$f":"IF($A16=\"S\",IF(CAIXA.Modo,BM.AFAnterior,BM.MEDAnterior),IF(AND(RegimeExecucao=\"Global\",$I16>0,COUNTIF($AB$13:$AM$13,BM.medicao-1)>0),M16/$I16*100,0))","v":0},{"$f":"L16-J16","v":0},{"$f":"IF($A16=\"S\",IF(CAIXA.Modo,BM.AFAcumulado,BM.MEDAcumulado),IF(AND(RegimeExecucao=\"Global\",$I16>0,COUNTIF($AB$13:$AM$13,BM.medicao)>0),O16/$I16*100,0))","v":0},{"$f":"IF($A16=\"S\",VTOTALBM,IF($A16=0,0,ROUND(SomaAgrupBM,15-13*ORÇAMENTO!$AF$11)))","v":0},{"$f":"O16-M16","v":0},{"$f":"IF($A16=\"S\",VTOTALBM,IF($A16=0,0,ROUND(SomaAgrupBM,15-13*ORÇAMENTO!$AF$11)))","v":0},null,null,null,null,{"$f":"IF($W16>0,$D16,\"\")","v":""},{"$f":"IF($W16>0,$E16,\"\")","v":""},{"$f":"IF(AND($W16>0,RegimeExecucao=\"Unitário\"),$F16,\"\")","v":""},{"$f":"IF($Y16>0,CHOOSE(MATCH(RegimeExecucao,{\"Unitário\",\"Global\"},0),IF($A16=\"S\",$Y16/$X16,\"\"),($Y16/$X16)*100),0)","v":0},{"$f":"IF($Y16>0,CHOOSE(MATCH(RegimeExecucao,{\"Unitário\",\"Global\"},0),IF($A16=\"S\",ROUND($H16,ORÇAMENTO!$AF$10),\"\"),ROUND($I16,ORÇAMENTO!$AF$11)),\"\")","v":""},{"$f":"AO16-O16","v":0},null,null,null,null,null,null,null,null,null,null,null,null,null,null,null,{"$f":"IF($A16=\"S\",IF(BM!$I16=0,0,CHOOSE(MATCH(RegimeExecucao,{\"Global\",\"Unitário\"},0),ROUND(ROUND(BM.MEDAcumulado,15-13*BM!$A$9)/100*BM!$I16,15-13*ORÇAMENTO!$AF$11),ROUND(ROUND(BM.MEDAcumulado,15-13*BM!$A$9)*ROUND(BM!$H16,15-13*ORÇAMENTO!$AF$10),15-13*ORÇAMENTO!$AF$11))),IF($A16=0,0,ROUND(SomaAgrupBM,15-13*ORÇAMENTO!$AF$11)))","v":0}]
[{"$f":"ORÇAMENTO!C17","v":2},{"$f":"ORÇAMENTO!D17","v":4},"F",{"$f":"ORÇAMENTO!O17","v":"1.1."},"SERVIÇOS PRELIMINARES",{"$f":"IF(RegimeExecucao=\"Global\",\"\",ORÇAMENTO.Unidade)","v":"-"},{"$f":"IF(RegimeExecucao=\"Global\",\"\",ORÇAMENTO!T17)","v":0},{"$f":"IF(RegimeExecucao=\"Global\",\"\",ORÇAMENTO!W17)","v":0},{"$f":"ORÇAMENTO!X17","v":5744.84},{"$f":"IF($A17=\"S\",IF(CAIXA.Modo,BM.AFAnterior,BM.MEDAnterior),IF(AND(RegimeExecucao=\"Global\",$I17>0,COUNTIF($AB$13:$AM$13,BM.medicao-1)>0),M17/$I17*100,0))","v":0},0,{"$f":"IF($A17=\"S\",IF(CAIXA.Modo,BM.AFAcumulado,BM.MEDAcumulado),IF(AND(RegimeExecucao=\"Global\",$I17>0,COUNTIF($AB$13:$AM$13,BM.medicao)>0),O17/$I17*100,0))","v":0},{"$f":"IF($A17=\"S\",VTOTALBM,IF($A17=0,0,ROUND(SomaAgrupBM,15-13*ORÇAMENTO!$AF$11)))","v":0},0,{"$f":"IF($A17=\"S\",VTOTALBM,IF($A17=0,0,ROUND(SomaAgrupBM,15-13*ORÇAMENTO!$AF$11)))","v":0},null,null,null,null,"","",{"$f":"IF(AND($W17>0,RegimeExecucao=\"Unitário\"),$F17,\"\")","v":""},{"$f":"IF($Y17>0,CHOOSE(MATCH(RegimeExecucao,{\"Unitário\",\"Global\"},0),IF($A17=\"S\",$Y17/$X17,\"\"),($Y17/$X17)*100),0)","v":0},{"$f":"IF($Y17>0,CHOOSE(MATCH(RegimeExecucao,{\"Unitário\",\"Global\"},0),IF($A17=\"S\",ROUND($H17,ORÇAMENTO!$AF$10),\"\"),ROUND($I17,ORÇAMENTO!$AF$11)),\"\")","v":""},0,null,null,null,null,null,null,null,null,null,null,null,null,null,null,null,{"$f":"IF($A17=\"S\",IF(BM!$I17=0,0,CHOOSE(MATCH(RegimeExecucao,{\"Global\",\"Unitário\"},0),ROUND(ROUND(BM.MEDAcumulado,15-13*BM!$A$9)/100*BM!$I17,15-13*ORÇAMENTO!$AF$11),ROUND(ROUND(BM.MEDAcumulado,15-13*BM!$A$9)*ROUND(BM!$H17,15-13*ORÇAMENTO!$AF$10),15-13*ORÇAMENTO!$AF$11))),IF($A17=0,0,ROUND(SomaAgrupBM,15-13*ORÇAMENTO!$AF$11)))","v":0}]
[{"$f":"ORÇAMENTO!C18","v":"S"},{"$f":"ORÇAMENTO!D18","v":0},"F",{"$f":"ORÇAMENTO!O18","v":"1.1.1."},"LIMPEZA MECANIZADA DE CAMADA VEGETAL, VEGETAÇÃO E PEQUENAS ÁRVORES (DIÂMETRO DE TRONCO MENOR QUE 0,20 M), COM TRATOR DE ESTEIRAS. AF_03/2024",{"$f":"IF(RegimeExecucao=\"Global\",\"\",ORÇAMENTO.Unidade)","v":"M2"},{"$f":"IF(RegimeExecucao=\"Global\",\"\",ORÇAMENTO!T18)","v":1674.27},{"$f":"IF(RegimeExecucao=\"Global\",\"\",ORÇAMENTO!W18)","v":0.89},{"$f":"ORÇAMENTO!X18","v":1490.1},{"$f":"IF($A18=\"S\",IF(CAIXA.Modo,BM.AFAnterior,BM.MEDAnterior),IF(AND(RegimeExecucao=\"Global\",$I18>0,COUNTIF($AB$13:$AM$13,BM.medicao-1)>0),M18/$I18*100,0))","v":0},0,{"$f":"IF($A18=\"S\",IF(CAIXA.Modo,BM.AFAcumulado,BM.MEDAcumulado),IF(AND(RegimeExecucao=\"Global\",$I18>0,COUNTIF($AB$13:$AM$13,BM.medicao)>0),O18/$I18*100,0))","v":0},{"$f":"IF($A18=\"S\",VTOTALBM,IF($A18=0,0,ROUND(SomaAgrupBM,15-13*ORÇAMENTO!$AF$11)))","v":0},0,{"$f":"IF($A18=\"S\",VTOTALBM,IF($A18=0,0,ROUND(SomaAgrupBM,15-13*ORÇAMENTO!$AF$11)))","v":0},null,null,null,null,"","",{"$f":"IF(AND($W18>0,RegimeExecucao=\"Unitário\"),$F18,\"\")","v":""},{"$f":"IF($Y18>0,CHOOSE(MATCH(RegimeExecucao,{\"Unitário\",\"Global\"},0),IF($A18=\"S\",$Y18/$X18,\"\"),($Y18/$X18)*100),0)","v":0},{"$f":"IF($Y18>0,CHOOSE(MATCH(RegimeExecucao,{\"Unitário\",\"Global\"},0),IF($A18=\"S\",ROUND($H18,ORÇAMENTO!$AF$10),\"\"),ROUND($I18,ORÇAMENTO!$AF$11)),\"\")","v":""},0,null,null,null,null,null,null,null,null,null,null,null,null,null,null,null,{"$f":"IF($A18=\"S\",IF(BM!$I18=0,0,CHOOSE(MATCH(RegimeExecucao,{\"Global\",\"Unitário\"},0),ROUND(ROUND(BM.MEDAcumulado,15-13*BM!$A$9)/100*BM!$I18,15-13*ORÇAMENTO!$AF$11),ROUND(ROUND(BM.MEDAcumulado,15-13*BM!$A$9)*ROUND(BM!$H18,15-13*ORÇAMENTO!$AF$10),15-13*ORÇAMENTO!$AF$11))),IF($A18=0,0,ROUND(SomaAgrupBM,15-13*ORÇAMENTO!$AF$11)))","v":0}]
[{"$f":"ORÇAMENTO!C19","v":"S"},{"$f":"ORÇAMENTO!D19","v":0},"F",{"$f":"ORÇAMENTO!O19","v":"1.1.2."},"ESCAVAÇÃO MECANIZADA DE VALA COM PROF. ATÉ 1,5 M (MÉDIA MONTANTE E JUSANTE/UMA COMPOSIÇÃO POR TRECHO), ESCAVADEIRA (0,8 M3), LARG. DE 1,5 M A 2,5 M, EM SOLO DE 1A CATEGORIA, LOCAIS COM BAIXO NÍVEL DE INTERFERÊNCIA. AF_09/2024",{"$f":"IF(RegimeExecucao=\"Global\",\"\",ORÇAMENTO.Unidade)","v":"M3"},{"$f":"IF(RegimeExecucao=\"Global\",\"\",ORÇAMENTO!T19)","v":409.59},{"$f":"IF(RegimeExecucao=\"Global\",\"\",ORÇAMENTO!W19)","v":8.31},{"$f":"ORÇAMENTO!X19","v":3403.69},{"$f":"IF($A19=\"S\",IF(CAIXA.Modo,BM.AFAnterior,BM.MEDAnterior),IF(AND(RegimeExecucao=\"Global\",$I19>0,COUNTIF($AB$13:$AM$13,BM.medicao-1)>0),M19/$I19*100,0))","v":0},0,{"$f":"IF($A19=\"S\",IF(CAIXA.Modo,BM.AFAcumulado,BM.MEDAcumulado),IF(AND(RegimeExecucao=\"Global\",$I19>0,COUNTIF($AB$13:$AM$13,BM.medicao)>0),O19/$I19*100,0))","v":0},{"$f":"IF($A19=\"S\",VTOTALBM,IF($A19=0,0,ROUND(SomaAgrupBM,15-13*ORÇAMENTO!$AF$11)))","v":0},0,{"$f":"IF($A19=\"S\",VTOTALBM,IF($A19=0,0,ROUND(SomaAgrupBM,15-13*ORÇAMENTO!$AF$11)))","v":0},null,null,null,null,"","",{"$f":"IF(AND($W19>0,RegimeExecucao=\"Unitário\"),$F19,\"\")","v":""},{"$f":"IF($Y19>0,CHOOSE(MATCH(RegimeExecucao,{\"Unitário\",\"Global\"},0),IF($A19=\"S\",$Y19/$X19,\"\"),($Y19/$X19)*100),0)","v":0},{"$f":"IF($Y19>0,CHOOSE(MATCH(RegimeExecucao,{\"Unitário\",\"Global\"},0),IF($A19=\"S\",ROUND($H19,ORÇAMENTO!$AF$10),\"\"),ROUND($I19,ORÇAMENTO!$AF$11)),\"\")","v":""},0,null,null,null,null,null,null,null,null,null,null,null,null,null,null,null,{"$f":"IF($A19=\"S\",IF(BM!$I19=0,0,CHOOSE(MATCH(RegimeExecucao,{\"Global\",\"Unitário\"},0),ROUND(ROUND(BM.MEDAcumulado,15-13*BM!$A$9)/100*BM!$I19,15-13*ORÇAMENTO!$AF$11),ROUND(ROUND(BM.MEDAcumulado,15-13*BM!$A$9)*ROUND(BM!$H19,15-13*ORÇAMENTO!$AF$10),15-13*ORÇAMENTO!$AF$11))),IF($A19=0,0,ROUND(SomaAgrupBM,15-13*ORÇAMENTO!$AF$11)))","v":0}]
[{"$f":"ORÇAMENTO!C20","v":"S"},{"$f":"ORÇAMENTO!D20","v":0},"F",{"$f":"ORÇAMENTO!O20","v":"1.1.3."},"COMPACTAÇÃO MECÂNICA DE SOLO PARA EXECUÇÃO DE RADIER, PISO DE CONCRETO OU LAJE SOBRE SOLO, COM COMPACTADOR DE SOLOS TIPO PLACA VIBRATÓRIA. AF_09/2021",{"$f":"IF(RegimeExecucao=\"Global\",\"\",ORÇAMENTO.Unidade)","v":"M2"},{"$f":"IF(RegimeExecucao=\"Global\",\"\",ORÇAMENTO!T20)","v":935.22},{"$f":"IF(RegimeExecucao=\"Global\",\"\",ORÇAMENTO!W20)","v":0.91},{"$f":"ORÇAMENTO!X20","v":851.05},{"$f":"IF($A20=\"S\",IF(CAIXA.Modo,BM.AFAnterior,BM.MEDAnterior),IF(AND(RegimeExecucao=\"Global\",$I20>0,COUNTIF($AB$13:$AM$13,BM.medicao-1)>0),M20/$I20*100,0))","v":0},0,{"$f":"IF($A20=\"S\",IF(CAIXA.Modo,BM.AFAcumulado,BM.MEDAcumulado),IF(AND(RegimeExecucao=\"Global\",$I20>0,COUNTIF($AB$13:$AM$13,BM.medicao)>0),O20/$I20*100,0))","v":0},{"$f":"IF($A20=\"S\",VTOTALBM,IF($A20=0,0,ROUND(SomaAgrupBM,15-13*ORÇAMENTO!$AF$11)))","v":0},0,{"$f":"IF($A20=\"S\",VTOTALBM,IF($A20=0,0,ROUND(SomaAgrupBM,15-13*ORÇAMENTO!$AF$11)))","v":0},null,null,null,null,"","",{"$f":"IF(AND($W20>0,RegimeExecucao=\"Unitário\"),$F20,\"\")","v":""},{"$f":"IF($Y20>0,CHOOSE(MATCH(RegimeExecucao,{\"Unitário\",\"Global\"},0),IF($A20=\"S\",$Y20/$X20,\"\"),($Y20/$X20)*100),0)","v":0},{"$f":"IF($Y20>0,CHOOSE(MATCH(RegimeExecucao,{\"Unitário\",\"Global\"},0),IF($A20=\"S\",ROUND($H20,ORÇAMENTO!$AF$10),\"\"),ROUND($I20,ORÇAMENTO!$AF$11)),\"\")","v":""},0,null,null,null,null,null,null,null,null,null,null,null,null,null,null,null,{"$f":"IF($A20=\"S\",IF(BM!$I20=0,0,CHOOSE(MATCH(RegimeExecucao,{\"Global\",\"Unitário\"},0),ROUND(ROUND(BM.MEDAcumulado,15-13*BM!$A$9)/100*BM!$I20,15-13*ORÇAMENTO!$AF$11),ROUND(ROUND(BM.MEDAcumulado,15-13*BM!$A$9)*ROUND(BM!$H20,15-13*ORÇAMENTO!$AF$10),15-13*ORÇAMENTO!$AF$11))),IF($A20=0,0,ROUND(SomaAgrupBM,15-13*ORÇAMENTO!$AF$11)))","v":0}]
[{"$f":"ORÇAMENTO!C21","v":2},{"$f":"ORÇAMENTO!D21","v":7},{"$f":"IF(OR($I21>0,$A21=1,$A21=2,$A21=3,$A21=4),\"F\",\"\")","v":"F"},{"$f":"ORÇAMENTO!O21","v":"1.2."},{"$f":"ORÇAMENTO.Descricao","v":"PAVIMENTAÇÃO"},{"$f":"IF(RegimeExecucao=\"Global\",\"\",ORÇAMENTO.Unidade)","v":"-"},{"$f":"IF(RegimeExecucao=\"Global\",\"\",ORÇAMENTO!T21)","v":0},{"$f":"IF(RegimeExecucao=\"Global\",\"\",ORÇAMENTO!W21)","v":0},{"$f":"ORÇAMENTO!X21","v":180910.49},{"$f":"IF($A21=\"S\",IF(CAIXA.Modo,BM.AFAnterior,BM.MEDAnterior),IF(AND(RegimeExecucao=\"Global\",$I21>0,COUNTIF($AB$13:$AM$13,BM.medicao-1)>0),M21/$I21*100,0))","v":0},{"$f":"L21-J21","v":0},{"$f":"IF($A21=\"S\",IF(CAIXA.Modo,BM.AFAcumulado,BM.MEDAcumulado),IF(AND(RegimeExecucao=\"Global\",$I21>0,COUNTIF($AB$13:$AM$13,BM.medicao)>0),O21/$I21*100,0))","v":0},{"$f":"IF($A21=\"S\",VTOTALBM,IF($A21=0,0,ROUND(SomaAgrupBM,15-13*ORÇAMENTO!$AF$11)))","v":0},{"$f":"O21-M21","v":0},{"$f":"IF($A21=\"S\",VTOTALBM,IF($A21=0,0,ROUND(SomaAgrupBM,15-13*ORÇAMENTO!$AF$11)))","v":0},null,null,null,null,{"$f":"IF($W21>0,$D21,\"\")","v":""},{"$f":"IF($W21>0,$E21,\"\")","v":""},{"$f":"IF(AND($W21>0,RegimeExecucao=\"Unitário\"),$F21,\"\")","v":""},{"$f":"IF($Y21>0,CHOOSE(MATCH(RegimeExecucao,{\"Unitário\",\"Global\"},0),IF($A21=\"S\",$Y21/$X21,\"\"),($Y21/$X21)*100),0)","v":0},{"$f":"IF($Y21>0,CHOOSE(MATCH(RegimeExecucao,{\"Unitário\",\"Global\"},0),IF($A21=\"S\",ROUND($H21,ORÇAMENTO!$AF$10),\"\"),ROUND($I21,ORÇAMENTO!$AF$11)),\"\")","v":""},{"$f":"AO21-O21","v":0},null,null,null,null,null,null,null,null,null,null,null,null,null,null,null,{"$f":"IF($A21=\"S\",IF(BM!$I21=0,0,CHOOSE(MATCH(RegimeExecucao,{\"Global\",\"Unitário\"},0),ROUND(ROUND(BM.MEDAcumulado,15-13*BM!$A$9)/100*BM!$I21,15-13*ORÇAMENTO!$AF$11),ROUND(ROUND(BM.MEDAcumulado,15-13*BM!$A$9)*ROUND(BM!$H21,15-13*ORÇAMENTO!$AF$10),15-13*ORÇAMENTO!$AF$11))),IF($A21=0,0,ROUND(SomaAgrupBM,15-13*ORÇAMENTO!$AF$11)))","v":0}]
[{"$f":"ORÇAMENTO!C22","v":"S"},{"$f":"ORÇAMENTO!D22","v":0},"F",{"$f":"ORÇAMENTO!O22","v":"1.2.1."},"ASSENTAMENTO DE GUIA (MEIO-FIO) EM TRECHO CURVO, CONFECCIONADA EM CONCRETO PRÉ-FABRICADO, DIMENSÕES 100X15X13X30 CM (COMPRIMENTO X BASE INFERIOR X BASE SUPERIOR X ALTURA). AF_01/2024",{"$f":"IF(RegimeExecucao=\"Global\",\"\",ORÇAMENTO.Unidade)","v":"M"},{"$f":"IF(RegimeExecucao=\"Global\",\"\",ORÇAMENTO!T22)","v":78.02},{"$f":"IF(RegimeExecucao=\"Global\",\"\",ORÇAMENTO!W22)","v":66.3},{"$f":"ORÇAMENTO!X22","v":5172.7299999999996},{"$f":"IF($A22=\"S\",IF(CAIXA.Modo,BM.AFAnterior,BM.MEDAnterior),IF(AND(RegimeExecucao=\"Global\",$I22>0,COUNTIF($AB$13:$AM$13,BM.medicao-1)>0),M22/$I22*100,0))","v":0},0,{"$f":"IF($A22=\"S\",IF(CAIXA.Modo,BM.AFAcumulado,BM.MEDAcumulado),IF(AND(RegimeExecucao=\"Global\",$I22>0,COUNTIF($AB$13:$AM$13,BM.medicao)>0),O22/$I22*100,0))","v":0},{"$f":"IF($A22=\"S\",VTOTALBM,IF($A22=0,0,ROUND(SomaAgrupBM,15-13*ORÇAMENTO!$AF$11)))","v":0},0,{"$f":"IF($A22=\"S\",VTOTALBM,IF($A22=0,0,ROUND(SomaAgrupBM,15-13*ORÇAMENTO!$AF$11)))","v":0},null,null,null,null,"","",{"$f":"IF(AND($W22>0,RegimeExecucao=\"Unitário\"),$F22,\"\")","v":""},{"$f":"IF($Y22>0,CHOOSE(MATCH(RegimeExecucao,{\"Unitário\",\"Global\"},0),IF($A22=\"S\",$Y22/$X22,\"\"),($Y22/$X22)*100),0)","v":0},{"$f":"IF($Y22>0,CHOOSE(MATCH(RegimeExecucao,{\"Unitário\",\"Global\"},0),IF($A22=\"S\",ROUND($H22,ORÇAMENTO!$AF$10),\"\"),ROUND($I22,ORÇAMENTO!$AF$11)),\"\")","v":""},0,null,null,null,null,null,null,null,null,null,null,null,null,null,null,null,{"$f":"IF($A22=\"S\",IF(BM!$I22=0,0,CHOOSE(MATCH(RegimeExecucao,{\"Global\",\"Unitário\"},0),ROUND(ROUND(BM.MEDAcumulado,15-13*BM!$A$9)/100*BM!$I22,15-13*ORÇAMENTO!$AF$11),ROUND(ROUND(BM.MEDAcumulado,15-13*BM!$A$9)*ROUND(BM!$H22,15-13*ORÇAMENTO!$AF$10),15-13*ORÇAMENTO!$AF$11))),IF($A22=0,0,ROUND(SomaAgrupBM,15-13*ORÇAMENTO!$AF$11)))","v":0}]
[{"$f":"ORÇAMENTO!C23","v":"S"},{"$f":"ORÇAMENTO!D23","v":0},"F",{"$f":"ORÇAMENTO!O23","v":"1.2.2."},"ASSENTAMENTO DE GUIA (MEIO-FIO) EM TRECHO RETO, CONFECCIONADA EM CONCRETO PRÉ-FABRICADO, DIMENSÕES 100X15X13X30 CM (COMPRIMENTO X BASE INFERIOR X BASE SUPERIOR X ALTURA). AF_01/2024",{"$f":"IF(RegimeExecucao=\"Global\",\"\",ORÇAMENTO.Unidade)","v":"M"},{"$f":"IF(RegimeExecucao=\"Global\",\"\",ORÇAMENTO!T23)","v":198.57},{"$f":"IF(RegimeExecucao=\"Global\",\"\",ORÇAMENTO!W23)","v":62.7},{"$f":"ORÇAMENTO!X23","v":12450.34},{"$f":"IF($A23=\"S\",IF(CAIXA.Modo,BM.AFAnterior,BM.MEDAnterior),IF(AND(RegimeExecucao=\"Global\",$I23>0,COUNTIF($AB$13:$AM$13,BM.medicao-1)>0),M23/$I23*100,0))","v":0},0,{"$f":"IF($A23=\"S\",IF(CAIXA.Modo,BM.AFAcumulado,BM.MEDAcumulado),IF(AND(RegimeExecucao=\"Global\",$I23>0,COUNTIF($AB$13:$AM$13,BM.medicao)>0),O23/$I23*100,0))","v":0},{"$f":"IF($A23=\"S\",VTOTALBM,IF($A23=0,0,ROUND(SomaAgrupBM,15-13*ORÇAMENTO!$AF$11)))","v":0},0,{"$f":"IF($A23=\"S\",VTOTALBM,IF($A23=0,0,ROUND(SomaAgrupBM,15-13*ORÇAMENTO!$AF$11)))","v":0},null,null,null,null,"","",{"$f":"IF(AND($W23>0,RegimeExecucao=\"Unitário\"),$F23,\"\")","v":""},{"$f":"IF($Y23>0,CHOOSE(MATCH(RegimeExecucao,{\"Unitário\",\"Global\"},0),IF($A23=\"S\",$Y23/$X23,\"\"),($Y23/$X23)*100),0)","v":0},{"$f":"IF($Y23>0,CHOOSE(MATCH(RegimeExecucao,{\"Unitário\",\"Global\"},0),IF($A23=\"S\",ROUND($H23,ORÇAMENTO!$AF$10),\"\"),ROUND($I23,ORÇAMENTO!$AF$11)),\"\")","v":""},0,null,null,null,null,null,null,null,null,null,null,null,null,null,null,null,{"$f":"IF($A23=\"S\",IF(BM!$I23=0,0,CHOOSE(MATCH(RegimeExecucao,{\"Global\",\"Unitário\"},0),ROUND(ROUND(BM.MEDAcumulado,15-13*BM!$A$9)/100*BM!$I23,15-13*ORÇAMENTO!$AF$11),ROUND(ROUND(BM.MEDAcumulado,15-13*BM!$A$9)*ROUND(BM!$H23,15-13*ORÇAMENTO!$AF$10),15-13*ORÇAMENTO!$AF$11))),IF($A23=0,0,ROUND(SomaAgrupBM,15-13*ORÇAMENTO!$AF$11)))","v":0}]
[{"$f":"ORÇAMENTO!C24","v":"S"},{"$f":"ORÇAMENTO!D24","v":0},"F",{"$f":"ORÇAMENTO!O24","v":"1.2.3."},"EXECUÇÃO DE PAVIMENTO EM PISO INTERTRAVADO, COM BLOCO RETANGULAR COR NATURAL DE 20 X 10 CM, ESPESSURA 8 CM. AF_10/2022",{"$f":"IF(RegimeExecucao=\"Global\",\"\",ORÇAMENTO.Unidade)","v":"M2"},{"$f":"IF(RegimeExecucao=\"Global\",\"\",ORÇAMENTO!T24)","v":567.4},{"$f":"IF(RegimeExecucao=\"Global\",\"\",ORÇAMENTO!W24)","v":103.63},{"$f":"ORÇAMENTO!X24","v":58799.66},{"$f":"IF($A24=\"S\",IF(CAIXA.Modo,BM.AFAnterior,BM.MEDAnterior),IF(AND(RegimeExecucao=\"Global\",$I24>0,COUNTIF($AB$13:$AM$13,BM.medicao-1)>0),M24/$I24*100,0))","v":0},0,{"$f":"IF($A24=\"S\",IF(CAIXA.Modo,BM.AFAcumulado,BM.MEDAcumulado),IF(AND(RegimeExecucao=\"Global\",$I24>0,COUNTIF($AB$13:$AM$13,BM.medicao)>0),O24/$I24*100,0))","v":0},{"$f":"IF($A24=\"S\",VTOTALBM,IF($A24=0,0,ROUND(SomaAgrupBM,15-13*ORÇAMENTO!$AF$11)))","v":0},0,{"$f":"IF($A24=\"S\",VTOTALBM,IF($A24=0,0,ROUND(SomaAgrupBM,15-13*ORÇAMENTO!$AF$11)))","v":0},null,null,null,null,"","",{"$f":"IF(AND($W24>0,RegimeExecucao=\"Unitário\"),$F24,\"\")","v":""},{"$f":"IF($Y24>0,CHOOSE(MATCH(RegimeExecucao,{\"Unitário\",\"Global\"},0),IF($A24=\"S\",$Y24/$X24,\"\"),($Y24/$X24)*100),0)","v":0},{"$f":"IF($Y24>0,CHOOSE(MATCH(RegimeExecucao,{\"Unitário\",\"Global\"},0),IF($A24=\"S\",ROUND($H24,ORÇAMENTO!$AF$10),\"\"),ROUND($I24,ORÇAMENTO!$AF$11)),\"\")","v":""},0,null,null,null,null,null,null,null,null,null,null,null,null,null,null,null,{"$f":"IF($A24=\"S\",IF(BM!$I24=0,0,CHOOSE(MATCH(RegimeExecucao,{\"Global\",\"Unitário\"},0),ROUND(ROUND(BM.MEDAcumulado,15-13*BM!$A$9)/100*BM!$I24,15-13*ORÇAMENTO!$AF$11),ROUND(ROUND(BM.MEDAcumulado,15-13*BM!$A$9)*ROUND(BM!$H24,15-13*ORÇAMENTO!$AF$10),15-13*ORÇAMENTO!$AF$11))),IF($A24=0,0,ROUND(SomaAgrupBM,15-13*ORÇAMENTO!$AF$11)))","v":0}]
[{"$f":"ORÇAMENTO!C25","v":"S"},{"$f":"ORÇAMENTO!D25","v":0},"F",{"$f":"ORÇAMENTO!O25","v":"1.2.4."},"EXECUÇÃO DE PASSEIO EM PISO INTERTRAVADO, COM BLOCO RETANGULAR COR NATURAL DE 20 X 10 CM, ESPESSURA 6 CM. AF_10/2022",{"$f":"IF(RegimeExecucao=\"Global\",\"\",ORÇAMENTO.Unidade)","v":"M2"},{"$f":"IF(RegimeExecucao=\"Global\",\"\",ORÇAMENTO!T25)","v":678.8},{"$f":"IF(RegimeExecucao=\"Global\",\"\",ORÇAMENTO!W25)","v":95.8},{"$f":"ORÇAMENTO!X25","v":65029.04},{"$f":"IF($A25=\"S\",IF(CAIXA.Modo,BM.AFAnterior,BM.MEDAnterior),IF(AND(RegimeExecucao=\"Global\",$I25>0,COUNTIF($AB$13:$AM$13,BM.medicao-1)>0),M25/$I25*100,0))","v":0},0,{"$f":"IF($A25=\"S\",IF(CAIXA.Modo,BM.AFAcumulado,BM.MEDAcumulado),IF(AND(RegimeExecucao=\"Global\",$I25>0,COUNTIF($AB$13:$AM$13,BM.medicao)>0),O25/$I25*100,0))","v":0},{"$f":"IF($A25=\"S\",VTOTALBM,IF($A25=0,0,ROUND(SomaAgrupBM,15-13*ORÇAMENTO!$AF$11)))","v":0},0,{"$f":"IF($A25=\"S\",VTOTALBM,IF($A25=0,0,ROUND(SomaAgrupBM,15-13*ORÇAMENTO!$AF$11)))","v":0},null,null,null,null,"","",{"$f":"IF(AND($W25>0,RegimeExecucao=\"Unitário\"),$F25,\"\")","v":""},{"$f":"IF($Y25>0,CHOOSE(MATCH(RegimeExecucao,{\"Unitário\",\"Global\"},0),IF($A25=\"S\",$Y25/$X25,\"\"),($Y25/$X25)*100),0)","v":0},{"$f":"IF($Y25>0,CHOOSE(MATCH(RegimeExecucao,{\"Unitário\",\"Global\"},0),IF($A25=\"S\",ROUND($H25,ORÇAMENTO!$AF$10),\"\"),ROUND($I25,ORÇAMENTO!$AF$11)),\"\")","v":""},0,null,null,null,null,null,null,null,null,null,null,null,null,null,null,null,{"$f":"IF($A25=\"S\",IF(BM!$I25=0,0,CHOOSE(MATCH(RegimeExecucao,{\"Global\",\"Unitário\"},0),ROUND(ROUND(BM.MEDAcumulado,15-13*BM!$A$9)/100*BM!$I25,15-13*ORÇAMENTO!$AF$11),ROUND(ROUND(BM.MEDAcumulado,15-13*BM!$A$9)*ROUND(BM!$H25,15-13*ORÇAMENTO!$AF$10),15-13*ORÇAMENTO!$AF$11))),IF($A25=0,0,ROUND(SomaAgrupBM,15-13*ORÇAMENTO!$AF$11)))","v":0}]
[{"$f":"ORÇAMENTO!C26","v":"S"},{"$f":"ORÇAMENTO!D26","v":0},"F",{"$f":"ORÇAMENTO!O26","v":"1.2.5."},"EXECUÇÃO DE PASSEIO (CALÇADA) OU PISO DE CONCRETO COM CONCRETO MOLDADO IN LOCO, FEITO EM OBRA, ACABAMENTO CONVENCIONAL, ESPESSURA 8 CM, ARMADO. AF_08/2022",{"$f":"IF(RegimeExecucao=\"Global\",\"\",ORÇAMENTO.Unidade)","v":"M2"},{"$f":"IF(RegimeExecucao=\"Global\",\"\",ORÇAMENTO!T26)","v":196.67},{"$f":"IF(RegimeExecucao=\"Global\",\"\",ORÇAMENTO!W26)","v":124.81},{"$f":"ORÇAMENTO!X26","v":24546.38},{"$f":"IF($A26=\"S\",IF(CAIXA.Modo,BM.AFAnterior,BM.MEDAnterior),IF(AND(RegimeExecucao=\"Global\",$I26>0,COUNTIF($AB$13:$AM$13,BM.medicao-1)>0),M26/$I26*100,0))","v":0},0,{"$f":"IF($A26=\"S\",IF(CAIXA.Modo,BM.AFAcumulado,BM.MEDAcumulado),IF(AND(RegimeExecucao=\"Global\",$I26>0,COUNTIF($AB$13:$AM$13,BM.medicao)>0),O26/$I26*100,0))","v":0},{"$f":"IF($A26=\"S\",VTOTALBM,IF($A26=0,0,ROUND(SomaAgrupBM,15-13*ORÇAMENTO!$AF$11)))","v":0},0,{"$f":"IF($A26=\"S\",VTOTALBM,IF($A26=0,0,ROUND(SomaAgrupBM,15-13*ORÇAMENTO!$AF$11)))","v":0},null,null,null,null,"","",{"$f":"IF(AND($W26>0,RegimeExecucao=\"Unitário\"),$F26,\"\")","v":""},{"$f":"IF($Y26>0,CHOOSE(MATCH(RegimeExecucao,{\"Unitário\",\"Global\"},0),IF($A26=\"S\",$Y26/$X26,\"\"),($Y26/$X26)*100),0)","v":0},{"$f":"IF($Y26>0,CHOOSE(MATCH(RegimeExecucao,{\"Unitário\",\"Global\"},0),IF($A26=\"S\",ROUND($H26,ORÇAMENTO!$AF$10),\"\"),ROUND($I26,ORÇAMENTO!$AF$11)),\"\")","v":""},0,null,null,null,null,null,null,null,null,null,null,null,null,null,null,null,{"$f":"IF($A26=\"S\",IF(BM!$I26=0,0,CHOOSE(MATCH(RegimeExecucao,{\"Global\",\"Unitário\"},0),ROUND(ROUND(BM.MEDAcumulado,15-13*BM!$A$9)/100*BM!$I26,15-13*ORÇAMENTO!$AF$11),ROUND(ROUND(BM.MEDAcumulado,15-13*BM!$A$9)*ROUND(BM!$H26,15-13*ORÇAMENTO!$AF$10),15-13*ORÇAMENTO!$AF$11))),IF($A26=0,0,ROUND(SomaAgrupBM,15-13*ORÇAMENTO!$AF$11)))","v":0}]
[{"$f":"ORÇAMENTO!C27","v":"S"},{"$f":"ORÇAMENTO!D27","v":0},"F",{"$f":"ORÇAMENTO!O27","v":"1.2.6."},"PISO PODOTÁTIL DE ALERTA OU DIRECIONAL, DE CONCRETO, ASSENTADO SOBRE ARGAMASSA. AF_03/2024",{"$f":"IF(RegimeExecucao=\"Global\",\"\",ORÇAMENTO.Unidade)","v":"M2"},{"$f":"IF(RegimeExecucao=\"Global\",\"\",ORÇAMENTO!T27)","v":81.16},{"$f":"IF(RegimeExecucao=\"Global\",\"\",ORÇAMENTO!W27)","v":183.74},{"$f":"ORÇAMENTO!X27","v":14912.34},{"$f":"IF($A27=\"S\",IF(CAIXA.Modo,BM.AFAnterior,BM.MEDAnterior),IF(AND(RegimeExecucao=\"Global\",$I27>0,COUNTIF($AB$13:$AM$13,BM.medicao-1)>0),M27/$I27*100,0))","v":0},0,{"$f":"IF($A27=\"S\",IF(CAIXA.Modo,BM.AFAcumulado,BM.MEDAcumulado),IF(AND(RegimeExecucao=\"Global\",$I27>0,COUNTIF($AB$13:$AM$13,BM.medicao)>0),O27/$I27*100,0))","v":0},{"$f":"IF($A27=\"S\",VTOTALBM,IF($A27=0,0,ROUND(SomaAgrupBM,15-13*ORÇAMENTO!$AF$11)))","v":0},0,{"$f":"IF($A27=\"S\",VTOTALBM,IF($A27=0,0,ROUND(SomaAgrupBM,15-13*ORÇAMENTO!$AF$11)))","v":0},null,null,null,null,"","",{"$f":"IF(AND($W27>0,RegimeExecucao=\"Unitário\"),$F27,\"\")","v":""},{"$f":"IF($Y27>0,CHOOSE(MATCH(RegimeExecucao,{\"Unitário\",\"Global\"},0),IF($A27=\"S\",$Y27/$X27,\"\"),($Y27/$X27)*100),0)","v":0},{"$f":"IF($Y27>0,CHOOSE(MATCH(RegimeExecucao,{\"Unitário\",\"Global\"},0),IF($A27=\"S\",ROUND($H27,ORÇAMENTO!$AF$10),\"\"),ROUND($I27,ORÇAMENTO!$AF$11)),\"\")","v":""},0,null,null,null,null,null,null,null,null,null,null,null,null,null,null,null,{"$f":"IF($A27=\"S\",IF(BM!$I27=0,0,CHOOSE(MATCH(RegimeExecucao,{\"Global\",\"Unitário\"},0),ROUND(ROUND(BM.MEDAcumulado,15-13*BM!$A$9)/100*BM!$I27,15-13*ORÇAMENTO!$AF$11),ROUND(ROUND(BM.MEDAcumulado,15-13*BM!$A$9)*ROUND(BM!$H27,15-13*ORÇAMENTO!$AF$10),15-13*ORÇAMENTO!$AF$11))),IF($A27=0,0,ROUND(SomaAgrupBM,15-13*ORÇAMENTO!$AF$11)))","v":0}]
[{"$f":"ORÇAMENTO!C28","v":2},{"$f":"ORÇAMENTO!D28","v":2},{"$f":"IF(OR($I28>0,$A28=1,$A28=2,$A28=3,$A28=4),\"F\",\"\")","v":"F"},{"$f":"ORÇAMENTO!O28","v":"1.3."},{"$f":"ORÇAMENTO.Descricao","v":"PAISAGISMO"},{"$f":"IF(RegimeExecucao=\"Global\",\"\",ORÇAMENTO.Unidade)","v":"-"},{"$f":"IF(RegimeExecucao=\"Global\",\"\",ORÇAMENTO!T28)","v":0},{"$f":"IF(RegimeExecucao=\"Global\",\"\",ORÇAMENTO!W28)","v":0},{"$f":"ORÇAMENTO!X28","v":1827.65},{"$f":"IF($A28=\"S\",IF(CAIXA.Modo,BM.AFAnterior,BM.MEDAnterior),IF(AND(RegimeExecucao=\"Global\",$I28>0,COUNTIF($AB$13:$AM$13,BM.medicao-1)>0),M28/$I28*100,0))","v":0},{"$f":"L28-J28","v":0},{"$f":"IF($A28=\"S\",IF(CAIXA.Modo,BM.AFAcumulado,BM.MEDAcumulado),IF(AND(RegimeExecucao=\"Global\",$I28>0,COUNTIF($AB$13:$AM$13,BM.medicao)>0),O28/$I28*100,0))","v":0},{"$f":"IF($A28=\"S\",VTOTALBM,IF($A28=0,0,ROUND(SomaAgrupBM,15-13*ORÇAMENTO!$AF$11)))","v":0},{"$f":"O28-M28","v":0},{"$f":"IF($A28=\"S\",VTOTALBM,IF($A28=0,0,ROUND(SomaAgrupBM,15-13*ORÇAMENTO!$AF$11)))","v":0},null,null,null,null,{"$f":"IF($W28>0,$D28,\"\")","v":""},{"$f":"IF($W28>0,$E28,\"\")","v":""},{"$f":"IF(AND($W28>0,RegimeExecucao=\"Unitário\"),$F28,\"\")","v":""},{"$f":"IF($Y28>0,CHOOSE(MATCH(RegimeExecucao,{\"Unitário\",\"Global\"},0),IF($A28=\"S\",$Y28/$X28,\"\"),($Y28/$X28)*100),0)","v":0},{"$f":"IF($Y28>0,CHOOSE(MATCH(RegimeExecucao,{\"Unitário\",\"Global\"},0),IF($A28=\"S\",ROUND($H28,ORÇAMENTO!$AF$10),\"\"),ROUND($I28,ORÇAMENTO!$AF$11)),\"\")","v":""},{"$f":"AO28-O28","v":0},null,null,null,null,null,null,null,null,null,null,null,null,null,null,null,{"$f":"IF($A28=\"S\",IF(BM!$I28=0,0,CHOOSE(MATCH(RegimeExecucao,{\"Global\",\"Unitário\"},0),ROUND(ROUND(BM.MEDAcumulado,15-13*BM!$A$9)/100*BM!$I28,15-13*ORÇAMENTO!$AF$11),ROUND(ROUND(BM.MEDAcumulado,15-13*BM!$A$9)*ROUND(BM!$H28,15-13*ORÇAMENTO!$AF$10),15-13*ORÇAMENTO!$AF$11))),IF($A28=0,0,ROUND(SomaAgrupBM,15-13*ORÇAMENTO!$AF$11)))","v":0}]
[{"$f":"ORÇAMENTO!C29","v":"S"},{"$f":"ORÇAMENTO!D29","v":0},"F",{"$f":"ORÇAMENTO!O29","v":"1.3.1."},"PLANTIO DE GRAMA BATATAIS EM PLACAS. AF_07/2024",{"$f":"IF(RegimeExecucao=\"Global\",\"\",ORÇAMENTO.Unidade)","v":"M2"},{"$f":"IF(RegimeExecucao=\"Global\",\"\",ORÇAMENTO!T29)","v":65.319999999999993},{"$f":"IF(RegimeExecucao=\"Global\",\"\",ORÇAMENTO!W29)","v":27.98},{"$f":"ORÇAMENTO!X29","v":1827.65},{"$f":"IF($A29=\"S\",IF(CAIXA.Modo,BM.AFAnterior,BM.MEDAnterior),IF(AND(RegimeExecucao=\"Global\",$I29>0,COUNTIF($AB$13:$AM$13,BM.medicao-1)>0),M29/$I29*100,0))","v":0},0,{"$f":"IF($A29=\"S\",IF(CAIXA.Modo,BM.AFAcumulado,BM.MEDAcumulado),IF(AND(RegimeExecucao=\"Global\",$I29>0,COUNTIF($AB$13:$AM$13,BM.medicao)>0),O29/$I29*100,0))","v":0},{"$f":"IF($A29=\"S\",VTOTALBM,IF($A29=0,0,ROUND(SomaAgrupBM,15-13*ORÇAMENTO!$AF$11)))","v":0},0,{"$f":"IF($A29=\"S\",VTOTALBM,IF($A29=0,0,ROUND(SomaAgrupBM,15-13*ORÇAMENTO!$AF$11)))","v":0},null,null,null,null,"","",{"$f":"IF(AND($W29>0,RegimeExecucao=\"Unitário\"),$F29,\"\")","v":""},{"$f":"IF($Y29>0,CHOOSE(MATCH(RegimeExecucao,{\"Unitário\",\"Global\"},0),IF($A29=\"S\",$Y29/$X29,\"\"),($Y29/$X29)*100),0)","v":0},{"$f":"IF($Y29>0,CHOOSE(MATCH(RegimeExecucao,{\"Unitário\",\"Global\"},0),IF($A29=\"S\",ROUND($H29,ORÇAMENTO!$AF$10),\"\"),ROUND($I29,ORÇAMENTO!$AF$11)),\"\")","v":""},0,null,null,null,null,null,null,null,null,null,null,null,null,null,null,null,{"$f":"IF($A29=\"S\",IF(BM!$I29=0,0,CHOOSE(MATCH(RegimeExecucao,{\"Global\",\"Unitário\"},0),ROUND(ROUND(BM.MEDAcumulado,15-13*BM!$A$9)/100*BM!$I29,15-13*ORÇAMENTO!$AF$11),ROUND(ROUND(BM.MEDAcumulado,15-13*BM!$A$9)*ROUND(BM!$H29,15-13*ORÇAMENTO!$AF$10),15-13*ORÇAMENTO!$AF$11))),IF($A29=0,0,ROUND(SomaAgrupBM,15-13*ORÇAMENTO!$AF$11)))","v":0}]
[{"$f":"ORÇAMENTO!C30","v":2},{"$f":"ORÇAMENTO!D30","v":4},{"$f":"IF(OR($I30>0,$A30=1,$A30=2,$A30=3,$A30=4),\"F\",\"\")","v":"F"},{"$f":"ORÇAMENTO!O30","v":"1.4."},{"$f":"ORÇAMENTO.Descricao","v":"LIMPEZA DA OBRA"},{"$f":"IF(RegimeExecucao=\"Global\",\"\",ORÇAMENTO.Unidade)","v":"-"},{"$f":"IF(RegimeExecucao=\"Global\",\"\",ORÇAMENTO!T30)","v":0},{"$f":"IF(RegimeExecucao=\"Global\",\"\",ORÇAMENTO!W30)","v":0},{"$f":"ORÇAMENTO!X30","v":7924.5},{"$f":"IF($A30=\"S\",IF(CAIXA.Modo,BM.AFAnterior,BM.MEDAnterior),IF(AND(RegimeExecucao=\"Global\",$I30>0,COUNTIF($AB$13:$AM$13,BM.medicao-1)>0),M30/$I30*100,0))","v":0},{"$f":"L30-J30","v":0},{"$f":"IF($A30=\"S\",IF(CAIXA.Modo,BM.AFAcumulado,BM.MEDAcumulado),IF(AND(RegimeExecucao=\"Global\",$I30>0,COUNTIF($AB$13:$AM$13,BM.medicao)>0),O30/$I30*100,0))","v":0},{"$f":"IF($A30=\"S\",VTOTALBM,IF($A30=0,0,ROUND(SomaAgrupBM,15-13*ORÇAMENTO!$AF$11)))","v":0},{"$f":"O30-M30","v":0},{"$f":"IF($A30=\"S\",VTOTALBM,IF($A30=0,0,ROUND(SomaAgrupBM,15-13*ORÇAMENTO!$AF$11)))","v":0},null,null,null,null,{"$f":"IF($W30>0,$D30,\"\")","v":""},{"$f":"IF($W30>0,$E30,\"\")","v":""},{"$f":"IF(AND($W30>0,RegimeExecucao=\"Unitário\"),$F30,\"\")","v":""},{"$f":"IF($Y30>0,CHOOSE(MATCH(RegimeExecucao,{\"Unitário\",\"Global\"},0),IF($A30=\"S\",$Y30/$X30,\"\"),($Y30/$X30)*100),0)","v":0},{"$f":"IF($Y30>0,CHOOSE(MATCH(RegimeExecucao,{\"Unitário\",\"Global\"},0),IF($A30=\"S\",ROUND($H30,ORÇAMENTO!$AF$10),\"\"),ROUND($I30,ORÇAMENTO!$AF$11)),\"\")","v":""},{"$f":"AO30-O30","v":0},null,null,null,null,null,null,null,null,null,null,null,null,null,null,null,{"$f":"IF($A30=\"S\",IF(BM!$I30=0,0,CHOOSE(MATCH(RegimeExecucao,{\"Global\",\"Unitário\"},0),ROUND(ROUND(BM.MEDAcumulado,15-13*BM!$A$9)/100*BM!$I30,15-13*ORÇAMENTO!$AF$11),ROUND(ROUND(BM.MEDAcumulado,15-13*BM!$A$9)*ROUND(BM!$H30,15-13*ORÇAMENTO!$AF$10),15-13*ORÇAMENTO!$AF$11))),IF($A30=0,0,ROUND(SomaAgrupBM,15-13*ORÇAMENTO!$AF$11)))","v":0}]
[{"$f":"ORÇAMENTO!C31","v":"S"},{"$f":"ORÇAMENTO!D31","v":0},"F",{"$f":"ORÇAMENTO!O31","v":"1.4.1."},"CARGA, MANOBRA E DESCARGA DE ENTULHO EM CAMINHÃO BASCULANTE 6 M³ - CARGA COM ESCAVADEIRA HIDRÁULICA  (CAÇAMBA DE 0,80 M³ / 111 HP) E DESCARGA LIVRE (UNIDADE: M3). AF_07/2020",{"$f":"IF(RegimeExecucao=\"Global\",\"\",ORÇAMENTO.Unidade)","v":"M3"},{"$f":"IF(RegimeExecucao=\"Global\",\"\",ORÇAMENTO!T31)","v":45},{"$f":"IF(RegimeExecucao=\"Global\",\"\",ORÇAMENTO!W31)","v":12.6},{"$f":"ORÇAMENTO!X31","v":567},{"$f":"IF($A31=\"S\",IF(CAIXA.Modo,BM.AFAnterior,BM.MEDAnterior),IF(AND(RegimeExecucao=\"Global\",$I31>0,COUNTIF($AB$13:$AM$13,BM.medicao-1)>0),M31/$I31*100,0))","v":0},0,{"$f":"IF($A31=\"S\",IF(CAIXA.Modo,BM.AFAcumulado,BM.MEDAcumulado),IF(AND(RegimeExecucao=\"Global\",$I31>0,COUNTIF($AB$13:$AM$13,BM.medicao)>0),O31/$I31*100,0))","v":0},{"$f":"IF($A31=\"S\",VTOTALBM,IF($A31=0,0,ROUND(SomaAgrupBM,15-13*ORÇAMENTO!$AF$11)))","v":0},0,{"$f":"IF($A31=\"S\",VTOTALBM,IF($A31=0,0,ROUND(SomaAgrupBM,15-13*ORÇAMENTO!$AF$11)))","v":0},null,null,null,null,"","",{"$f":"IF(AND($W31>0,RegimeExecucao=\"Unitário\"),$F31,\"\")","v":""},{"$f":"IF($Y31>0,CHOOSE(MATCH(RegimeExecucao,{\"Unitário\",\"Global\"},0),IF($A31=\"S\",$Y31/$X31,\"\"),($Y31/$X31)*100),0)","v":0},{"$f":"IF($Y31>0,CHOOSE(MATCH(RegimeExecucao,{\"Unitário\",\"Global\"},0),IF($A31=\"S\",ROUND($H31,ORÇAMENTO!$AF$10),\"\"),ROUND($I31,ORÇAMENTO!$AF$11)),\"\")","v":""},0,null,null,null,null,null,null,null,null,null,null,null,null,null,null,null,{"$f":"IF($A31=\"S\",IF(BM!$I31=0,0,CHOOSE(MATCH(RegimeExecucao,{\"Global\",\"Unitário\"},0),ROUND(ROUND(BM.MEDAcumulado,15-13*BM!$A$9)/100*BM!$I31,15-13*ORÇAMENTO!$AF$11),ROUND(ROUND(BM.MEDAcumulado,15-13*BM!$A$9)*ROUND(BM!$H31,15-13*ORÇAMENTO!$AF$10),15-13*ORÇAMENTO!$AF$11))),IF($A31=0,0,ROUND(SomaAgrupBM,15-13*ORÇAMENTO!$AF$11)))","v":0}]
[{"$f":"ORÇAMENTO!C32","v":"S"},{"$f":"ORÇAMENTO!D32","v":0},"F",{"$f":"ORÇAMENTO!O32","v":"1.4.2."},"TRANSPORTE COM CAMINHÃO BASCULANTE DE 6 M³, EM VIA URBANA PAVIMENTADA, DMT ATÉ 30 KM (UNIDADE: M3XKM). AF_07/2020",{"$f":"IF(RegimeExecucao=\"Global\",\"\",ORÇAMENTO.Unidade)","v":"M3XKM"},{"$f":"IF(RegimeExecucao=\"Global\",\"\",ORÇAMENTO!T32)","v":1350},{"$f":"IF(RegimeExecucao=\"Global\",\"\",ORÇAMENTO!W32)","v":3.89},{"$f":"ORÇAMENTO!X32","v":5251.5},{"$f":"IF($A32=\"S\",IF(CAIXA.Modo,BM.AFAnterior,BM.MEDAnterior),IF(AND(RegimeExecucao=\"Global\",$I32>0,COUNTIF($AB$13:$AM$13,BM.medicao-1)>0),M32/$I32*100,0))","v":0},0,{"$f":"IF($A32=\"S\",IF(CAIXA.Modo,BM.AFAcumulado,BM.MEDAcumulado),IF(AND(RegimeExecucao=\"Global\",$I32>0,COUNTIF($AB$13:$AM$13,BM.medicao)>0),O32/$I32*100,0))","v":0},{"$f":"IF($A32=\"S\",VTOTALBM,IF($A32=0,0,ROUND(SomaAgrupBM,15-13*ORÇAMENTO!$AF$11)))","v":0},0,{"$f":"IF($A32=\"S\",VTOTALBM,IF($A32=0,0,ROUND(SomaAgrupBM,15-13*ORÇAMENTO!$AF$11)))","v":0},null,null,null,null,"","",{"$f":"IF(AND($W32>0,RegimeExecucao=\"Unitário\"),$F32,\"\")","v":""},{"$f":"IF($Y32>0,CHOOSE(MATCH(RegimeExecucao,{\"Unitário\",\"Global\"},0),IF($A32=\"S\",$Y32/$X32,\"\"),($Y32/$X32)*100),0)","v":0},{"$f":"IF($Y32>0,CHOOSE(MATCH(RegimeExecucao,{\"Unitário\",\"Global\"},0),IF($A32=\"S\",ROUND($H32,ORÇAMENTO!$AF$10),\"\"),ROUND($I32,ORÇAMENTO!$AF$11)),\"\")","v":""},0,null,null,null,null,null,null,null,null,null,null,null,null,null,null,null,{"$f":"IF($A32=\"S\",IF(BM!$I32=0,0,CHOOSE(MATCH(RegimeExecucao,{\"Global\",\"Unitário\"},0),ROUND(ROUND(BM.MEDAcumulado,15-13*BM!$A$9)/100*BM!$I32,15-13*ORÇAMENTO!$AF$11),ROUND(ROUND(BM.MEDAcumulado,15-13*BM!$A$9)*ROUND(BM!$H32,15-13*ORÇAMENTO!$AF$10),15-13*ORÇAMENTO!$AF$11))),IF($A32=0,0,ROUND(SomaAgrupBM,15-13*ORÇAMENTO!$AF$11)))","v":0}]
[{"$f":"ORÇAMENTO!C33","v":"S"},{"$f":"ORÇAMENTO!D33","v":0},"F",{"$f":"ORÇAMENTO!O33","v":"1.4.3."},"TRANSPORTE COM CAMINHÃO BASCULANTE DE 6 M³, EM VIA URBANA PAVIMENTADA, ADICIONAL PARA DMT EXCEDENTE A 30 KM (UNIDADE: M3XKM). AF_07/2020",{"$f":"IF(RegimeExecucao=\"Global\",\"\",ORÇAMENTO.Unidade)","v":"M3XKM"},{"$f":"IF(RegimeExecucao=\"Global\",\"\",ORÇAMENTO!T33)","v":1350},{"$f":"IF(RegimeExecucao=\"Global\",\"\",ORÇAMENTO!W33)","v":1.56},{"$f":"ORÇAMENTO!X33","v":2106},{"$f":"IF($A33=\"S\",IF(CAIXA.Modo,BM.AFAnterior,BM.MEDAnterior),IF(AND(RegimeExecucao=\"Global\",$I33>0,COUNTIF($AB$13:$AM$13,BM.medicao-1)>0),M33/$I33*100,0))","v":0},0,{"$f":"IF($A33=\"S\",IF(CAIXA.Modo,BM.AFAcumulado,BM.MEDAcumulado),IF(AND(RegimeExecucao=\"Global\",$I33>0,COUNTIF($AB$13:$AM$13,BM.medicao)>0),O33/$I33*100,0))","v":0},{"$f":"IF($A33=\"S\",VTOTALBM,IF($A33=0,0,ROUND(SomaAgrupBM,15-13*ORÇAMENTO!$AF$11)))","v":0},0,{"$f":"IF($A33=\"S\",VTOTALBM,IF($A33=0,0,ROUND(SomaAgrupBM,15-13*ORÇAMENTO!$AF$11)))","v":0},null,null,null,null,"","",{"$f":"IF(AND($W33>0,RegimeExecucao=\"Unitário\"),$F33,\"\")","v":""},{"$f":"IF($Y33>0,CHOOSE(MATCH(RegimeExecucao,{\"Unitário\",\"Global\"},0),IF($A33=\"S\",$Y33/$X33,\"\"),($Y33/$X33)*100),0)","v":0},{"$f":"IF($Y33>0,CHOOSE(MATCH(RegimeExecucao,{\"Unitário\",\"Global\"},0),IF($A33=\"S\",ROUND($H33,ORÇAMENTO!$AF$10),\"\"),ROUND($I33,ORÇAMENTO!$AF$11)),\"\")","v":""},0,null,null,null,null,null,null,null,null,null,null,null,null,null,null,null,{"$f":"IF($A33=\"S\",IF(BM!$I33=0,0,CHOOSE(MATCH(RegimeExecucao,{\"Global\",\"Unitário\"},0),ROUND(ROUND(BM.MEDAcumulado,15-13*BM!$A$9)/100*BM!$I33,15-13*ORÇAMENTO!$AF$11),ROUND(ROUND(BM.MEDAcumulado,15-13*BM!$A$9)*ROUND(BM!$H33,15-13*ORÇAMENTO!$AF$10),15-13*ORÇAMENTO!$AF$11))),IF($A33=0,0,ROUND(SomaAgrupBM,15-13*ORÇAMENTO!$AF$11)))","v":0}]
[null,null,"F"]
[]
[null,null,null,"Observações:",null,null,null,null,null,null,null,null,null,null,null,null,null,null,null,"Observações"]
[]
[]
[]
[]
[null,null,null,{"$f":"IF(OR(AND(ORÇAMENTO!$AF$7=FALSE,ORÇAMENTO!$AF$10=FALSE,RegimeExecucao=\"Global\"),AND(ORÇAMENTO!$AF$7=FALSE,ORÇAMENTO!$AF$10=FALSE,ORÇAMENTO!$AF$11=FALSE,BM!$A$9=FALSE)),\"Não foi considerado arredondamento nos valores da planilha.\",CONCATENATE(\"Foi considerado arredondamento de duas casas decimais para \",IF(AND(RegimeExecucao=\"Unitário\",ORÇAMENTO!$AF$7=TRUE),\"Quantidade; \",\"\"),IF(AND(RegimeExecucao=\"Unitário\",ORÇAMENTO!$AF$10=TRUE),\"Preço unitário; \",\"\"),IF(ORÇAMENTO!$AF$11=TRUE,\"Preço total; \",\"\"),,IF(BM!$A$9=TRUE,\"Medição.\",\"\")))","v":"Foi considerado arredondamento de duas casas decimais para Quantidade; Preço unitário; Preço total; Medição."}]
[]
[null,null,null,{"$f":"IF(CAIXA.Modo,\"\",\"Os serviços medidos informados neste BM encontram-se concluídos, estão em conformidade com os projetos e especificações aceitos pela CAIXA e foram executados de acordo com as normas técnicas.\")","v":"Os serviços medidos informados neste BM encontram-se concluídos, estão em conformidade com os projetos e especificações aceitos pela CAIXA e foram executados de acordo com as normas técnicas."}]
[null,null,null,null,{"$f":"Import.Município","v":"TRAMANDAÍ/RS"}]
[null,null,null,null,"Local",null,null,null,null,"Responsável Técnico pela Fiscalização",null,null,null,null,null,null,null,null,null,null,null,null,"Profissional CAIXA:"]
[null,null,null,null,null,null,null,null,null,"Nome:",{"$f":"Import.RespFiscalização","v":0},null,null,null,null,null,null,null,null,null,null,null,"Nome:"]
[null,null,null,null,{"$f":"DADOS!$F$48","v":"2025-03-14"},null,null,null,null,"Profissão:",0,null,null,null,null,null,null,null,null,null,null,null,"Matrícula"]
[null,null,null,null,"Data",null,null,null,null,"CREA/CAU:",0,null,null,null,null,null,null,null,null,null,null,null,"CREA/CAU:"]
[null,null,null,null,null,null,null,null,null,"ART/RRT:",0]

{"sheet":"RRE","index":12,"n_rows":49,"n_cols":41,"rows_kept":49,"cut":false,"hidden":false,"merged":[[5,4,5,7],[5,8,5,11],[2,4,2,7],[2,8,2,10],[3,4,3,7],[3,8,3,10],[6,3,10,3],[6,4,6,7],[6,8,6,11],[8,6,8,7],[8,8,8,9],[8,11,9,11],[9,6,9,7],[9,35,9,40],[10,24,10,25],[10,28,10,30],[10,31,10,33],[10,35,10,37],[10,38,10,40],[26,9,26,10],[27,9,27,10],[28,14,28,15],[47,12,47,14],[9,28,9,33],[3,12,3,14],[48,12,48,14],[30,4,32,15],[34,11,34,14],[39,12,39,14],[40,12,40,14],[41,12,41,14],[46,12,46,14],[48,5,48,6],[34,4,34,6],[46,5,46,6],[47,5,47,6],[23,9,23,10],[23,15,27,15],[24,9,24,10],[25,9,25,10]]}
[null,null,null,null,null,{"$f":"CONCATENATE(\"RRE - RELATÓRIO RESUMO DO EMPREENDIMENTO - \",IF(CAIXA.Modo,\"CAIXA\",\"TOMADOR\"))","v":"RRE - RELATÓRIO RESUMO DO EMPREENDIMENTO - TOMADOR"},null,null,null,null,null,null,null,null,null,null,null,null,null,null,null,null,null,null,null,null,null,null,null,"Acum. Previsto","Acum. Chegada"]
[null,null,null,null,null,null,null,null,null,null,null,null,null,null,null,null,null,null,null,null,null,null,null,null,null,null,null,null,{"$f":"J25","v":"Repasse"},{"$f":"AD6-AD4-AD3","v":0},{"$f":"AE6-AE4-AE3","v":0}]
[null,null,null,null,"PROPONENTE / TOMADOR",null,null,null,"Nº OPERAÇÃO",null,null,"Nº TransfereGOV",null,null,null,"RECURSO",null,null,null,null,null,null,null,null,null,null,null,null,"CP",{"$f":"SUM(T13:OFFSET(T24,-1,0))","v":0},{"$f":"IF(OR($O$28<$M$28,$M$26>$AD$3),MIN($M$26,$L$26),MIN($AD$3,$N$28-$N$27+$M$26))","v":0}]
[null,null,null,null,{"$f":"Import.Proponente","v":"PREFEITURA MUNICIPAL DE TRAMANDAÍ "},null,null,null,{"$f":"Import.CR","v":"109437911"},null,null,{"$f":"Import.TransfereGOV","v":"02829/2024"},"VALORES CONTRATADOS (R$):",null,null,{"$f":"import.recurso","v":"OGU"},null,null,null,null,null,null,null,null,null,null,null,null,"Outros",{"$f":"SUM(U13:OFFSET(U24,-1,0))","v":0},{"$f":"IF(OR($O$28<$M$28,$M$27>$AD$4),MIN($M$27,$L$27),MIN($AD$4,$N$28+$M$27))","v":0}]
[]
[null,null,null,null,"APELIDO DO EMPREENDIMENTO",null,null,null,"MUNICÍPIO / UF",null,null,null,{"$f":"IF(import.recurso=\"FGTS\",\"FINANCIAMENTO\",\"REPASSE\")","v":"REPASSE"},"CONTRAPARTIDA","INVESTIMENTO","Nº RRE",null,null,null,null,null,null,null,null,null,null,null,null,"Investimento",{"$f":"$O$28","v":0},{"$f":"AD6","v":0}]
[null,null,null,"FILTRO",{"$f":"Import.Apelido","v":"INFRAESTRUTURA EMEI PORTAL DAS FLORES"},null,null,null,{"$f":"Import.Município","v":"TRAMANDAÍ/RS"},null,null,null,{"$f":"Import.Repasse","v":0},{"$f":"Import.Contrapartida","v":0},{"$f":"M7+N7","v":0},{"$f":"IF(ACOMPANHAMENTO=\"PLE\",PLE.Medicao,BM.medicao)","v":1}]
[]
[null,null,null,null,null,null,"Situação do TC/CR:",null,"Percentual previsto em:",null,null,"Saldo a Reprogramar","Repasse (R$)","Contrapartida (R$)",null,null,null,null,null,null,null,"Lista CTEF"]
[null,null,null,null,null,null,{"$f":"IF(J10=\"-\",\"-\",IF($P$24<J10,\"Atrasada\",IF($P$24>J10,\"Adiantada\",\"Normal\")))","v":"Normal"},null,{"$f":"DATE(YEAR($L$35),MONTH($L$35),1)","v":"2025-03-01"},{"$f":"IF($I$10<DATE(YEAR(CRONO!$T$13),MONTH(CRONO!$T$13),1),0,IF($I$10>CRONO!$AE$13,1,INDEX(CRONO!$S$35:$AG$35,MATCH(RRE!$I$10,CRONO!$S$13:$AG$13,0))))","v":0},null,null,{"$f":"QCI!L10","v":0},{"$f":"QCI!M10","v":-196407.48},null,null,null,null,null,null,null,null,null,null,null,null,null,null,"PLE",null,null,null,null,null,null,"BM"]
[null,null,null,null,null,null,null,null,null,null,null,null,{"$f":"IF(CAIXA.Modo,\"Valores Aferidos (R$)\",\"Valores Medidos (R$)\")","v":"Valores Medidos (R$)"},null,null,null,null,null,null,null,null,"Lista CTEFs",null,null,{"$f":"IF(CAIXA.Modo,\"Valores Aferidos (R$)\",\"Valores Medidos (R$)\")","v":"Valores Medidos (R$)"},null,null,null,"Acumulado Período Anterior",null,null,"Acumulado incluindo o Período",null,null,null,"Acumulado Período Anterior",null,null,"Acumulado incluindo o Período"]
[{"$f":"MATCH(E12,ORÇAMENTO!$E$15:$E$34,0)-1","v":{"$error":"#N/A"}},{"$f":"IF(ISERROR($A12),NA(),OFFSET(ORÇAMENTO!$D$15,$A12,0))","v":{"$error":"#N/A"}},{"$f":"QCI!B12","v":"Branco"},{"$f":"IF(L12>0,\"F\",\"\")","v":""},{"$f":"QCI!D12","v":-1},{"$f":"QCI!G12","v":""},{"$f":"QCI!H12","v":0},{"$f":"QCI!I12","v":0},{"$f":"QCI!J12","v":""},{"$f":"QCI!K12","v":""},{"$f":"IF($C12=\"Automático\",IF(ACOMPANHAMENTO=\"BM\",BM.medicao,PLE.Medicao),IF(ISBLANK($X12),\"\",$X12))","v":""},{"$f":"QCI!$O12","v":0},{"$f":"ROUND(IF(C12=\"Automático\",AE12+AL12,Y12),2)","v":0},{"$f":"O12-M12","v":0},{"$f":"ROUND(IF(C12=\"Automático\",AH12+AO12,Z12),2)","v":0},{"$f":"O12/(L12+10^-12)","v":0},null,{"$f":"ROUND(IF($C12=\"Automático\",AC12+AJ12,$Y12*IF(ISERROR(QCI!$AA12/QCI!$O12),0,QCI!$AA12/QCI!$O12)),2)","v":0},{"$f":"ROUND(IF($C12=\"Automático\",AD12+AK12,$Y12*IF(ISERROR(QCI!$AB12/QCI!$O12),0,QCI!$AB12/QCI!$O12)),2)","v":0},{"$f":"ROUND(IF($C12=\"Automático\",AF12+AM12,$Z12*IF(ISERROR(QCI!$AA12/QCI!$O12),0,QCI!$AA12/QCI!$O12)),2)","v":0},{"$f":"ROUND(IF($C12=\"Automático\",AG12+AN12,$Z12*IF(ISERROR(QCI!$AB12/QCI!$O12),0,QCI!$AB12/QCI!$O12)),2)","v":0},{"$f":"IF(AND($L12>0,$J12<>0,$J12<>\"\",COUNTIF($J12:$J$13,$J12)=1),OFFSET(V12,-1,0)+1,OFFSET(V12,-1,0))","v":"Lista CTEFs"},null,null,null,null,null,null,{"$f":"IF(ACOMPANHAMENTO<>\"PLE\",0,SUMPRODUCT((OFFSET(CÁLCULO!$AX$15:$BH$15,$A12,0,$B12)<=(PLE.Medicao-1))*OFFSET(CÁLCULO!$AB$15:$AL$15,$A12,0,$B12)*OFFSET(ORÇAMENTO!$AA$15,$A12,0,$B12)/(OFFSET(ORÇAMENTO!$X$15,$A12,0,$B12)+10^-12))+IF(AUTOEVENTO=\"Manual\",SUMPRODUCT((OFFSET(CÁLCULO!$M$15,$A12,0,$B12)=1)*OFFSET(ORÇAMENTO!$AA$15,$A12,0,$B12)*(PLE!$AE$9-PLE!$Y$9)),0))","v":0},{"$f":"IF(ACOMPANHAMENTO<>\"PLE\",0,SUMPRODUCT((OFFSET(CÁLCULO!$AX$15:$BH$15,$A12,0,$B12)<=(PLE.Medicao-1))*OFFSET(CÁLCULO!$AB$15:$AL$15,$A12,0,$B12)*OFFSET(ORÇAMENTO!$AB$15,$A12,0,$B12)/(OFFSET(ORÇAMENTO!$X$15,$A12,0,$B12)+10^-12))+IF(AUTOEVENTO=\"Manual\",SUMPRODUCT((OFFSET(CÁLCULO!$M$15,$A12,0,$B12)=1)*OFFSET(ORÇAMENTO!$AB$15,$A12,0,$B12)*(PLE!$AE$9-PLE!$Y$9)),0))","v":0},{"$f":"ROUND(IF(ACOMPANHAMENTO<>\"PLE\",0,SUMIF(OFFSET(CÁLCULO!$AX$15:$BH$15,$A12,0,$B12),\"<=\"&(PLE.Medicao-1),OFFSET(CÁLCULO!$AB$15:$AL$15,$A12,0,$B12))+IF(AUTOEVENTO=\"Manual\",SUMIF(OFFSET(CÁLCULO!$M$15,$A12,0,$B12),1,OFFSET(ORÇAMENTO!$X$15,$A12,0,$B12))*(PLE!$AE$9-PLE!$Y$9),0)),2)","v":0},{"$f":"IF(ACOMPANHAMENTO<>\"PLE\",0,SUMPRODUCT((OFFSET(CÁLCULO!$AX$15:$BH$15,$A12,0,$B12)<=PLE.Medicao)*OFFSET(CÁLCULO!$AB$15:$AL$15,$A12,0,$B12)*OFFSET(ORÇAMENTO!$AA$15,$A12,0,$B12)/(OFFSET(ORÇAMENTO!$X$15,$A12,0,$B12)+10^-12))+IF(AUTOEVENTO=\"Manual\",SUMPRODUCT((OFFSET(CÁLCULO!$M$15,$A12,0,$B12)=1)*OFFSET(ORÇAMENTO!$AA$15,$A12,0,$B12)*PLE!$AE$9),0))","v":0},{"$f":"IF(ACOMPANHAMENTO<>\"PLE\",0,SUMPRODUCT((OFFSET(CÁLCULO!$AX$15:$BH$15,$A12,0,$B12)<=PLE.Medicao)*OFFSET(CÁLCULO!$AB$15:$AL$15,$A12,0,$B12)*OFFSET(ORÇAMENTO!$AB$15,$A12,0,$B12)/(OFFSET(ORÇAMENTO!$X$15,$A12,0,$B12)+10^-12))+IF(AUTOEVENTO=\"Manual\",SUMPRODUCT((OFFSET(CÁLCULO!$M$15,$A12,0,$B12)=1)*OFFSET(ORÇAMENTO!$AB$15,$A12,0,$B12)*PLE!$AE$9),0))","v":0},{"$f":"ROUND(IF(ACOMPANHAMENTO<>\"PLE\",0,SUMIF(OFFSET(CÁLCULO!$AX$15:$BH$15,$A12,0,$B12),\"<=\"&PLE.Medicao,OFFSET(CÁLCULO!$AB$15:$AL$15,$A12,0,$B12))+IF(AUTOEVENTO=\"Manual\",SUMIF(OFFSET(CÁLCULO!$M$15,$A12,0,$B12),1,OFFSET(ORÇAMENTO!$X$15,$A12,0,$B12))*PLE!$AE$9,0)),2)","v":0},null,{"$f":"IF(ACOMPANHAMENTO<>\"BM\",0,SUMPRODUCT(OFFSET(BM!$M$15,$A12,0,$B12)*(OFFSET(BM!$A$15,$A12,0,$B12)=\"S\")*OFFSET(ORÇAMENTO!AA$15,$A12,0,$B12)/(OFFSET(ORÇAMENTO!$X$15,$A12,0,$B12)+10^-12)))","v":{"$error":"#N/A"}},{"$f":"IF(ACOMPANHAMENTO<>\"BM\",0,SUMPRODUCT(OFFSET(BM!$M$15,$A12,0,$B12)*(OFFSET(BM!$A$15,$A12,0,$B12)=\"S\")*OFFSET(ORÇAMENTO!AB$15,$A12,0,$B12)/(OFFSET(ORÇAMENTO!$X$15,$A12,0,$B12)+10^-12)))","v":{"$error":"#N/A"}},{"$f":"IF(ACOMPANHAMENTO<>\"BM\",0,OFFSET(BM!$M$15,$A12,0))","v":{"$error":"#N/A"}},{"$f":"IF(ACOMPANHAMENTO<>\"BM\",0,SUMPRODUCT(OFFSET(BM!$O$15,$A12,0,$B12)*(OFFSET(BM!$A$15,$A12,0,$B12)=\"S\")*OFFSET(ORÇAMENTO!AA$15,$A12,0,$B12)/(OFFSET(ORÇAMENTO!$X$15,$A12,0,$B12)+10^-12)))","v":{"$error":"#N/A"}},{"$f":"IF(ACOMPANHAMENTO<>\"BM\",0,SUMPRODUCT(OFFSET(BM!$O$15,$A12,0,$B12)*(OFFSET(BM!$A$15,$A12,0,$B12)=\"S\")*OFFSET(ORÇAMENTO!AB$15,$A12,0,$B12)/(OFFSET(ORÇAMENTO!$X$15,$A12,0,$B12)+10^-12)))","v":{"$error":"#N/A"}},{"$f":"IF(ACOMPANHAMENTO<>\"BM\",0,OFFSET(BM!$O$15,$A12,0))","v":{"$error":"#N/A"}}]
["Linha\nPO","Altura","Busca","↓","Meta","Descrição da Meta","Situação","Quantidade","Unid.","Lote de Licitação / nº do CTEF","BM / PLE nº","Valor Total (R$)","Acumulado Período Anterior","No Período","Acumulado incluindo o Período","Execução Física Acum.",null,"Acum. Período Anterior - CP","Acum. Período Anterior - Outros","Acum. Incluindo Período - CP","Acum. Incluindo Período - Outros",null,null,"BM / PLE nº","Acumulado Período Anterior","Acumulado incluindo o Período",null,null,"CP","Outros","Investimento","CP","Outros","Investimento",null,"CP","Outros","Investimento","CP","Outros","Investimento"]
[{"$f":"MATCH(E14,ORÇAMENTO!$E$15:$E$34,0)-1","v":1},{"$f":"IF(ISERROR($A14),NA(),OFFSET(ORÇAMENTO!$D$15,$A14,0))","v":18},{"$f":"QCI!B14","v":"Automático"},{"$f":"IF(L14>0,\"F\",\"\")","v":"F"},{"$f":"QCI!D14","v":1},{"$f":"QCI!G14","v":"PAVIMENTAÇÃO E PAISAGISMO ENTORNO EMEI  PORTAL DAS FLORES"},{"$f":"QCI!H14","v":0},{"$f":"QCI!I14","v":0},{"$f":"QCI!J14","v":""},{"$f":"QCI!K14","v":"LOTE 1"},{"$f":"IF($C14=\"Automático\",IF(ACOMPANHAMENTO=\"BM\",BM.medicao,PLE.Medicao),IF(ISBLANK($X14),\"\",$X14))","v":1},{"$f":"QCI!$O14","v":196407.48},{"$f":"ROUND(IF(C14=\"Automático\",AE14+AL14,Y14),2)","v":0},{"$f":"O14-M14","v":0},{"$f":"ROUND(IF(C14=\"Automático\",AH14+AO14,Z14),2)","v":0},{"$f":"O14/(L14+10^-12)","v":0},null,{"$f":"ROUND(IF($C14=\"Automático\",AC14+AJ14,$Y14*IF(ISERROR(QCI!$AA14/QCI!$O14),0,QCI!$AA14/QCI!$O14)),2)","v":0},{"$f":"ROUND(IF($C14=\"Automático\",AD14+AK14,$Y14*IF(ISERROR(QCI!$AB14/QCI!$O14),0,QCI!$AB14/QCI!$O14)),2)","v":0},{"$f":"ROUND(IF($C14=\"Automático\",AF14+AM14,$Z14*IF(ISERROR(QCI!$AA14/QCI!$O14),0,QCI!$AA14/QCI!$O14)),2)","v":0},{"$f":"ROUND(IF($C14=\"Automático\",AG14+AN14,$Z14*IF(ISERROR(QCI!$AB14/QCI!$O14),0,QCI!$AB14/QCI!$O14)),2)","v":0},{"$f":"IF(AND($L14>0,$J14<>0,$J14<>\"\",COUNTIF($J$13:$J14,$J14)=1),OFFSET(V14,-1,0)+1,OFFSET(V14,-1,0))","v":1},null,null,null,null,null,null,{"$f":"IF(ACOMPANHAMENTO<>\"PLE\",0,SUMPRODUCT((OFFSET(CÁLCULO!$AX$15:$BH$15,$A14,0,$B14)<=(PLE.Medicao-1))*OFFSET(CÁLCULO!$AB$15:$AL$15,$A14,0,$B14)*OFFSET(ORÇAMENTO!$AA$15,$A14,0,$B14)/(OFFSET(ORÇAMENTO!$X$15,$A14,0,$B14)+10^-12))+IF(AUTOEVENTO=\"Manual\",SUMPRODUCT((OFFSET(CÁLCULO!$M$15,$A14,0,$B14)=1)*OFFSET(ORÇAMENTO!$AA$15,$A14,0,$B14)*(PLE!$AE$9-PLE!$Y$9)),0))","v":0},{"$f":"IF(ACOMPANHAMENTO<>\"PLE\",0,SUMPRODUCT((OFFSET(CÁLCULO!$AX$15:$BH$15,$A14,0,$B14)<=(PLE.Medicao-1))*OFFSET(CÁLCULO!$AB$15:$AL$15,$A14,0,$B14)*OFFSET(ORÇAMENTO!$AB$15,$A14,0,$B14)/(OFFSET(ORÇAMENTO!$X$15,$A14,0,$B14)+10^-12))+IF(AUTOEVENTO=\"Manual\",SUMPRODUCT((OFFSET(CÁLCULO!$M$15,$A14,0,$B14)=1)*OFFSET(ORÇAMENTO!$AB$15,$A14,0,$B14)*(PLE!$AE$9-PLE!$Y$9)),0))","v":0},{"$f":"ROUND(IF(ACOMPANHAMENTO<>\"PLE\",0,SUMIF(OFFSET(CÁLCULO!$AX$15:$BH$15,$A14,0,$B14),\"<=\"&(PLE.Medicao-1),OFFSET(CÁLCULO!$AB$15:$AL$15,$A14,0,$B14))+IF(AUTOEVENTO=\"Manual\",SUMIF(OFFSET(CÁLCULO!$M$15,$A14,0,$B14),1,OFFSET(ORÇAMENTO!$X$15,$A14,0,$B14))*(PLE!$AE$9-PLE!$Y$9),0)),2)","v":0},{"$f":"IF(ACOMPANHAMENTO<>\"PLE\",0,SUMPRODUCT((OFFSET(CÁLCULO!$AX$15:$BH$15,$A14,0,$B14)<=PLE.Medicao)*OFFSET(CÁLCULO!$AB$15:$AL$15,$A14,0,$B14)*OFFSET(ORÇAMENTO!$AA$15,$A14,0,$B14)/(OFFSET(ORÇAMENTO!$X$15,$A14,0,$B14)+10^-12))+IF(AUTOEVENTO=\"Manual\",SUMPRODUCT((OFFSET(CÁLCULO!$M$15,$A14,0,$B14)=1)*OFFSET(ORÇAMENTO!$AA$15,$A14,0,$B14)*PLE!$AE$9),0))","v":0},{"$f":"IF(ACOMPANHAMENTO<>\"PLE\",0,SUMPRODUCT((OFFSET(CÁLCULO!$AX$15:$BH$15,$A14,0,$B14)<=PLE.Medicao)*OFFSET(CÁLCULO!$AB$15:$AL$15,$A14,0,$B14)*OFFSET(ORÇAMENTO!$AB$15,$A14,0,$B14)/(OFFSET(ORÇAMENTO!$X$15,$A14,0,$B14)+10^-12))+IF(AUTOEVENTO=\"Manual\",SUMPRODUCT((OFFSET(CÁLCULO!$M$15,$A14,0,$B14)=1)*OFFSET(ORÇAMENTO!$AB$15,$A14,0,$B14)*PLE!$AE$9),0))","v":0},{"$f":"ROUND(IF(ACOMPANHAMENTO<>\"PLE\",0,SUMIF(OFFSET(CÁLCULO!$AX$15:$BH$15,$A14,0,$B14),\"<=\"&PLE.Medicao,OFFSET(CÁLCULO!$AB$15:$AL$15,$A14,0,$B14))+IF(AUTOEVENTO=\"Manual\",SUMIF(OFFSET(CÁLCULO!$M$15,$A14,0,$B14),1,OFFSET(ORÇAMENTO!$X$15,$A14,0,$B14))*PLE!$AE$9,0)),2)","v":0},null,{"$f":"IF(ACOMPANHAMENTO<>\"BM\",0,SUMPRODUCT(OFFSET(BM!$M$15,$A14,0,$B14)*(OFFSET(BM!$A$15,$A14,0,$B14)=\"S\")*OFFSET(ORÇAMENTO!AA$15,$A14,0,$B14)/(OFFSET(ORÇAMENTO!$X$15,$A14,0,$B14)+10^-12)))","v":0},{"$f":"IF(ACOMPANHAMENTO<>\"BM\",0,SUMPRODUCT(OFFSET(BM!$M$15,$A14,0,$B14)*(OFFSET(BM!$A$15,$A14,0,$B14)=\"S\")*OFFSET(ORÇAMENTO!AB$15,$A14,0,$B14)/(OFFSET(ORÇAMENTO!$X$15,$A14,0,$B14)+10^-12)))","v":0},{"$f":"IF(ACOMPANHAMENTO<>\"BM\",0,OFFSET(BM!$M$15,$A14,0))","v":0},{"$f":"IF(ACOMPANHAMENTO<>\"BM\",0,SUMPRODUCT(OFFSET(BM!$O$15,$A14,0,$B14)*(OFFSET(BM!$A$15,$A14,0,$B14)=\"S\")*OFFSET(ORÇAMENTO!AA$15,$A14,0,$B14)/(OFFSET(ORÇAMENTO!$X$15,$A14,0,$B14)+10^-12)))","v":0},{"$f":"IF(ACOMPANHAMENTO<>\"BM\",0,SUMPRODUCT(OFFSET(BM!$O$15,$A14,0,$B14)*(OFFSET(BM!$A$15,$A14,0,$B14)=\"S\")*OFFSET(ORÇAMENTO!AB$15,$A14,0,$B14)/(OFFSET(ORÇAMENTO!$X$15,$A14,0,$B14)+10^-12)))","v":0},{"$f":"IF(ACOMPANHAMENTO<>\"BM\",0,OFFSET(BM!$O$15,$A14,0))","v":0}]
[{"$f":"MATCH(E15,ORÇAMENTO!$E$15:$E$34,0)-1","v":{"$error":"#N/A"}},{"$f":"IF(ISERROR($A15),NA(),OFFSET(ORÇAMENTO!$D$15,$A15,0))","v":{"$error":"#N/A"}},{"$f":"QCI!B15","v":"Branco"},"",{"$f":"QCI!D15","v":2},{"$f":"QCI!G15","v":""},{"$f":"QCI!H15","v":0},{"$f":"QCI!I15","v":0},{"$f":"QCI!J15","v":""},{"$f":"QCI!K15","v":""},{"$f":"IF($C15=\"Automático\",IF(ACOMPANHAMENTO=\"BM\",BM.medicao,PLE.Medicao),IF(ISBLANK($X15),\"\",$X15))","v":""},{"$f":"QCI!$O15","v":0},0,0,0,0,null,{"$f":"ROUND(IF($C15=\"Automático\",AC15+AJ15,$Y15*IF(ISERROR(QCI!$AA15/QCI!$O15),0,QCI!$AA15/QCI!$O15)),2)","v":0},{"$f":"ROUND(IF($C15=\"Automático\",AD15+AK15,$Y15*IF(ISERROR(QCI!$AB15/QCI!$O15),0,QCI!$AB15/QCI!$O15)),2)","v":0},{"$f":"ROUND(IF($C15=\"Automático\",AF15+AM15,$Z15*IF(ISERROR(QCI!$AA15/QCI!$O15),0,QCI!$AA15/QCI!$O15)),2)","v":0},{"$f":"ROUND(IF($C15=\"Automático\",AG15+AN15,$Z15*IF(ISERROR(QCI!$AB15/QCI!$O15),0,QCI!$AB15/QCI!$O15)),2)","v":0},{"$f":"IF(AND($L15>0,$J15<>0,$J15<>\"\",COUNTIF($J$13:$J15,$J15)=1),OFFSET(V15,-1,0)+1,OFFSET(V15,-1,0))","v":1},null,null,null,null,null,null,{"$f":"IF(ACOMPANHAMENTO<>\"PLE\",0,SUMPRODUCT((OFFSET(CÁLCULO!$AX$15:$BH$15,$A15,0,$B15)<=(PLE.Medicao-1))*OFFSET(CÁLCULO!$AB$15:$AL$15,$A15,0,$B15)*OFFSET(ORÇAMENTO!$AA$15,$A15,0,$B15)/(OFFSET(ORÇAMENTO!$X$15,$A15,0,$B15)+10^-12))+IF(AUTOEVENTO=\"Manual\",SUMPRODUCT((OFFSET(CÁLCULO!$M$15,$A15,0,$B15)=1)*OFFSET(ORÇAMENTO!$AA$15,$A15,0,$B15)*(PLE!$AE$9-PLE!$Y$9)),0))","v":0},{"$f":"IF(ACOMPANHAMENTO<>\"PLE\",0,SUMPRODUCT((OFFSET(CÁLCULO!$AX$15:$BH$15,$A15,0,$B15)<=(PLE.Medicao-1))*OFFSET(CÁLCULO!$AB$15:$AL$15,$A15,0,$B15)*OFFSET(ORÇAMENTO!$AB$15,$A15,0,$B15)/(OFFSET(ORÇAMENTO!$X$15,$A15,0,$B15)+10^-12))+IF(AUTOEVENTO=\"Manual\",SUMPRODUCT((OFFSET(CÁLCULO!$M$15,$A15,0,$B15)=1)*OFFSET(ORÇAMENTO!$AB$15,$A15,0,$B15)*(PLE!$AE$9-PLE!$Y$9)),0))","v":0},{"$f":"ROUND(IF(ACOMPANHAMENTO<>\"PLE\",0,SUMIF(OFFSET(CÁLCULO!$AX$15:$BH$15,$A15,0,$B15),\"<=\"&(PLE.Medicao-1),OFFSET(CÁLCULO!$AB$15:$AL$15,$A15,0,$B15))+IF(AUTOEVENTO=\"Manual\",SUMIF(OFFSET(CÁLCULO!$M$15,$A15,0,$B15),1,OFFSET(ORÇAMENTO!$X$15,$A15,0,$B15))*(PLE!$AE$9-PLE!$Y$9),0)),2)","v":0},{"$f":"IF(ACOMPANHAMENTO<>\"PLE\",0,SUMPRODUCT((OFFSET(CÁLCULO!$AX$15:$BH$15,$A15,0,$B15)<=PLE.Medicao)*OFFSET(CÁLCULO!$AB$15:$AL$15,$A15,0,$B15)*OFFSET(ORÇAMENTO!$AA$15,$A15,0,$B15)/(OFFSET(ORÇAMENTO!$X$15,$A15,0,$B15)+10^-12))+IF(AUTOEVENTO=\"Manual\",SUMPRODUCT((OFFSET(CÁLCULO!$M$15,$A15,0,$B15)=1)*OFFSET(ORÇAMENTO!$AA$15,$A15,0,$B15)*PLE!$AE$9),0))","v":0},{"$f":"IF(ACOMPANHAMENTO<>\"PLE\",0,SUMPRODUCT((OFFSET(CÁLCULO!$AX$15:$BH$15,$A15,0,$B15)<=PLE.Medicao)*OFFSET(CÁLCULO!$AB$15:$AL$15,$A15,0,$B15)*OFFSET(ORÇAMENTO!$AB$15,$A15,0,$B15)/(OFFSET(ORÇAMENTO!$X$15,$A15,0,$B15)+10^-12))+IF(AUTOEVENTO=\"Manual\",SUMPRODUCT((OFFSET(CÁLCULO!$M$15,$A15,0,$B15)=1)*OFFSET(ORÇAMENTO!$AB$15,$A15,0,$B15)*PLE!$AE$9),0))","v":0},{"$f":"ROUND(IF(ACOMPANHAMENTO<>\"PLE\",0,SUMIF(OFFSET(CÁLCULO!$AX$15:$BH$15,$A15,0,$B15),\"<=\"&PLE.Medicao,OFFSET(CÁLCULO!$AB$15:$AL$15,$A15,0,$B15))+IF(AUTOEVENTO=\"Manual\",SUMIF(OFFSET(CÁLCULO!$M$15,$A15,0,$B15),1,OFFSET(ORÇAMENTO!$X$15,$A15,0,$B15))*PLE!$AE$9,0)),2)","v":0},null,{"$f":"IF(ACOMPANHAMENTO<>\"BM\",0,SUMPRODUCT(OFFSET(BM!$M$15,$A15,0,$B15)*(OFFSET(BM!$A$15,$A15,0,$B15)=\"S\")*OFFSET(ORÇAMENTO!AA$15,$A15,0,$B15)/(OFFSET(ORÇAMENTO!$X$15,$A15,0,$B15)+10^-12)))","v":{"$error":"#N/A"}},{"$f":"IF(ACOMPANHAMENTO<>\"BM\",0,SUMPRODUCT(OFFSET(BM!$M$15,$A15,0,$B15)*(OFFSET(BM!$A$15,$A15,0,$B15)=\"S\")*OFFSET(ORÇAMENTO!AB$15,$A15,0,$B15)/(OFFSET(ORÇAMENTO!$X$15,$A15,0,$B15)+10^-12)))","v":{"$error":"#N/A"}},{"$f":"IF(ACOMPANHAMENTO<>\"BM\",0,OFFSET(BM!$M$15,$A15,0))","v":{"$error":"#N/A"}},{"$f":"IF(ACOMPANHAMENTO<>\"BM\",0,SUMPRODUCT(OFFSET(BM!$O$15,$A15,0,$B15)*(OFFSET(BM!$A$15,$A15,0,$B15)=\"S\")*OFFSET(ORÇAMENTO!AA$15,$A15,0,$B15)/(OFFSET(ORÇAMENTO!$X$15,$A15,0,$B15)+10^-12)))","v":{"$error":"#N/A"}},{"$f":"IF(ACOMPANHAMENTO<>\"BM\",0,SUMPRODUCT(OFFSET(BM!$O$15,$A15,0,$B15)*(OFFSET(BM!$A$15,$A15,0,$B15)=\"S\")*OFFSET(ORÇAMENTO!AB$15,$A15,0,$B15)/(OFFSET(ORÇAMENTO!$X$15,$A15,0,$B15)+10^-12)))","v":{"$error":"#N/A"}},{"$f":"IF(ACOMPANHAMENTO<>\"BM\",0,OFFSET(BM!$O$15,$A15,0))","v":{"$error":"#N/A"}}]
[{"$f":"MATCH(E16,ORÇAMENTO!$E$15:$E$34,0)-1","v":{"$error":"#N/A"}},{"$f":"IF(ISERROR($A16),NA(),OFFSET(ORÇAMENTO!$D$15,$A16,0))","v":{"$error":"#N/A"}},{"$f":"QCI!B16","v":"Branco"},"",{"$f":"QCI!D16","v":3},{"$f":"QCI!G16","v":""},{"$f":"QCI!H16","v":0},{"$f":"QCI!I16","v":0},{"$f":"QCI!J16","v":""},{"$f":"QCI!K16","v":""},{"$f":"IF($C16=\"Automático\",IF(ACOMPANHAMENTO=\"BM\",BM.medicao,PLE.Medicao),IF(ISBLANK($X16),\"\",$X16))","v":""},{"$f":"QCI!$O16","v":0},0,0,0,0,null,{"$f":"ROUND(IF($C16=\"Automático\",AC16+AJ16,$Y16*IF(ISERROR(QCI!$AA16/QCI!$O16),0,QCI!$AA16/QCI!$O16)),2)","v":0},{"$f":"ROUND(IF($C16=\"Automático\",AD16+AK16,$Y16*IF(ISERROR(QCI!$AB16/QCI!$O16),0,QCI!$AB16/QCI!$O16)),2)","v":0},{"$f":"ROUND(IF($C16=\"Automático\",AF16+AM16,$Z16*IF(ISERROR(QCI!$AA16/QCI!$O16),0,QCI!$AA16/QCI!$O16)),2)","v":0},{"$f":"ROUND(IF($C16=\"Automático\",AG16+AN16,$Z16*IF(ISERROR(QCI!$AB16/QCI!$O16),0,QCI!$AB16/QCI!$O16)),2)","v":0},{"$f":"IF(AND($L16>0,$J16<>0,$J16<>\"\",COUNTIF($J$13:$J16,$J16)=1),OFFSET(V16,-1,0)+1,OFFSET(V16,-1,0))","v":1},null,null,null,null,null,null,{"$f":"IF(ACOMPANHAMENTO<>\"PLE\",0,SUMPRODUCT((OFFSET(CÁLCULO!$AX$15:$BH$15,$A16,0,$B16)<=(PLE.Medicao-1))*OFFSET(CÁLCULO!$AB$15:$AL$15,$A16,0,$B16)*OFFSET(ORÇAMENTO!$AA$15,$A16,0,$B16)/(OFFSET(ORÇAMENTO!$X$15,$A16,0,$B16)+10^-12))+IF(AUTOEVENTO=\"Manual\",SUMPRODUCT((OFFSET(CÁLCULO!$M$15,$A16,0,$B16)=1)*OFFSET(ORÇAMENTO!$AA$15,$A16,0,$B16)*(PLE!$AE$9-PLE!$Y$9)),0))","v":0},{"$f":"IF(ACOMPANHAMENTO<>\"PLE\",0,SUMPRODUCT((OFFSET(CÁLCULO!$AX$15:$BH$15,$A16,0,$B16)<=(PLE.Medicao-1))*OFFSET(CÁLCULO!$AB$15:$AL$15,$A16,0,$B16)*OFFSET(ORÇAMENTO!$AB$15,$A16,0,$B16)/(OFFSET(ORÇAMENTO!$X$15,$A16,0,$B16)+10^-12))+IF(AUTOEVENTO=\"Manual\",SUMPRODUCT((OFFSET(CÁLCULO!$M$15,$A16,0,$B16)=1)*OFFSET(ORÇAMENTO!$AB$15,$A16,0,$B16)*(PLE!$AE$9-PLE!$Y$9)),0))","v":0},{"$f":"ROUND(IF(ACOMPANHAMENTO<>\"PLE\",0,SUMIF(OFFSET(CÁLCULO!$AX$15:$BH$15,$A16,0,$B16),\"<=\"&(PLE.Medicao-1),OFFSET(CÁLCULO!$AB$15:$AL$15,$A16,0,$B16))+IF(AUTOEVENTO=\"Manual\",SUMIF(OFFSET(CÁLCULO!$M$15,$A16,0,$B16),1,OFFSET(ORÇAMENTO!$X$15,$A16,0,$B16))*(PLE!$AE$9-PLE!$Y$9),0)),2)","v":0},{"$f":"IF(ACOMPANHAMENTO<>\"PLE\",0,SUMPRODUCT((OFFSET(CÁLCULO!$AX$15:$BH$15,$A16,0,$B16)<=PLE.Medicao)*OFFSET(CÁLCULO!$AB$15:$AL$15,$A16,0,$B16)*OFFSET(ORÇAMENTO!$AA$15,$A16,0,$B16)/(OFFSET(ORÇAMENTO!$X$15,$A16,0,$B16)+10^-12))+IF(AUTOEVENTO=\"Manual\",SUMPRODUCT((OFFSET(CÁLCULO!$M$15,$A16,0,$B16)=1)*OFFSET(ORÇAMENTO!$AA$15,$A16,0,$B16)*PLE!$AE$9),0))","v":0},{"$f":"IF(ACOMPANHAMENTO<>\"PLE\",0,SUMPRODUCT((OFFSET(CÁLCULO!$AX$15:$BH$15,$A16,0,$B16)<=PLE.Medicao)*OFFSET(CÁLCULO!$AB$15:$AL$15,$A16,0,$B16)*OFFSET(ORÇAMENTO!$AB$15,$A16,0,$B16)/(OFFSET(ORÇAMENTO!$X$15,$A16,0,$B16)+10^-12))+IF(AUTOEVENTO=\"Manual\",SUMPRODUCT((OFFSET(CÁLCULO!$M$15,$A16,0,$B16)=1)*OFFSET(ORÇAMENTO!$AB$15,$A16,0,$B16)*PLE!$AE$9),0))","v":0},{"$f":"ROUND(IF(ACOMPANHAMENTO<>\"PLE\",0,SUMIF(OFFSET(CÁLCULO!$AX$15:$BH$15,$A16,0,$B16),\"<=\"&PLE.Medicao,OFFSET(CÁLCULO!$AB$15:$AL$15,$A16,0,$B16))+IF(AUTOEVENTO=\"Manual\",SUMIF(OFFSET(CÁLCULO!$M$15,$A16,0,$B16),1,OFFSET(ORÇAMENTO!$X$15,$A16,0,$B16))*PLE!$AE$9,0)),2)","v":0},null,{"$f":"IF(ACOMPANHAMENTO<>\"BM\",0,SUMPRODUCT(OFFSET(BM!$M$15,$A16,0,$B16)*(OFFSET(BM!$A$15,$A16,0,$B16)=\"S\")*OFFSET(ORÇAMENTO!AA$15,$A16,0,$B16)/(OFFSET(ORÇAMENTO!$X$15,$A16,0,$B16)+10^-12)))","v":{"$error":"#N/A"}},{"$f":"IF(ACOMPANHAMENTO<>\"BM\",0,SUMPRODUCT(OFFSET(BM!$M$15,$A16,0,$B16)*(OFFSET(BM!$A$15,$A16,0,$B16)=\"S\")*OFFSET(ORÇAMENTO!AB$15,$A16,0,$B16)/(OFFSET(ORÇAMENTO!$X$15,$A16,0,$B16)+10^-12)))","v":{"$error":"#N/A"}},{"$f":"IF(ACOMPANHAMENTO<>\"BM\",0,OFFSET(BM!$M$15,$A16,0))","v":{"$error":"#N/A"}},{"$f":"IF(ACOMPANHAMENTO<>\"BM\",0,SUMPRODUCT(OFFSET(BM!$O$15,$A16,0,$B16)*(OFFSET(BM!$A$15,$A16,0,$B16)=\"S\")*OFFSET(ORÇAMENTO!AA$15,$A16,0,$B16)/(OFFSET(ORÇAMENTO!$X$15,$A16,0,$B16)+10^-12)))","v":{"$error":"#N/A"}},{"$f":"IF(ACOMPANHAMENTO<>\"BM\",0,SUMPRODUCT(OFFSET(BM!$O$15,$A16,0,$B16)*(OFFSET(BM!$A$15,$A16,0,$B16)=\"S\")*OFFSET(ORÇAMENTO!AB$15,$A16,0,$B16)/(OFFSET(ORÇAMENTO!$X$15,$A16,0,$B16)+10^-12)))","v":{"$error":"#N/A"}},{"$f":"IF(ACOMPANHAMENTO<>\"BM\",0,OFFSET(BM!$O$15,$A16,0))","v":{"$error":"#N/A"}}]
[{"$f":"MATCH(E17,ORÇAMENTO!$E$15:$E$34,0)-1","v":{"$error":"#N/A"}},{"$f":"IF(ISERROR($A17),NA(),OFFSET(ORÇAMENTO!$D$15,$A17,0))","v":{"$error":"#N/A"}},{"$f":"QCI!B17","v":"Branco"},"",{"$f":"QCI!D17","v":4},{"$f":"QCI!G17","v":""},{"$f":"QCI!H17","v":0},{"$f":"QCI!I17","v":0},{"$f":"QCI!J17","v":""},{"$f":"QCI!K17","v":""},{"$f":"IF($C17=\"Automático\",IF(ACOMPANHAMENTO=\"BM\",BM.medicao,PLE.Medicao),IF(ISBLANK($X17),\"\",$X17))","v":""},{"$f":"QCI!$O17","v":0},0,0,0,0,null,{"$f":"ROUND(IF($C17=\"Automático\",AC17+AJ17,$Y17*IF(ISERROR(QCI!$AA17/QCI!$O17),0,QCI!$AA17/QCI!$O17)),2)","v":0},{"$f":"ROUND(IF($C17=\"Automático\",AD17+AK17,$Y17*IF(ISERROR(QCI!$AB17/QCI!$O17),0,QCI!$AB17/QCI!$O17)),2)","v":0},{"$f":"ROUND(IF($C17=\"Automático\",AF17+AM17,$Z17*IF(ISERROR(QCI!$AA17/QCI!$O17),0,QCI!$AA17/QCI!$O17)),2)","v":0},{"$f":"ROUND(IF($C17=\"Automático\",AG17+AN17,$Z17*IF(ISERROR(QCI!$AB17/QCI!$O17),0,QCI!$AB17/QCI!$O17)),2)","v":0},{"$f":"IF(AND($L17>0,$J17<>0,$J17<>\"\",COUNTIF($J$13:$J17,$J17)=1),OFFSET(V17,-1,0)+1,OFFSET(V17,-1,0))","v":1},null,null,null,null,null,null,{"$f":"IF(ACOMPANHAMENTO<>\"PLE\",0,SUMPRODUCT((OFFSET(CÁLCULO!$AX$15:$BH$15,$A17,0,$B17)<=(PLE.Medicao-1))*OFFSET(CÁLCULO!$AB$15:$AL$15,$A17,0,$B17)*OFFSET(ORÇAMENTO!$AA$15,$A17,0,$B17)/(OFFSET(ORÇAMENTO!$X$15,$A17,0,$B17)+10^-12))+IF(AUTOEVENTO=\"Manual\",SUMPRODUCT((OFFSET(CÁLCULO!$M$15,$A17,0,$B17)=1)*OFFSET(ORÇAMENTO!$AA$15,$A17,0,$B17)*(PLE!$AE$9-PLE!$Y$9)),0))","v":0},{"$f":"IF(ACOMPANHAMENTO<>\"PLE\",0,SUMPRODUCT((OFFSET(CÁLCULO!$AX$15:$BH$15,$A17,0,$B17)<=(PLE.Medicao-1))*OFFSET(CÁLCULO!$AB$15:$AL$15,$A17,0,$B17)*OFFSET(ORÇAMENTO!$AB$15,$A17,0,$B17)/(OFFSET(ORÇAMENTO!$X$15,$A17,0,$B17)+10^-12))+IF(AUTOEVENTO=\"Manual\",SUMPRODUCT((OFFSET(CÁLCULO!$M$15,$A17,0,$B17)=1)*OFFSET(ORÇAMENTO!$AB$15,$A17,0,$B17)*(PLE!$AE$9-PLE!$Y$9)),0))","v":0},{"$f":"ROUND(IF(ACOMPANHAMENTO<>\"PLE\",0,SUMIF(OFFSET(CÁLCULO!$AX$15:$BH$15,$A17,0,$B17),\"<=\"&(PLE.Medicao-1),OFFSET(CÁLCULO!$AB$15:$AL$15,$A17,0,$B17))+IF(AUTOEVENTO=\"Manual\",SUMIF(OFFSET(CÁLCULO!$M$15,$A17,0,$B17),1,OFFSET(ORÇAMENTO!$X$15,$A17,0,$B17))*(PLE!$AE$9-PLE!$Y$9),0)),2)","v":0},{"$f":"IF(ACOMPANHAMENTO<>\"PLE\",0,SUMPRODUCT((OFFSET(CÁLCULO!$AX$15:$BH$15,$A17,0,$B17)<=PLE.Medicao)*OFFSET(CÁLCULO!$AB$15:$AL$15,$A17,0,$B17)*OFFSET(ORÇAMENTO!$AA$15,$A17,0,$B17)/(OFFSET(ORÇAMENTO!$X$15,$A17,0,$B17)+10^-12))+IF(AUTOEVENTO=\"Manual\",SUMPRODUCT((OFFSET(CÁLCULO!$M$15,$A17,0,$B17)=1)*OFFSET(ORÇAMENTO!$AA$15,$A17,0,$B17)*PLE!$AE$9),0))","v":0},{"$f":"IF(ACOMPANHAMENTO<>\"PLE\",0,SUMPRODUCT((OFFSET(CÁLCULO!$AX$15:$BH$15,$A17,0,$B17)<=PLE.Medicao)*OFFSET(CÁLCULO!$AB$15:$AL$15,$A17,0,$B17)*OFFSET(ORÇAMENTO!$AB$15,$A17,0,$B17)/(OFFSET(ORÇAMENTO!$X$15,$A17,0,$B17)+10^-12))+IF(AUTOEVENTO=\"Manual\",SUMPRODUCT((OFFSET(CÁLCULO!$M$15,$A17,0,$B17)=1)*OFFSET(ORÇAMENTO!$AB$15,$A17,0,$B17)*PLE!$AE$9),0))","v":0},{"$f":"ROUND(IF(ACOMPANHAMENTO<>\"PLE\",0,SUMIF(OFFSET(CÁLCULO!$AX$15:$BH$15,$A17,0,$B17),\"<=\"&PLE.Medicao,OFFSET(CÁLCULO!$AB$15:$AL$15,$A17,0,$B17))+IF(AUTOEVENTO=\"Manual\",SUMIF(OFFSET(CÁLCULO!$M$15,$A17,0,$B17),1,OFFSET(ORÇAMENTO!$X$15,$A17,0,$B17))*PLE!$AE$9,0)),2)","v":0},null,{"$f":"IF(ACOMPANHAMENTO<>\"BM\",0,SUMPRODUCT(OFFSET(BM!$M$15,$A17,0,$B17)*(OFFSET(BM!$A$15,$A17,0,$B17)=\"S\")*OFFSET(ORÇAMENTO!AA$15,$A17,0,$B17)/(OFFSET(ORÇAMENTO!$X$15,$A17,0,$B17)+10^-12)))","v":{"$error":"#N/A"}},{"$f":"IF(ACOMPANHAMENTO<>\"BM\",0,SUMPRODUCT(OFFSET(BM!$M$15,$A17,0,$B17)*(OFFSET(BM!$A$15,$A17,0,$B17)=\"S\")*OFFSET(ORÇAMENTO!AB$15,$A17,0,$B17)/(OFFSET(ORÇAMENTO!$X$15,$A17,0,$B17)+10^-12)))","v":{"$error":"#N/A"}},{"$f":"IF(ACOMPANHAMENTO<>\"BM\",0,OFFSET(BM!$M$15,$A17,0))","v":{"$error":"#N/A"}},{"$f":"IF(ACOMPANHAMENTO<>\"BM\",0,SUMPRODUCT(OFFSET(BM!$O$15,$A17,0,$B17)*(OFFSET(BM!$A$15,$A17,0,$B17)=\"S\")*OFFSET(ORÇAMENTO!AA$15,$A17,0,$B17)/(OFFSET(ORÇAMENTO!$X$15,$A17,0,$B17)+10^-12)))","v":{"$error":"#N/A"}},{"$f":"IF(ACOMPANHAMENTO<>\"BM\",0,SUMPRODUCT(OFFSET(BM!$O$15,$A17,0,$B17)*(OFFSET(BM!$A$15,$A17,0,$B17)=\"S\")*OFFSET(ORÇAMENTO!AB$15,$A17,0,$B17)/(OFFSET(ORÇAMENTO!$X$15,$A17,0,$B17)+10^-12)))","v":{"$error":"#N/A"}},{"$f":"IF(ACOMPANHAMENTO<>\"BM\",0,OFFSET(BM!$O$15,$A17,0))","v":{"$error":"#N/A"}}]
[{"$f":"MATCH(E18,ORÇAMENTO!$E$15:$E$34,0)-1","v":{"$error":"#N/A"}},{"$f":"IF(ISERROR($A18),NA(),OFFSET(ORÇAMENTO!$D$15,$A18,0))","v":{"$error":"#N/A"}},{"$f":"QCI!B18","v":"Branco"},"",{"$f":"QCI!D18","v":5},{"$f":"QCI!G18","v":""},{"$f":"QCI!H18","v":0},{"$f":"QCI!I18","v":0},{"$f":"QCI!J18","v":""},{"$f":"QCI!K18","v":""},{"$f":"IF($C18=\"Automático\",IF(ACOMPANHAMENTO=\"BM\",BM.medicao,PLE.Medicao),IF(ISBLANK($X18),\"\",$X18))","v":""},{"$f":"QCI!$O18","v":0},0,0,0,0,null,{"$f":"ROUND(IF($C18=\"Automático\",AC18+AJ18,$Y18*IF(ISERROR(QCI!$AA18/QCI!$O18),0,QCI!$AA18/QCI!$O18)),2)","v":0},{"$f":"ROUND(IF($C18=\"Automático\",AD18+AK18,$Y18*IF(ISERROR(QCI!$AB18/QCI!$O18),0,QCI!$AB18/QCI!$O18)),2)","v":0},{"$f":"ROUND(IF($C18=\"Automático\",AF18+AM18,$Z18*IF(ISERROR(QCI!$AA18/QCI!$O18),0,QCI!$AA18/QCI!$O18)),2)","v":0},{"$f":"ROUND(IF($C18=\"Automático\",AG18+AN18,$Z18*IF(ISERROR(QCI!$AB18/QCI!$O18),0,QCI!$AB18/QCI!$O18)),2)","v":0},{"$f":"IF(AND($L18>0,$J18<>0,$J18<>\"\",COUNTIF($J$13:$J18,$J18)=1),OFFSET(V18,-1,0)+1,OFFSET(V18,-1,0))","v":1},null,null,null,null,null,null,{"$f":"IF(ACOMPANHAMENTO<>\"PLE\",0,SUMPRODUCT((OFFSET(CÁLCULO!$AX$15:$BH$15,$A18,0,$B18)<=(PLE.Medicao-1))*OFFSET(CÁLCULO!$AB$15:$AL$15,$A18,0,$B18)*OFFSET(ORÇAMENTO!$AA$15,$A18,0,$B18)/(OFFSET(ORÇAMENTO!$X$15,$A18,0,$B18)+10^-12))+IF(AUTOEVENTO=\"Manual\",SUMPRODUCT((OFFSET(CÁLCULO!$M$15,$A18,0,$B18)=1)*OFFSET(ORÇAMENTO!$AA$15,$A18,0,$B18)*(PLE!$AE$9-PLE!$Y$9)),0))","v":0},{"$f":"IF(ACOMPANHAMENTO<>\"PLE\",0,SUMPRODUCT((OFFSET(CÁLCULO!$AX$15:$BH$15,$A18,0,$B18)<=(PLE.Medicao-1))*OFFSET(CÁLCULO!$AB$15:$AL$15,$A18,0,$B18)*OFFSET(ORÇAMENTO!$AB$15,$A18,0,$B18)/(OFFSET(ORÇAMENTO!$X$15,$A18,0,$B18)+10^-12))+IF(AUTOEVENTO=\"Manual\",SUMPRODUCT((OFFSET(CÁLCULO!$M$15,$A18,0,$B18)=1)*OFFSET(ORÇAMENTO!$AB$15,$A18,0,$B18)*(PLE!$AE$9-PLE!$Y$9)),0))","v":0},{"$f":"ROUND(IF(ACOMPANHAMENTO<>\"PLE\",0,SUMIF(OFFSET(CÁLCULO!$AX$15:$BH$15,$A18,0,$B18),\"<=\"&(PLE.Medicao-1),OFFSET(CÁLCULO!$AB$15:$AL$15,$A18,0,$B18))+IF(AUTOEVENTO=\"Manual\",SUMIF(OFFSET(CÁLCULO!$M$15,$A18,0,$B18),1,OFFSET(ORÇAMENTO!$X$15,$A18,0,$B18))*(PLE!$AE$9-PLE!$Y$9),0)),2)","v":0},{"$f":"IF(ACOMPANHAMENTO<>\"PLE\",0,SUMPRODUCT((OFFSET(CÁLCULO!$AX$15:$BH$15,$A18,0,$B18)<=PLE.Medicao)*OFFSET(CÁLCULO!$AB$15:$AL$15,$A18,0,$B18)*OFFSET(ORÇAMENTO!$AA$15,$A18,0,$B18)/(OFFSET(ORÇAMENTO!$X$15,$A18,0,$B18)+10^-12))+IF(AUTOEVENTO=\"Manual\",SUMPRODUCT((OFFSET(CÁLCULO!$M$15,$A18,0,$B18)=1)*OFFSET(ORÇAMENTO!$AA$15,$A18,0,$B18)*PLE!$AE$9),0))","v":0},{"$f":"IF(ACOMPANHAMENTO<>\"PLE\",0,SUMPRODUCT((OFFSET(CÁLCULO!$AX$15:$BH$15,$A18,0,$B18)<=PLE.Medicao)*OFFSET(CÁLCULO!$AB$15:$AL$15,$A18,0,$B18)*OFFSET(ORÇAMENTO!$AB$15,$A18,0,$B18)/(OFFSET(ORÇAMENTO!$X$15,$A18,0,$B18)+10^-12))+IF(AUTOEVENTO=\"Manual\",SUMPRODUCT((OFFSET(CÁLCULO!$M$15,$A18,0,$B18)=1)*OFFSET(ORÇAMENTO!$AB$15,$A18,0,$B18)*PLE!$AE$9),0))","v":0},{"$f":"ROUND(IF(ACOMPANHAMENTO<>\"PLE\",0,SUMIF(OFFSET(CÁLCULO!$AX$15:$BH$15,$A18,0,$B18),\"<=\"&PLE.Medicao,OFFSET(CÁLCULO!$AB$15:$AL$15,$A18,0,$B18))+IF(AUTOEVENTO=\"Manual\",SUMIF(OFFSET(CÁLCULO!$M$15,$A18,0,$B18),1,OFFSET(ORÇAMENTO!$X$15,$A18,0,$B18))*PLE!$AE$9,0)),2)","v":0},null,{"$f":"IF(ACOMPANHAMENTO<>\"BM\",0,SUMPRODUCT(OFFSET(BM!$M$15,$A18,0,$B18)*(OFFSET(BM!$A$15,$A18,0,$B18)=\"S\")*OFFSET(ORÇAMENTO!AA$15,$A18,0,$B18)/(OFFSET(ORÇAMENTO!$X$15,$A18,0,$B18)+10^-12)))","v":{"$error":"#N/A"}},{"$f":"IF(ACOMPANHAMENTO<>\"BM\",0,SUMPRODUCT(OFFSET(BM!$M$15,$A18,0,$B18)*(OFFSET(BM!$A$15,$A18,0,$B18)=\"S\")*OFFSET(ORÇAMENTO!AB$15,$A18,0,$B18)/(OFFSET(ORÇAMENTO!$X$15,$A18,0,$B18)+10^-12)))","v":{"$error":"#N/A"}},{"$f":"IF(ACOMPANHAMENTO<>\"BM\",0,OFFSET(BM!$M$15,$A18,0))","v":{"$error":"#N/A"}},{"$f":"IF(ACOMPANHAMENTO<>\"BM\",0,SUMPRODUCT(OFFSET(BM!$O$15,$A18,0,$B18)*(OFFSET(BM!$A$15,$A18,0,$B18)=\"S\")*OFFSET(ORÇAMENTO!AA$15,$A18,0,$B18)/(OFFSET(ORÇAMENTO!$X$15,$A18,0,$B18)+10^-12)))","v":{"$error":"#N/A"}},{"$f":"IF(ACOMPANHAMENTO<>\"BM\",0,SUMPRODUCT(OFFSET(BM!$O$15,$A18,0,$B18)*(OFFSET(BM!$A$15,$A18,0,$B18)=\"S\")*OFFSET(ORÇAMENTO!AB$15,$A18,0,$B18)/(OFFSET(ORÇAMENTO!$X$15,$A18,0,$B18)+10^-12)))","v":{"$error":"#N/A"}},{"$f":"IF(ACOMPANHAMENTO<>\"BM\",0,OFFSET(BM!$O$15,$A18,0))","v":{"$error":"#N/A"}}]
[{"$f":"MATCH(E19,ORÇAMENTO!$E$15:$E$34,0)-1","v":{"$error":"#N/A"}},{"$f":"IF(ISERROR($A19),NA(),OFFSET(ORÇAMENTO!$D$15,$A19,0))","v":{"$error":"#N/A"}},{"$f":"QCI!B19","v":"Branco"},"",{"$f":"QCI!D19","v":6},{"$f":"QCI!G19","v":""},{"$f":"QCI!H19","v":0},{"$f":"QCI!I19","v":0},{"$f":"QCI!J19","v":""},{"$f":"QCI!K19","v":""},{"$f":"IF($C19=\"Automático\",IF(ACOMPANHAMENTO=\"BM\",BM.medicao,PLE.Medicao),IF(ISBLANK($X19),\"\",$X19))","v":""},{"$f":"QCI!$O19","v":0},0,0,0,0,null,{"$f":"ROUND(IF($C19=\"Automático\",AC19+AJ19,$Y19*IF(ISERROR(QCI!$AA19/QCI!$O19),0,QCI!$AA19/QCI!$O19)),2)","v":0},{"$f":"ROUND(IF($C19=\"Automático\",AD19+AK19,$Y19*IF(ISERROR(QCI!$AB19/QCI!$O19),0,QCI!$AB19/QCI!$O19)),2)","v":0},{"$f":"ROUND(IF($C19=\"Automático\",AF19+AM19,$Z19*IF(ISERROR(QCI!$AA19/QCI!$O19),0,QCI!$AA19/QCI!$O19)),2)","v":0},{"$f":"ROUND(IF($C19=\"Automático\",AG19+AN19,$Z19*IF(ISERROR(QCI!$AB19/QCI!$O19),0,QCI!$AB19/QCI!$O19)),2)","v":0},{"$f":"IF(AND($L19>0,$J19<>0,$J19<>\"\",COUNTIF($J$13:$J19,$J19)=1),OFFSET(V19,-1,0)+1,OFFSET(V19,-1,0))","v":1},null,null,null,null,null,null,{"$f":"IF(ACOMPANHAMENTO<>\"PLE\",0,SUMPRODUCT((OFFSET(CÁLCULO!$AX$15:$BH$15,$A19,0,$B19)<=(PLE.Medicao-1))*OFFSET(CÁLCULO!$AB$15:$AL$15,$A19,0,$B19)*OFFSET(ORÇAMENTO!$AA$15,$A19,0,$B19)/(OFFSET(ORÇAMENTO!$X$15,$A19,0,$B19)+10^-12))+IF(AUTOEVENTO=\"Manual\",SUMPRODUCT((OFFSET(CÁLCULO!$M$15,$A19,0,$B19)=1)*OFFSET(ORÇAMENTO!$AA$15,$A19,0,$B19)*(PLE!$AE$9-PLE!$Y$9)),0))","v":0},{"$f":"IF(ACOMPANHAMENTO<>\"PLE\",0,SUMPRODUCT((OFFSET(CÁLCULO!$AX$15:$BH$15,$A19,0,$B19)<=(PLE.Medicao-1))*OFFSET(CÁLCULO!$AB$15:$AL$15,$A19,0,$B19)*OFFSET(ORÇAMENTO!$AB$15,$A19,0,$B19)/(OFFSET(ORÇAMENTO!$X$15,$A19,0,$B19)+10^-12))+IF(AUTOEVENTO=\"Manual\",SUMPRODUCT((OFFSET(CÁLCULO!$M$15,$A19,0,$B19)=1)*OFFSET(ORÇAMENTO!$AB$15,$A19,0,$B19)*(PLE!$AE$9-PLE!$Y$9)),0))","v":0},{"$f":"ROUND(IF(ACOMPANHAMENTO<>\"PLE\",0,SUMIF(OFFSET(CÁLCULO!$AX$15:$BH$15,$A19,0,$B19),\"<=\"&(PLE.Medicao-1),OFFSET(CÁLCULO!$AB$15:$AL$15,$A19,0,$B19))+IF(AUTOEVENTO=\"Manual\",SUMIF(OFFSET(CÁLCULO!$M$15,$A19,0,$B19),1,OFFSET(ORÇAMENTO!$X$15,$A19,0,$B19))*(PLE!$AE$9-PLE!$Y$9),0)),2)","v":0},{"$f":"IF(ACOMPANHAMENTO<>\"PLE\",0,SUMPRODUCT((OFFSET(CÁLCULO!$AX$15:$BH$15,$A19,0,$B19)<=PLE.Medicao)*OFFSET(CÁLCULO!$AB$15:$AL$15,$A19,0,$B19)*OFFSET(ORÇAMENTO!$AA$15,$A19,0,$B19)/(OFFSET(ORÇAMENTO!$X$15,$A19,0,$B19)+10^-12))+IF(AUTOEVENTO=\"Manual\",SUMPRODUCT((OFFSET(CÁLCULO!$M$15,$A19,0,$B19)=1)*OFFSET(ORÇAMENTO!$AA$15,$A19,0,$B19)*PLE!$AE$9),0))","v":0},{"$f":"IF(ACOMPANHAMENTO<>\"PLE\",0,SUMPRODUCT((OFFSET(CÁLCULO!$AX$15:$BH$15,$A19,0,$B19)<=PLE.Medicao)*OFFSET(CÁLCULO!$AB$15:$AL$15,$A19,0,$B19)*OFFSET(ORÇAMENTO!$AB$15,$A19,0,$B19)/(OFFSET(ORÇAMENTO!$X$15,$A19,0,$B19)+10^-12))+IF(AUTOEVENTO=\"Manual\",SUMPRODUCT((OFFSET(CÁLCULO!$M$15,$A19,0,$B19)=1)*OFFSET(ORÇAMENTO!$AB$15,$A19,0,$B19)*PLE!$AE$9),0))","v":0},{"$f":"ROUND(IF(ACOMPANHAMENTO<>\"PLE\",0,SUMIF(OFFSET(CÁLCULO!$AX$15:$BH$15,$A19,0,$B19),\"<=\"&PLE.Medicao,OFFSET(CÁLCULO!$AB$15:$AL$15,$A19,0,$B19))+IF(AUTOEVENTO=\"Manual\",SUMIF(OFFSET(CÁLCULO!$M$15,$A19,0,$B19),1,OFFSET(ORÇAMENTO!$X$15,$A19,0,$B19))*PLE!$AE$9,0)),2)","v":0},null,{"$f":"IF(ACOMPANHAMENTO<>\"BM\",0,SUMPRODUCT(OFFSET(BM!$M$15,$A19,0,$B19)*(OFFSET(BM!$A$15,$A19,0,$B19)=\"S\")*OFFSET(ORÇAMENTO!AA$15,$A19,0,$B19)/(OFFSET(ORÇAMENTO!$X$15,$A19,0,$B19)+10^-12)))","v":{"$error":"#N/A"}},{"$f":"IF(ACOMPANHAMENTO<>\"BM\",0,SUMPRODUCT(OFFSET(BM!$M$15,$A19,0,$B19)*(OFFSET(BM!$A$15,$A19,0,$B19)=\"S\")*OFFSET(ORÇAMENTO!AB$15,$A19,0,$B19)/(OFFSET(ORÇAMENTO!$X$15,$A19,0,$B19)+10^-12)))","v":{"$error":"#N/A"}},{"$f":"IF(ACOMPANHAMENTO<>\"BM\",0,OFFSET(BM!$M$15,$A19,0))","v":{"$error":"#N/A"}},{"$f":"IF(ACOMPANHAMENTO<>\"BM\",0,SUMPRODUCT(OFFSET(BM!$O$15,$A19,0,$B19)*(OFFSET(BM!$A$15,$A19,0,$B19)=\"S\")*OFFSET(ORÇAMENTO!AA$15,$A19,0,$B19)/(OFFSET(ORÇAMENTO!$X$15,$A19,0,$B19)+10^-12)))","v":{"$error":"#N/A"}},{"$f":"IF(ACOMPANHAMENTO<>\"BM\",0,SUMPRODUCT(OFFSET(BM!$O$15,$A19,0,$B19)*(OFFSET(BM!$A$15,$A19,0,$B19)=\"S\")*OFFSET(ORÇAMENTO!AB$15,$A19,0,$B19)/(OFFSET(ORÇAMENTO!$X$15,$A19,0,$B19)+10^-12)))","v":{"$error":"#N/A"}},{"$f":"IF(ACOMPANHAMENTO<>\"BM\",0,OFFSET(BM!$O$15,$A19,0))","v":{"$error":"#N/A"}}]
[{"$f":"MATCH(E20,ORÇAMENTO!$E$15:$E$34,0)-1","v":{"$error":"#N/A"}},{"$f":"IF(ISERROR($A20),NA(),OFFSET(ORÇAMENTO!$D$15,$A20,0))","v":{"$error":"#N/A"}},{"$f":"QCI!B20","v":"Branco"},"",{"$f":"QCI!D20","v":7},{"$f":"QCI!G20","v":""},{"$f":"QCI!H20","v":0},{"$f":"QCI!I20","v":0},{"$f":"QCI!J20","v":""},{"$f":"QCI!K20","v":""},{"$f":"IF($C20=\"Automático\",IF(ACOMPANHAMENTO=\"BM\",BM.medicao,PLE.Medicao),IF(ISBLANK($X20),\"\",$X20))","v":""},{"$f":"QCI!$O20","v":0},0,0,0,0,null,{"$f":"ROUND(IF($C20=\"Automático\",AC20+AJ20,$Y20*IF(ISERROR(QCI!$AA20/QCI!$O20),0,QCI!$AA20/QCI!$O20)),2)","v":0},{"$f":"ROUND(IF($C20=\"Automático\",AD20+AK20,$Y20*IF(ISERROR(QCI!$AB20/QCI!$O20),0,QCI!$AB20/QCI!$O20)),2)","v":0},{"$f":"ROUND(IF($C20=\"Automático\",AF20+AM20,$Z20*IF(ISERROR(QCI!$AA20/QCI!$O20),0,QCI!$AA20/QCI!$O20)),2)","v":0},{"$f":"ROUND(IF($C20=\"Automático\",AG20+AN20,$Z20*IF(ISERROR(QCI!$AB20/QCI!$O20),0,QCI!$AB20/QCI!$O20)),2)","v":0},{"$f":"IF(AND($L20>0,$J20<>0,$J20<>\"\",COUNTIF($J$13:$J20,$J20)=1),OFFSET(V20,-1,0)+1,OFFSET(V20,-1,0))","v":1},null,null,null,null,null,null,{"$f":"IF(ACOMPANHAMENTO<>\"PLE\",0,SUMPRODUCT((OFFSET(CÁLCULO!$AX$15:$BH$15,$A20,0,$B20)<=(PLE.Medicao-1))*OFFSET(CÁLCULO!$AB$15:$AL$15,$A20,0,$B20)*OFFSET(ORÇAMENTO!$AA$15,$A20,0,$B20)/(OFFSET(ORÇAMENTO!$X$15,$A20,0,$B20)+10^-12))+IF(AUTOEVENTO=\"Manual\",SUMPRODUCT((OFFSET(CÁLCULO!$M$15,$A20,0,$B20)=1)*OFFSET(ORÇAMENTO!$AA$15,$A20,0,$B20)*(PLE!$AE$9-PLE!$Y$9)),0))","v":0},{"$f":"IF(ACOMPANHAMENTO<>\"PLE\",0,SUMPRODUCT((OFFSET(CÁLCULO!$AX$15:$BH$15,$A20,0,$B20)<=(PLE.Medicao-1))*OFFSET(CÁLCULO!$AB$15:$AL$15,$A20,0,$B20)*OFFSET(ORÇAMENTO!$AB$15,$A20,0,$B20)/(OFFSET(ORÇAMENTO!$X$15,$A20,0,$B20)+10^-12))+IF(AUTOEVENTO=\"Manual\",SUMPRODUCT((OFFSET(CÁLCULO!$M$15,$A20,0,$B20)=1)*OFFSET(ORÇAMENTO!$AB$15,$A20,0,$B20)*(PLE!$AE$9-PLE!$Y$9)),0))","v":0},{"$f":"ROUND(IF(ACOMPANHAMENTO<>\"PLE\",0,SUMIF(OFFSET(CÁLCULO!$AX$15:$BH$15,$A20,0,$B20),\"<=\"&(PLE.Medicao-1),OFFSET(CÁLCULO!$AB$15:$AL$15,$A20,0,$B20))+IF(AUTOEVENTO=\"Manual\",SUMIF(OFFSET(CÁLCULO!$M$15,$A20,0,$B20),1,OFFSET(ORÇAMENTO!$X$15,$A20,0,$B20))*(PLE!$AE$9-PLE!$Y$9),0)),2)","v":0},{"$f":"IF(ACOMPANHAMENTO<>\"PLE\",0,SUMPRODUCT((OFFSET(CÁLCULO!$AX$15:$BH$15,$A20,0,$B20)<=PLE.Medicao)*OFFSET(CÁLCULO!$AB$15:$AL$15,$A20,0,$B20)*OFFSET(ORÇAMENTO!$AA$15,$A20,0,$B20)/(OFFSET(ORÇAMENTO!$X$15,$A20,0,$B20)+10^-12))+IF(AUTOEVENTO=\"Manual\",SUMPRODUCT((OFFSET(CÁLCULO!$M$15,$A20,0,$B20)=1)*OFFSET(ORÇAMENTO!$AA$15,$A20,0,$B20)*PLE!$AE$9),0))","v":0},{"$f":"IF(ACOMPANHAMENTO<>\"PLE\",0,SUMPRODUCT((OFFSET(CÁLCULO!$AX$15:$BH$15,$A20,0,$B20)<=PLE.Medicao)*OFFSET(CÁLCULO!$AB$15:$AL$15,$A20,0,$B20)*OFFSET(ORÇAMENTO!$AB$15,$A20,0,$B20)/(OFFSET(ORÇAMENTO!$X$15,$A20,0,$B20)+10^-12))+IF(AUTOEVENTO=\"Manual\",SUMPRODUCT((OFFSET(CÁLCULO!$M$15,$A20,0,$B20)=1)*OFFSET(ORÇAMENTO!$AB$15,$A20,0,$B20)*PLE!$AE$9),0))","v":0},{"$f":"ROUND(IF(ACOMPANHAMENTO<>\"PLE\",0,SUMIF(OFFSET(CÁLCULO!$AX$15:$BH$15,$A20,0,$B20),\"<=\"&PLE.Medicao,OFFSET(CÁLCULO!$AB$15:$AL$15,$A20,0,$B20))+IF(AUTOEVENTO=\"Manual\",SUMIF(OFFSET(CÁLCULO!$M$15,$A20,0,$B20),1,OFFSET(ORÇAMENTO!$X$15,$A20,0,$B20))*PLE!$AE$9,0)),2)","v":0},null,{"$f":"IF(ACOMPANHAMENTO<>\"BM\",0,SUMPRODUCT(OFFSET(BM!$M$15,$A20,0,$B20)*(OFFSET(BM!$A$15,$A20,0,$B20)=\"S\")*OFFSET(ORÇAMENTO!AA$15,$A20,0,$B20)/(OFFSET(ORÇAMENTO!$X$15,$A20,0,$B20)+10^-12)))","v":{"$error":"#N/A"}},{"$f":"IF(ACOMPANHAMENTO<>\"BM\",0,SUMPRODUCT(OFFSET(BM!$M$15,$A20,0,$B20)*(OFFSET(BM!$A$15,$A20,0,$B20)=\"S\")*OFFSET(ORÇAMENTO!AB$15,$A20,0,$B20)/(OFFSET(ORÇAMENTO!$X$15,$A20,0,$B20)+10^-12)))","v":{"$error":"#N/A"}},{"$f":"IF(ACOMPANHAMENTO<>\"BM\",0,OFFSET(BM!$M$15,$A20,0))","v":{"$error":"#N/A"}},{"$f":"IF(ACOMPANHAMENTO<>\"BM\",0,SUMPRODUCT(OFFSET(BM!$O$15,$A20,0,$B20)*(OFFSET(BM!$A$15,$A20,0,$B20)=\"S\")*OFFSET(ORÇAMENTO!AA$15,$A20,0,$B20)/(OFFSET(ORÇAMENTO!$X$15,$A20,0,$B20)+10^-12)))","v":{"$error":"#N/A"}},{"$f":"IF(ACOMPANHAMENTO<>\"BM\",0,SUMPRODUCT(OFFSET(BM!$O$15,$A20,0,$B20)*(OFFSET(BM!$A$15,$A20,0,$B20)=\"S\")*OFFSET(ORÇAMENTO!AB$15,$A20,0,$B20)/(OFFSET(ORÇAMENTO!$X$15,$A20,0,$B20)+10^-12)))","v":{"$error":"#N/A"}},{"$f":"IF(ACOMPANHAMENTO<>\"BM\",0,OFFSET(BM!$O$15,$A20,0))","v":{"$error":"#N/A"}}]
[{"$f":"MATCH(E21,ORÇAMENTO!$E$15:$E$34,0)-1","v":{"$error":"#N/A"}},{"$f":"IF(ISERROR($A21),NA(),OFFSET(ORÇAMENTO!$D$15,$A21,0))","v":{"$error":"#N/A"}},{"$f":"QCI!B21","v":"Branco"},"",{"$f":"QCI!D21","v":8},{"$f":"QCI!G21","v":""},{"$f":"QCI!H21","v":0},{"$f":"QCI!I21","v":0},{"$f":"QCI!J21","v":""},{"$f":"QCI!K21","v":""},{"$f":"IF($C21=\"Automático\",IF(ACOMPANHAMENTO=\"BM\",BM.medicao,PLE.Medicao),IF(ISBLANK($X21),\"\",$X21))","v":""},{"$f":"QCI!$O21","v":0},0,0,0,0,null,{"$f":"ROUND(IF($C21=\"Automático\",AC21+AJ21,$Y21*IF(ISERROR(QCI!$AA21/QCI!$O21),0,QCI!$AA21/QCI!$O21)),2)","v":0},{"$f":"ROUND(IF($C21=\"Automático\",AD21+AK21,$Y21*IF(ISERROR(QCI!$AB21/QCI!$O21),0,QCI!$AB21/QCI!$O21)),2)","v":0},{"$f":"ROUND(IF($C21=\"Automático\",AF21+AM21,$Z21*IF(ISERROR(QCI!$AA21/QCI!$O21),0,QCI!$AA21/QCI!$O21)),2)","v":0},{"$f":"ROUND(IF($C21=\"Automático\",AG21+AN21,$Z21*IF(ISERROR(QCI!$AB21/QCI!$O21),0,QCI!$AB21/QCI!$O21)),2)","v":0},{"$f":"IF(AND($L21>0,$J21<>0,$J21<>\"\",COUNTIF($J$13:$J21,$J21)=1),OFFSET(V21,-1,0)+1,OFFSET(V21,-1,0))","v":1},null,null,null,null,null,null,{"$f":"IF(ACOMPANHAMENTO<>\"PLE\",0,SUMPRODUCT((OFFSET(CÁLCULO!$AX$15:$BH$15,$A21,0,$B21)<=(PLE.Medicao-1))*OFFSET(CÁLCULO!$AB$15:$AL$15,$A21,0,$B21)*OFFSET(ORÇAMENTO!$AA$15,$A21,0,$B21)/(OFFSET(ORÇAMENTO!$X$15,$A21,0,$B21)+10^-12))+IF(AUTOEVENTO=\"Manual\",SUMPRODUCT((OFFSET(CÁLCULO!$M$15,$A21,0,$B21)=1)*OFFSET(ORÇAMENTO!$AA$15,$A21,0,$B21)*(PLE!$AE$9-PLE!$Y$9)),0))","v":0},{"$f":"IF(ACOMPANHAMENTO<>\"PLE\",0,SUMPRODUCT((OFFSET(CÁLCULO!$AX$15:$BH$15,$A21,0,$B21)<=(PLE.Medicao-1))*OFFSET(CÁLCULO!$AB$15:$AL$15,$A21,0,$B21)*OFFSET(ORÇAMENTO!$AB$15,$A21,0,$B21)/(OFFSET(ORÇAMENTO!$X$15,$A21,0,$B21)+10^-12))+IF(AUTOEVENTO=\"Manual\",SUMPRODUCT((OFFSET(CÁLCULO!$M$15,$A21,0,$B21)=1)*OFFSET(ORÇAMENTO!$AB$15,$A21,0,$B21)*(PLE!$AE$9-PLE!$Y$9)),0))","v":0},{"$f":"ROUND(IF(ACOMPANHAMENTO<>\"PLE\",0,SUMIF(OFFSET(CÁLCULO!$AX$15:$BH$15,$A21,0,$B21),\"<=\"&(PLE.Medicao-1),OFFSET(CÁLCULO!$AB$15:$AL$15,$A21,0,$B21))+IF(AUTOEVENTO=\"Manual\",SUMIF(OFFSET(CÁLCULO!$M$15,$A21,0,$B21),1,OFFSET(ORÇAMENTO!$X$15,$A21,0,$B21))*(PLE!$AE$9-PLE!$Y$9),0)),2)","v":0},{"$f":"IF(ACOMPANHAMENTO<>\"PLE\",0,SUMPRODUCT((OFFSET(CÁLCULO!$AX$15:$BH$15,$A21,0,$B21)<=PLE.Medicao)*OFFSET(CÁLCULO!$AB$15:$AL$15,$A21,0,$B21)*OFFSET(ORÇAMENTO!$AA$15,$A21,0,$B21)/(OFFSET(ORÇAMENTO!$X$15,$A21,0,$B21)+10^-12))+IF(AUTOEVENTO=\"Manual\",SUMPRODUCT((OFFSET(CÁLCULO!$M$15,$A21,0,$B21)=1)*OFFSET(ORÇAMENTO!$AA$15,$A21,0,$B21)*PLE!$AE$9),0))","v":0},{"$f":"IF(ACOMPANHAMENTO<>\"PLE\",0,SUMPRODUCT((OFFSET(CÁLCULO!$AX$15:$BH$15,$A21,0,$B21)<=PLE.Medicao)*OFFSET(CÁLCULO!$AB$15:$AL$15,$A21,0,$B21)*OFFSET(ORÇAMENTO!$AB$15,$A21,0,$B21)/(OFFSET(ORÇAMENTO!$X$15,$A21,0,$B21)+10^-12))+IF(AUTOEVENTO=\"Manual\",SUMPRODUCT((OFFSET(CÁLCULO!$M$15,$A21,0,$B21)=1)*OFFSET(ORÇAMENTO!$AB$15,$A21,0,$B21)*PLE!$AE$9),0))","v":0},{"$f":"ROUND(IF(ACOMPANHAMENTO<>\"PLE\",0,SUMIF(OFFSET(CÁLCULO!$AX$15:$BH$15,$A21,0,$B21),\"<=\"&PLE.Medicao,OFFSET(CÁLCULO!$AB$15:$AL$15,$A21,0,$B21))+IF(AUTOEVENTO=\"Manual\",SUMIF(OFFSET(CÁLCULO!$M$15,$A21,0,$B21),1,OFFSET(ORÇAMENTO!$X$15,$A21,0,$B21))*PLE!$AE$9,0)),2)","v":0},null,{"$f":"IF(ACOMPANHAMENTO<>\"BM\",0,SUMPRODUCT(OFFSET(BM!$M$15,$A21,0,$B21)*(OFFSET(BM!$A$15,$A21,0,$B21)=\"S\")*OFFSET(ORÇAMENTO!AA$15,$A21,0,$B21)/(OFFSET(ORÇAMENTO!$X$15,$A21,0,$B21)+10^-12)))","v":{"$error":"#N/A"}},{"$f":"IF(ACOMPANHAMENTO<>\"BM\",0,SUMPRODUCT(OFFSET(BM!$M$15,$A21,0,$B21)*(OFFSET(BM!$A$15,$A21,0,$B21)=\"S\")*OFFSET(ORÇAMENTO!AB$15,$A21,0,$B21)/(OFFSET(ORÇAMENTO!$X$15,$A21,0,$B21)+10^-12)))","v":{"$error":"#N/A"}},{"$f":"IF(ACOMPANHAMENTO<>\"BM\",0,OFFSET(BM!$M$15,$A21,0))","v":{"$error":"#N/A"}},{"$f":"IF(ACOMPANHAMENTO<>\"BM\",0,SUMPRODUCT(OFFSET(BM!$O$15,$A21,0,$B21)*(OFFSET(BM!$A$15,$A21,0,$B21)=\"S\")*OFFSET(ORÇAMENTO!AA$15,$A21,0,$B21)/(OFFSET(ORÇAMENTO!$X$15,$A21,0,$B21)+10^-12)))","v":{"$error":"#N/A"}},{"$f":"IF(ACOMPANHAMENTO<>\"BM\",0,SUMPRODUCT(OFFSET(BM!$O$15,$A21,0,$B21)*(OFFSET(BM!$A$15,$A21,0,$B21)=\"S\")*OFFSET(ORÇAMENTO!AB$15,$A21,0,$B21)/(OFFSET(ORÇAMENTO!$X$15,$A21,0,$B21)+10^-12)))","v":{"$error":"#N/A"}},{"$f":"IF(ACOMPANHAMENTO<>\"BM\",0,OFFSET(BM!$O$15,$A21,0))","v":{"$error":"#N/A"}}]
[{"$f":"MATCH(E22,ORÇAMENTO!$E$15:$E$34,0)-1","v":{"$error":"#N/A"}},{"$f":"IF(ISERROR($A22),NA(),OFFSET(ORÇAMENTO!$D$15,$A22,0))","v":{"$error":"#N/A"}},{"$f":"QCI!B22","v":"Branco"},"",{"$f":"QCI!D22","v":9},{"$f":"QCI!G22","v":""},{"$f":"QCI!H22","v":0},{"$f":"QCI!I22","v":0},{"$f":"QCI!J22","v":""},{"$f":"QCI!K22","v":""},{"$f":"IF($C22=\"Automático\",IF(ACOMPANHAMENTO=\"BM\",BM.medicao,PLE.Medicao),IF(ISBLANK($X22),\"\",$X22))","v":""},{"$f":"QCI!$O22","v":0},0,0,0,0,null,{"$f":"ROUND(IF($C22=\"Automático\",AC22+AJ22,$Y22*IF(ISERROR(QCI!$AA22/QCI!$O22),0,QCI!$AA22/QCI!$O22)),2)","v":0},{"$f":"ROUND(IF($C22=\"Automático\",AD22+AK22,$Y22*IF(ISERROR(QCI!$AB22/QCI!$O22),0,QCI!$AB22/QCI!$O22)),2)","v":0},{"$f":"ROUND(IF($C22=\"Automático\",AF22+AM22,$Z22*IF(ISERROR(QCI!$AA22/QCI!$O22),0,QCI!$AA22/QCI!$O22)),2)","v":0},{"$f":"ROUND(IF($C22=\"Automático\",AG22+AN22,$Z22*IF(ISERROR(QCI!$AB22/QCI!$O22),0,QCI!$AB22/QCI!$O22)),2)","v":0},{"$f":"IF(AND($L22>0,$J22<>0,$J22<>\"\",COUNTIF($J$13:$J22,$J22)=1),OFFSET(V22,-1,0)+1,OFFSET(V22,-1,0))","v":1},null,null,null,null,null,null,{"$f":"IF(ACOMPANHAMENTO<>\"PLE\",0,SUMPRODUCT((OFFSET(CÁLCULO!$AX$15:$BH$15,$A22,0,$B22)<=(PLE.Medicao-1))*OFFSET(CÁLCULO!$AB$15:$AL$15,$A22,0,$B22)*OFFSET(ORÇAMENTO!$AA$15,$A22,0,$B22)/(OFFSET(ORÇAMENTO!$X$15,$A22,0,$B22)+10^-12))+IF(AUTOEVENTO=\"Manual\",SUMPRODUCT((OFFSET(CÁLCULO!$M$15,$A22,0,$B22)=1)*OFFSET(ORÇAMENTO!$AA$15,$A22,0,$B22)*(PLE!$AE$9-PLE!$Y$9)),0))","v":0},{"$f":"IF(ACOMPANHAMENTO<>\"PLE\",0,SUMPRODUCT((OFFSET(CÁLCULO!$AX$15:$BH$15,$A22,0,$B22)<=(PLE.Medicao-1))*OFFSET(CÁLCULO!$AB$15:$AL$15,$A22,0,$B22)*OFFSET(ORÇAMENTO!$AB$15,$A22,0,$B22)/(OFFSET(ORÇAMENTO!$X$15,$A22,0,$B22)+10^-12))+IF(AUTOEVENTO=\"Manual\",SUMPRODUCT((OFFSET(CÁLCULO!$M$15,$A22,0,$B22)=1)*OFFSET(ORÇAMENTO!$AB$15,$A22,0,$B22)*(PLE!$AE$9-PLE!$Y$9)),0))","v":0},{"$f":"ROUND(IF(ACOMPANHAMENTO<>\"PLE\",0,SUMIF(OFFSET(CÁLCULO!$AX$15:$BH$15,$A22,0,$B22),\"<=\"&(PLE.Medicao-1),OFFSET(CÁLCULO!$AB$15:$AL$15,$A22,0,$B22))+IF(AUTOEVENTO=\"Manual\",SUMIF(OFFSET(CÁLCULO!$M$15,$A22,0,$B22),1,OFFSET(ORÇAMENTO!$X$15,$A22,0,$B22))*(PLE!$AE$9-PLE!$Y$9),0)),2)","v":0},{"$f":"IF(ACOMPANHAMENTO<>\"PLE\",0,SUMPRODUCT((OFFSET(CÁLCULO!$AX$15:$BH$15,$A22,0,$B22)<=PLE.Medicao)*OFFSET(CÁLCULO!$AB$15:$AL$15,$A22,0,$B22)*OFFSET(ORÇAMENTO!$AA$15,$A22,0,$B22)/(OFFSET(ORÇAMENTO!$X$15,$A22,0,$B22)+10^-12))+IF(AUTOEVENTO=\"Manual\",SUMPRODUCT((OFFSET(CÁLCULO!$M$15,$A22,0,$B22)=1)*OFFSET(ORÇAMENTO!$AA$15,$A22,0,$B22)*PLE!$AE$9),0))","v":0},{"$f":"IF(ACOMPANHAMENTO<>\"PLE\",0,SUMPRODUCT((OFFSET(CÁLCULO!$AX$15:$BH$15,$A22,0,$B22)<=PLE.Medicao)*OFFSET(CÁLCULO!$AB$15:$AL$15,$A22,0,$B22)*OFFSET(ORÇAMENTO!$AB$15,$A22,0,$B22)/(OFFSET(ORÇAMENTO!$X$15,$A22,0,$B22)+10^-12))+IF(AUTOEVENTO=\"Manual\",SUMPRODUCT((OFFSET(CÁLCULO!$M$15,$A22,0,$B22)=1)*OFFSET(ORÇAMENTO!$AB$15,$A22,0,$B22)*PLE!$AE$9),0))","v":0},{"$f":"ROUND(IF(ACOMPANHAMENTO<>\"PLE\",0,SUMIF(OFFSET(CÁLCULO!$AX$15:$BH$15,$A22,0,$B22),\"<=\"&PLE.Medicao,OFFSET(CÁLCULO!$AB$15:$AL$15,$A22,0,$B22))+IF(AUTOEVENTO=\"Manual\",SUMIF(OFFSET(CÁLCULO!$M$15,$A22,0,$B22),1,OFFSET(ORÇAMENTO!$X$15,$A22,0,$B22))*PLE!$AE$9,0)),2)","v":0},null,{"$f":"IF(ACOMPANHAMENTO<>\"BM\",0,SUMPRODUCT(OFFSET(BM!$M$15,$A22,0,$B22)*(OFFSET(BM!$A$15,$A22,0,$B22)=\"S\")*OFFSET(ORÇAMENTO!AA$15,$A22,0,$B22)/(OFFSET(ORÇAMENTO!$X$15,$A22,0,$B22)+10^-12)))","v":{"$error":"#N/A"}},{"$f":"IF(ACOMPANHAMENTO<>\"BM\",0,SUMPRODUCT(OFFSET(BM!$M$15,$A22,0,$B22)*(OFFSET(BM!$A$15,$A22,0,$B22)=\"S\")*OFFSET(ORÇAMENTO!AB$15,$A22,0,$B22)/(OFFSET(ORÇAMENTO!$X$15,$A22,0,$B22)+10^-12)))","v":{"$error":"#N/A"}},{"$f":"IF(ACOMPANHAMENTO<>\"BM\",0,OFFSET(BM!$M$15,$A22,0))","v":{"$error":"#N/A"}},{"$f":"IF(ACOMPANHAMENTO<>\"BM\",0,SUMPRODUCT(OFFSET(BM!$O$15,$A22,0,$B22)*(OFFSET(BM!$A$15,$A22,0,$B22)=\"S\")*OFFSET(ORÇAMENTO!AA$15,$A22,0,$B22)/(OFFSET(ORÇAMENTO!$X$15,$A22,0,$B22)+10^-12)))","v":{"$error":"#N/A"}},{"$f":"IF(ACOMPANHAMENTO<>\"BM\",0,SUMPRODUCT(OFFSET(BM!$O$15,$A22,0,$B22)*(OFFSET(BM!$A$15,$A22,0,$B22)=\"S\")*OFFSET(ORÇAMENTO!AB$15,$A22,0,$B22)/(OFFSET(ORÇAMENTO!$X$15,$A22,0,$B22)+10^-12)))","v":{"$error":"#N/A"}},{"$f":"IF(ACOMPANHAMENTO<>\"BM\",0,OFFSET(BM!$O$15,$A22,0))","v":{"$error":"#N/A"}}]
[{"$f":"MATCH(E23,ORÇAMENTO!$E$15:$E$34,0)-1","v":{"$error":"#N/A"}},{"$f":"IF(ISERROR($A23),NA(),OFFSET(ORÇAMENTO!$D$15,$A23,0))","v":{"$error":"#N/A"}},{"$f":"QCI!B23","v":"Branco"},{"$f":"IF(L23>0,\"F\",\"\")","v":""},{"$f":"QCI!D23","v":10},{"$f":"QCI!G23","v":""},{"$f":"QCI!H23","v":0},{"$f":"QCI!I23","v":0},{"$f":"QCI!J23","v":""},{"$f":"QCI!K23","v":""},{"$f":"IF($C23=\"Automático\",IF(ACOMPANHAMENTO=\"BM\",BM.medicao,PLE.Medicao),IF(ISBLANK($X23),\"\",$X23))","v":""},{"$f":"QCI!$O23","v":0},{"$f":"ROUND(IF(C23=\"Automático\",AE23+AL23,Y23),2)","v":0},{"$f":"O23-M23","v":0},{"$f":"ROUND(IF(C23=\"Automático\",AH23+AO23,Z23),2)","v":0},{"$f":"O23/(L23+10^-12)","v":0},null,{"$f":"ROUND(IF($C23=\"Automático\",AC23+AJ23,$Y23*IF(ISERROR(QCI!$AA23/QCI!$O23),0,QCI!$AA23/QCI!$O23)),2)","v":0},{"$f":"ROUND(IF($C23=\"Automático\",AD23+AK23,$Y23*IF(ISERROR(QCI!$AB23/QCI!$O23),0,QCI!$AB23/QCI!$O23)),2)","v":0},{"$f":"ROUND(IF($C23=\"Automático\",AF23+AM23,$Z23*IF(ISERROR(QCI!$AA23/QCI!$O23),0,QCI!$AA23/QCI!$O23)),2)","v":0},{"$f":"ROUND(IF($C23=\"Automático\",AG23+AN23,$Z23*IF(ISERROR(QCI!$AB23/QCI!$O23),0,QCI!$AB23/QCI!$O23)),2)","v":0},{"$f":"IF(AND($L23>0,$J23<>0,$J23<>\"\",COUNTIF($J$13:$J23,$J23)=1),OFFSET(V23,-1,0)+1,OFFSET(V23,-1,0))","v":1},null,null,null,null,null,null,{"$f":"IF(ACOMPANHAMENTO<>\"PLE\",0,SUMPRODUCT((OFFSET(CÁLCULO!$AX$15:$BH$15,$A23,0,$B23)<=(PLE.Medicao-1))*OFFSET(CÁLCULO!$AB$15:$AL$15,$A23,0,$B23)*OFFSET(ORÇAMENTO!$AA$15,$A23,0,$B23)/(OFFSET(ORÇAMENTO!$X$15,$A23,0,$B23)+10^-12))+IF(AUTOEVENTO=\"Manual\",SUMPRODUCT((OFFSET(CÁLCULO!$M$15,$A23,0,$B23)=1)*OFFSET(ORÇAMENTO!$AA$15,$A23,0,$B23)*(PLE!$AE$9-PLE!$Y$9)),0))","v":0},{"$f":"IF(ACOMPANHAMENTO<>\"PLE\",0,SUMPRODUCT((OFFSET(CÁLCULO!$AX$15:$BH$15,$A23,0,$B23)<=(PLE.Medicao-1))*OFFSET(CÁLCULO!$AB$15:$AL$15,$A23,0,$B23)*OFFSET(ORÇAMENTO!$AB$15,$A23,0,$B23)/(OFFSET(ORÇAMENTO!$X$15,$A23,0,$B23)+10^-12))+IF(AUTOEVENTO=\"Manual\",SUMPRODUCT((OFFSET(CÁLCULO!$M$15,$A23,0,$B23)=1)*OFFSET(ORÇAMENTO!$AB$15,$A23,0,$B23)*(PLE!$AE$9-PLE!$Y$9)),0))","v":0},{"$f":"ROUND(IF(ACOMPANHAMENTO<>\"PLE\",0,SUMIF(OFFSET(CÁLCULO!$AX$15:$BH$15,$A23,0,$B23),\"<=\"&(PLE.Medicao-1),OFFSET(CÁLCULO!$AB$15:$AL$15,$A23,0,$B23))+IF(AUTOEVENTO=\"Manual\",SUMIF(OFFSET(CÁLCULO!$M$15,$A23,0,$B23),1,OFFSET(ORÇAMENTO!$X$15,$A23,0,$B23))*(PLE!$AE$9-PLE!$Y$9),0)),2)","v":0},{"$f":"IF(ACOMPANHAMENTO<>\"PLE\",0,SUMPRODUCT((OFFSET(CÁLCULO!$AX$15:$BH$15,$A23,0,$B23)<=PLE.Medicao)*OFFSET(CÁLCULO!$AB$15:$AL$15,$A23,0,$B23)*OFFSET(ORÇAMENTO!$AA$15,$A23,0,$B23)/(OFFSET(ORÇAMENTO!$X$15,$A23,0,$B23)+10^-12))+IF(AUTOEVENTO=\"Manual\",SUMPRODUCT((OFFSET(CÁLCULO!$M$15,$A23,0,$B23)=1)*OFFSET(ORÇAMENTO!$AA$15,$A23,0,$B23)*PLE!$AE$9),0))","v":0},{"$f":"IF(ACOMPANHAMENTO<>\"PLE\",0,SUMPRODUCT((OFFSET(CÁLCULO!$AX$15:$BH$15,$A23,0,$B23)<=PLE.Medicao)*OFFSET(CÁLCULO!$AB$15:$AL$15,$A23,0,$B23)*OFFSET(ORÇAMENTO!$AB$15,$A23,0,$B23)/(OFFSET(ORÇAMENTO!$X$15,$A23,0,$B23)+10^-12))+IF(AUTOEVENTO=\"Manual\",SUMPRODUCT((OFFSET(CÁLCULO!$M$15,$A23,0,$B23)=1)*OFFSET(ORÇAMENTO!$AB$15,$A23,0,$B23)*PLE!$AE$9),0))","v":0},{"$f":"ROUND(IF(ACOMPANHAMENTO<>\"PLE\",0,SUMIF(OFFSET(CÁLCULO!$AX$15:$BH$15,$A23,0,$B23),\"<=\"&PLE.Medicao,OFFSET(CÁLCULO!$AB$15:$AL$15,$A23,0,$B23))+IF(AUTOEVENTO=\"Manual\",SUMIF(OFFSET(CÁLCULO!$M$15,$A23,0,$B23),1,OFFSET(ORÇAMENTO!$X$15,$A23,0,$B23))*PLE!$AE$9,0)),2)","v":0},null,{"$f":"IF(ACOMPANHAMENTO<>\"BM\",0,SUMPRODUCT(OFFSET(BM!$M$15,$A23,0,$B23)*(OFFSET(BM!$A$15,$A23,0,$B23)=\"S\")*OFFSET(ORÇAMENTO!AA$15,$A23,0,$B23)/(OFFSET(ORÇAMENTO!$X$15,$A23,0,$B23)+10^-12)))","v":{"$error":"#N/A"}},{"$f":"IF(ACOMPANHAMENTO<>\"BM\",0,SUMPRODUCT(OFFSET(BM!$M$15,$A23,0,$B23)*(OFFSET(BM!$A$15,$A23,0,$B23)=\"S\")*OFFSET(ORÇAMENTO!AB$15,$A23,0,$B23)/(OFFSET(ORÇAMENTO!$X$15,$A23,0,$B23)+10^-12)))","v":{"$error":"#N/A"}},{"$f":"IF(ACOMPANHAMENTO<>\"BM\",0,OFFSET(BM!$M$15,$A23,0))","v":{"$error":"#N/A"}},{"$f":"IF(ACOMPANHAMENTO<>\"BM\",0,SUMPRODUCT(OFFSET(BM!$O$15,$A23,0,$B23)*(OFFSET(BM!$A$15,$A23,0,$B23)=\"S\")*OFFSET(ORÇAMENTO!AA$15,$A23,0,$B23)/(OFFSET(ORÇAMENTO!$X$15,$A23,0,$B23)+10^-12)))","v":{"$error":"#N/A"}},{"$f":"IF(ACOMPANHAMENTO<>\"BM\",0,SUMPRODUCT(OFFSET(BM!$O$15,$A23,0,$B23)*(OFFSET(BM!$A$15,$A23,0,$B23)=\"S\")*OFFSET(ORÇAMENTO!AB$15,$A23,0,$B23)/(OFFSET(ORÇAMENTO!$X$15,$A23,0,$B23)+10^-12)))","v":{"$error":"#N/A"}},{"$f":"IF(ACOMPANHAMENTO<>\"BM\",0,OFFSET(BM!$O$15,$A23,0))","v":{"$error":"#N/A"}}]
[null,null,null,"F",null,null,null,null,null,"(%)",null,{"$f":"IF(ISERROR(L28/$L28),0,ROUND(L28/$L28,4))","v":1},{"$f":"IF(ISERROR(M28/$L28),0,ROUND(M28/$L28,4))","v":0},{"$f":"IF(ISERROR(N28/$L28),0,ROUND(N28/$L28,4))","v":0},{"$f":"IF(ISERROR(O28/$L28),0,ROUND(O28/$L28,4))","v":0},{"$f":"O28/(L28+10^-12)","v":0}]
[null,null,null,"F",null,null,null,null,null,{"$f":"IF(import.recurso=\"FGTS\",\"Financiamento\",\"Repasse\")","v":"Repasse"},null,{"$f":"QCI!L24","v":0},{"$f":"M28-M27-M26","v":0},{"$f":"O25-M25","v":0},{"$f":"O28-O27-O26","v":0},null,null,null,null,null,null,null,null,null,"Anterior (R$)","Acumulado (R$)",null,null,"Max CP/OU Ant.","Max CP/OU Acum."]
[null,null,null,"F",null,null,null,null,null,"Contrapartida",null,{"$f":"QCI!M24","v":196407.48},{"$f":"ROUND(IF(OFFSET($X$26,0,1)<>\"\",OFFSET($X$26,0,1),SUM(R13:OFFSET(R24,-1,0))),2)","v":0},{"$f":"O26-M26","v":0},{"$f":"IF(OFFSET($X$26,0,2)<>\"\",OFFSET($X$26,0,2),$AE$3)","v":0},null,null,null,null,null,null,null,null,"CP",null,null,null,null,{"$f":"MIN($L26,$O$28-OFFSET($X$27,0,1))","v":0},{"$f":"MIN($L26,$O$28-OFFSET($X$27,0,2))","v":0}]
[null,null,null,"F",null,null,null,null,null,"Outros",null,{"$f":"QCI!N24","v":0},{"$f":"ROUND(IF(OFFSET($X$27,0,1)<>\"\",OFFSET($X$27,0,1),SUM(S13:OFFSET(S24,-1,0))),2)","v":0},{"$f":"O27-M27","v":0},{"$f":"IF(OFFSET($X$27,0,2)<>\"\",OFFSET($X$27,0,2),$AE$4)","v":0},null,null,null,null,null,null,null,null,"OU",null,null,null,null,{"$f":"MIN($L27,$O$28-OFFSET($X$26,0,1))","v":0},{"$f":"MIN($L27,$O$28-OFFSET($X$26,0,2))","v":0}]
[null,null,null,"F",null,null,null,null,null,"Investimento",null,{"$f":"SUM(L13:OFFSET(L24,-1,0))","v":196407.48},{"$f":"ROUND(SUM(M13:OFFSET(M24,-1,0)),2)","v":0},{"$f":"O28-M28","v":0},{"$f":"SUM(O13:OFFSET(O24,-1,0))","v":0}]
[null,null,null,null,null,null,null,null,null,null,null,null,null,null,{"$f":"\"Acumulado Anterior:  \"&TEXT($M$28/($L$28+10^-12),\"0,00%\")","v":"Acumulado Anterior:  0,00%"}]
[null,null,null,null,"Observações:"]
[]
[]
[]
[]
[null,null,null,null,{"$f":"Import.Município","v":"TRAMANDAÍ/RS"},null,null,null,null,null,null,{"$f":"DADOS!$F$25","v":"2025-03-14"}]
[null,null,null,null,"Local",null,null,null,null,null,null,"Data"]
[]
[]
[null,null,null,null,{"$f":"IF(CAIXA.Modo,\"Responsável Gerencial CAIXA\",\"Representante Tomador\")","v":"Representante Tomador"},null,null,null,null,null,null,{"$f":"IF(CAIXA.Modo,\"Responsável Técnico CAIXA\",\"Responsável Técnico pela Fiscalização\")","v":"Responsável Técnico pela Fiscalização"}]
[null,null,null,null,"Nome:",{"$f":"IF(CAIXA.Modo,DADOS!F60,DADOS!F28)","v":0},null,null,null,null,null,"Nome:",{"$f":"IF(CAIXA.Modo,BM!X46,DADOS!F51)","v":0}]
[null,null,null,null,{"$f":"IF(CAIXA.Modo,\"Função:\",\"Cargo:\")","v":"Cargo:"},{"$f":"IF(CAIXA.Modo,DADOS!F61,DADOS!F29)","v":0},null,null,null,null,null,{"$f":"IF(CAIXA.Modo,\"Matrícula:\",\"Profissão:\")","v":"Profissão:"},{"$f":"IF(CAIXA.Modo,BM!X47,DADOS!F52)","v":0}]
[null,null,null,null,null,null,null,null,null,null,null,"CREA/CAU:",{"$f":"IF(CAIXA.Modo,BM!X48,DADOS!F53)","v":0}]
[null,null,null,null,null,null,null,null,null,null,null,{"$f":"IF(CAIXA.Modo,\"\",\"ART/RRT:\")","v":"ART/RRT:"},{"$f":"IF(CAIXA.Modo,\"\",DADOS!F54)","v":0}]
[]
[]
[null,null,null,null,{"$f":"IF(CAIXA.Modo,\"Responsável Social CAIXA\",\"Responsável Social\")","v":"Responsável Social"},null,null,null,null,null,null,{"$f":"IF(CAIXA.Modo,\"Responsável Operacional CAIXA\",\"Responsável Financeiro\")","v":"Responsável Financeiro"}]
[null,null,null,null,"Nome:",null,null,null,null,null,null,"Nome:"]
[null,null,null,null,{"$f":"IF(CAIXA.Modo,\"Função:\",\"Cargo:\")","v":"Cargo:"},null,null,null,null,null,null,{"$f":"IF(CAIXA.Modo,\"Função:\",\"Cargo:\")","v":"Cargo:"}]
[null,null,null,null,{"$f":"IF(CAIXA.Modo,\"Matr:\",\"\")","v":""},null,null,null,null,null,null,{"$f":"IF(CAIXA.Modo,\"Matrícula:\",\"\")","v":""}]

{"sheet":"OFÍCIO","index":13,"n_rows":55,"n_cols":12,"rows_kept":55,"cut":false,"hidden":false,"merged":[[3,11,4,11],[5,2,5,3],[7,1,7,6],[9,1,9,3],[0,1,3,2],[3,8,4,8],[3,9,4,9],[3,10,4,10],[23,1,25,6],[27,1,28,2],[18,1,19,1],[18,2,19,6],[10,2,10,3],[13,2,13,6],[14,2,15,6],[17,2,17,6],[27,3,28,3],[27,4,28,4],[27,5,28,6],[30,1,30,2],[30,5,30,6],[29,1,29,2],[29,5,29,6],[53,1,53,6],[31,1,31,2],[31,5,31,6],[54,1,55,6],[32,1,32,2],[32,5,32,6],[33,1,33,2],[33,5,33,6],[36,1,37,6],[38,1,39,6],[41,1,45,6]]}
[null,null,null,null,null,null,"Grau de Sigilo"]
[null,null,null,null,null,null,"# PÚBLICO"]
[null,null,null,null,null,null,null,null,"Resumo de Valores por CTEF:"]
[null,null,null,null,null,null,null,null,"CTEF:","Valor Vigente (R$)","Valor desta Medição (R$)","Valor Acumulado (R$)"]
[]
[null,"Ofício n°:",null,null,null,null,null,null,{"$f":"IF(ROW(I6)-ROW(L$5)>MAX(RRE!$V$13:$V$24),\"\",INDEX(RRE!$J$13:$J$24,MATCH(ROW(I6)-ROW(I$5),RRE!$V$13:$V$24,0)))","v":"LOTE 1"},{"$f":"IF(I6=\"\",\"\",SUMIF(RRE!$J$13:$J$24,OFÍCIO!$I6,RRE!$L$13:$L$24))","v":196407.48},{"$f":"IF(J6=\"\",\"\",SUMIF(RRE!$J$13:$J$24,OFÍCIO!$I6,RRE!$N$13:$N$24))","v":0},{"$f":"IF(K6=\"\",\"\",SUMIF(RRE!$J$13:$J$24,OFÍCIO!$I6,RRE!$O$13:$O$24))","v":0}]
[null,null,null,null,null,null,null,null,{"$f":"IF(ROW(I7)-ROW(L$5)>MAX(RRE!$V$13:$V$24),\"\",INDEX(RRE!$J$13:$J$24,MATCH(ROW(I7)-ROW(I$5),RRE!$V$13:$V$24,0)))","v":""},{"$f":"IF(I7=\"\",\"\",SUMIF(RRE!$J$13:$J$24,OFÍCIO!$I7,RRE!$L$13:$L$24))","v":""},{"$f":"IF(J7=\"\",\"\",SUMIF(RRE!$J$13:$J$24,OFÍCIO!$I7,RRE!$N$13:$N$24))","v":""},{"$f":"IF(K7=\"\",\"\",SUMIF(RRE!$J$13:$J$24,OFÍCIO!$I7,RRE!$O$13:$O$24))","v":""}]
[null,{"$f":"CONCATENATE(RRE!$E$35,\", \",TEXT(RRE!$L$35,\"dd\"\" de \"\"mmmm\"\" de \"\"aaaa\"))","v":"TRAMANDAÍ/RS, 14 de março de 2025"},null,null,null,null,null,null,{"$f":"IF(ROW(I8)-ROW(L$5)>MAX(RRE!$V$13:$V$24),\"\",INDEX(RRE!$J$13:$J$24,MATCH(ROW(I8)-ROW(I$5),RRE!$V$13:$V$24,0)))","v":""},{"$f":"IF(I8=\"\",\"\",SUMIF(RRE!$J$13:$J$24,OFÍCIO!$I8,RRE!$L$13:$L$24))","v":""},{"$f":"IF(J8=\"\",\"\",SUMIF(RRE!$J$13:$J$24,OFÍCIO!$I8,RRE!$N$13:$N$24))","v":""},{"$f":"IF(K8=\"\",\"\",SUMIF(RRE!$J$13:$J$24,OFÍCIO!$I8,RRE!$O$13:$O$24))","v":""}]
[null,"À",null,null,null,null,null,null,{"$f":"IF(ROW(I9)-ROW(L$5)>MAX(RRE!$V$13:$V$24),\"\",INDEX(RRE!$J$13:$J$24,MATCH(ROW(I9)-ROW(I$5),RRE!$V$13:$V$24,0)))","v":""},{"$f":"IF(I9=\"\",\"\",SUMIF(RRE!$J$13:$J$24,OFÍCIO!$I9,RRE!$L$13:$L$24))","v":""},{"$f":"IF(J9=\"\",\"\",SUMIF(RRE!$J$13:$J$24,OFÍCIO!$I9,RRE!$N$13:$N$24))","v":""},{"$f":"IF(K9=\"\",\"\",SUMIF(RRE!$J$13:$J$24,OFÍCIO!$I9,RRE!$O$13:$O$24))","v":""}]
[null,"CAIXA ECONÔMICA FEDERAL",null,null,null,null,null,null,{"$f":"IF(ROW(I10)-ROW(L$5)>MAX(RRE!$V$13:$V$24),\"\",INDEX(RRE!$J$13:$J$24,MATCH(ROW(I10)-ROW(I$5),RRE!$V$13:$V$24,0)))","v":""},{"$f":"IF(I10=\"\",\"\",SUMIF(RRE!$J$13:$J$24,OFÍCIO!$I10,RRE!$L$13:$L$24))","v":""},{"$f":"IF(J10=\"\",\"\",SUMIF(RRE!$J$13:$J$24,OFÍCIO!$I10,RRE!$N$13:$N$24))","v":""},{"$f":"IF(K10=\"\",\"\",SUMIF(RRE!$J$13:$J$24,OFÍCIO!$I10,RRE!$O$13:$O$24))","v":""}]
[null,"GIGOV",null,null,null,null,null,null,{"$f":"IF(ROW(I11)-ROW(L$5)>MAX(RRE!$V$13:$V$24),\"\",INDEX(RRE!$J$13:$J$24,MATCH(ROW(I11)-ROW(I$5),RRE!$V$13:$V$24,0)))","v":""},{"$f":"IF(I11=\"\",\"\",SUMIF(RRE!$J$13:$J$24,OFÍCIO!$I11,RRE!$L$13:$L$24))","v":""},{"$f":"IF(J11=\"\",\"\",SUMIF(RRE!$J$13:$J$24,OFÍCIO!$I11,RRE!$N$13:$N$24))","v":""},{"$f":"IF(K11=\"\",\"\",SUMIF(RRE!$J$13:$J$24,OFÍCIO!$I11,RRE!$O$13:$O$24))","v":""}]
[null,null,null,null,null,null,null,null,{"$f":"IF(ROW(I12)-ROW(L$5)>MAX(RRE!$V$13:$V$24),\"\",INDEX(RRE!$J$13:$J$24,MATCH(ROW(I12)-ROW(I$5),RRE!$V$13:$V$24,0)))","v":""},{"$f":"IF(I12=\"\",\"\",SUMIF(RRE!$J$13:$J$24,OFÍCIO!$I12,RRE!$L$13:$L$24))","v":""},{"$f":"IF(J12=\"\",\"\",SUMIF(RRE!$J$13:$J$24,OFÍCIO!$I12,RRE!$N$13:$N$24))","v":""},{"$f":"IF(K12=\"\",\"\",SUMIF(RRE!$J$13:$J$24,OFÍCIO!$I12,RRE!$O$13:$O$24))","v":""}]
[null,null,null,null,null,null,null,null,{"$f":"IF(ROW(I13)-ROW(L$5)>MAX(RRE!$V$13:$V$24),\"\",INDEX(RRE!$J$13:$J$24,MATCH(ROW(I13)-ROW(I$5),RRE!$V$13:$V$24,0)))","v":""},{"$f":"IF(I13=\"\",\"\",SUMIF(RRE!$J$13:$J$24,OFÍCIO!$I13,RRE!$L$13:$L$24))","v":""},{"$f":"IF(J13=\"\",\"\",SUMIF(RRE!$J$13:$J$24,OFÍCIO!$I13,RRE!$N$13:$N$24))","v":""},{"$f":"IF(K13=\"\",\"\",SUMIF(RRE!$J$13:$J$24,OFÍCIO!$I13,RRE!$O$13:$O$24))","v":""}]
[null,"Assunto:",{"$f":"CONCATENATE(RRE.Numero,\"ª\",\" Solicitação de \",IF(import.recurso=\"OGU\",\"Desbloqueio\",\"Desembolso\"),\" de Recursos.\")","v":"1ª Solicitação de Desbloqueio de Recursos."},null,null,null,null,null,{"$f":"IF(ROW(I14)-ROW(L$5)>MAX(RRE!$V$13:$V$24),\"\",INDEX(RRE!$J$13:$J$24,MATCH(ROW(I14)-ROW(I$5),RRE!$V$13:$V$24,0)))","v":""},{"$f":"IF(I14=\"\",\"\",SUMIF(RRE!$J$13:$J$24,OFÍCIO!$I14,RRE!$L$13:$L$24))","v":""},{"$f":"IF(J14=\"\",\"\",SUMIF(RRE!$J$13:$J$24,OFÍCIO!$I14,RRE!$N$13:$N$24))","v":""},{"$f":"IF(K14=\"\",\"\",SUMIF(RRE!$J$13:$J$24,OFÍCIO!$I14,RRE!$O$13:$O$24))","v":""}]
[null,"REF:",{"$f":"CONCATENATE(\"Contrato de \",IF(import.recurso=\"OGU\",\"Repasse\",\"Financiamento\"),\" - Operação nº \",Import.CR,IF(Import.TransfereGOV=\"\",\"\",CONCATENATE(\" - TransfereGOV nº \",Import.TransfereGOV)))","v":"Contrato de Repasse - Operação nº 109437911 - TransfereGOV nº 02829/2024"},null,null,null,null,null,{"$f":"IF(ROW(I15)-ROW(L$5)>MAX(RRE!$V$13:$V$24),\"\",INDEX(RRE!$J$13:$J$24,MATCH(ROW(I15)-ROW(I$5),RRE!$V$13:$V$24,0)))","v":""},{"$f":"IF(I15=\"\",\"\",SUMIF(RRE!$J$13:$J$24,OFÍCIO!$I15,RRE!$L$13:$L$24))","v":""},{"$f":"IF(J15=\"\",\"\",SUMIF(RRE!$J$13:$J$24,OFÍCIO!$I15,RRE!$N$13:$N$24))","v":""},{"$f":"IF(K15=\"\",\"\",SUMIF(RRE!$J$13:$J$24,OFÍCIO!$I15,RRE!$O$13:$O$24))","v":""}]
[null,null,null,null,null,null,null,null,{"$f":"IF(ROW(I16)-ROW(L$5)>MAX(RRE!$V$13:$V$24),\"\",INDEX(RRE!$J$13:$J$24,MATCH(ROW(I16)-ROW(I$5),RRE!$V$13:$V$24,0)))","v":""},{"$f":"IF(I16=\"\",\"\",SUMIF(RRE!$J$13:$J$24,OFÍCIO!$I16,RRE!$L$13:$L$24))","v":""},{"$f":"IF(J16=\"\",\"\",SUMIF(RRE!$J$13:$J$24,OFÍCIO!$I16,RRE!$N$13:$N$24))","v":""},{"$f":"IF(K16=\"\",\"\",SUMIF(RRE!$J$13:$J$24,OFÍCIO!$I16,RRE!$O$13:$O$24))","v":""}]
[null,null,null,null,null,null,null,null,{"$f":"IF(ROW(I17)-ROW(L$5)>MAX(RRE!$V$13:$V$24),\"\",INDEX(RRE!$J$13:$J$24,MATCH(ROW(I17)-ROW(I$5),RRE!$V$13:$V$24,0)))","v":""},{"$f":"IF(I17=\"\",\"\",SUMIF(RRE!$J$13:$J$24,OFÍCIO!$I17,RRE!$L$13:$L$24))","v":""},{"$f":"IF(J17=\"\",\"\",SUMIF(RRE!$J$13:$J$24,OFÍCIO!$I17,RRE!$N$13:$N$24))","v":""},{"$f":"IF(K17=\"\",\"\",SUMIF(RRE!$J$13:$J$24,OFÍCIO!$I17,RRE!$O$13:$O$24))","v":""}]
[null,"Objeto:",{"$f":"Import.DescLote","v":"CONSTRUÇÃO DA EMEI PORTAL DAS FLORES"},null,null,null,null,null,{"$f":"IF(ROW(I18)-ROW(L$5)>MAX(RRE!$V$13:$V$24),\"\",INDEX(RRE!$J$13:$J$24,MATCH(ROW(I18)-ROW(I$5),RRE!$V$13:$V$24,0)))","v":""},{"$f":"IF(I18=\"\",\"\",SUMIF(RRE!$J$13:$J$24,OFÍCIO!$I18,RRE!$L$13:$L$24))","v":""},{"$f":"IF(J18=\"\",\"\",SUMIF(RRE!$J$13:$J$24,OFÍCIO!$I18,RRE!$N$13:$N$24))","v":""},{"$f":"IF(K18=\"\",\"\",SUMIF(RRE!$J$13:$J$24,OFÍCIO!$I18,RRE!$O$13:$O$24))","v":""}]
[null,"Proponente / Tomador:",{"$f":"Import.Proponente","v":"PREFEITURA MUNICIPAL DE TRAMANDAÍ "},null,null,null,null,null,{"$f":"IF(ROW(I19)-ROW(L$5)>MAX(RRE!$V$13:$V$24),\"\",INDEX(RRE!$J$13:$J$24,MATCH(ROW(I19)-ROW(I$5),RRE!$V$13:$V$24,0)))","v":""},{"$f":"IF(I19=\"\",\"\",SUMIF(RRE!$J$13:$J$24,OFÍCIO!$I19,RRE!$L$13:$L$24))","v":""},{"$f":"IF(J19=\"\",\"\",SUMIF(RRE!$J$13:$J$24,OFÍCIO!$I19,RRE!$N$13:$N$24))","v":""},{"$f":"IF(K19=\"\",\"\",SUMIF(RRE!$J$13:$J$24,OFÍCIO!$I19,RRE!$O$13:$O$24))","v":""}]
[null,null,null,null,null,null,null,null,{"$f":"IF(ROW(I20)-ROW(L$5)>MAX(RRE!$V$13:$V$24),\"\",INDEX(RRE!$J$13:$J$24,MATCH(ROW(I20)-ROW(I$5),RRE!$V$13:$V$24,0)))","v":""},{"$f":"IF(I20=\"\",\"\",SUMIF(RRE!$J$13:$J$24,OFÍCIO!$I20,RRE!$L$13:$L$24))","v":""},{"$f":"IF(J20=\"\",\"\",SUMIF(RRE!$J$13:$J$24,OFÍCIO!$I20,RRE!$N$13:$N$24))","v":""},{"$f":"IF(K20=\"\",\"\",SUMIF(RRE!$J$13:$J$24,OFÍCIO!$I20,RRE!$O$13:$O$24))","v":""}]
[null,null,null,null,null,null,null,null,{"$f":"IF(ROW(I21)-ROW(L$5)>MAX(RRE!$V$13:$V$24),\"\",INDEX(RRE!$J$13:$J$24,MATCH(ROW(I21)-ROW(I$5),RRE!$V$13:$V$24,0)))","v":""},{"$f":"IF(I21=\"\",\"\",SUMIF(RRE!$J$13:$J$24,OFÍCIO!$I21,RRE!$L$13:$L$24))","v":""},{"$f":"IF(J21=\"\",\"\",SUMIF(RRE!$J$13:$J$24,OFÍCIO!$I21,RRE!$N$13:$N$24))","v":""},{"$f":"IF(K21=\"\",\"\",SUMIF(RRE!$J$13:$J$24,OFÍCIO!$I21,RRE!$O$13:$O$24))","v":""}]
[null,{"$f":"IF(B11=\"GIGOV\",\"Senhor Gerente\",\"Senhor Superintendente\")","v":"Senhor Gerente"},null,null,null,null,null,null,{"$f":"IF(ROW(I22)-ROW(L$5)>MAX(RRE!$V$13:$V$24),\"\",INDEX(RRE!$J$13:$J$24,MATCH(ROW(I22)-ROW(I$5),RRE!$V$13:$V$24,0)))","v":""},{"$f":"IF(I22=\"\",\"\",SUMIF(RRE!$J$13:$J$24,OFÍCIO!$I22,RRE!$L$13:$L$24))","v":""},{"$f":"IF(J22=\"\",\"\",SUMIF(RRE!$J$13:$J$24,OFÍCIO!$I22,RRE!$N$13:$N$24))","v":""},{"$f":"IF(K22=\"\",\"\",SUMIF(RRE!$J$13:$J$24,OFÍCIO!$I22,RRE!$O$13:$O$24))","v":""}]
[null,null,null,null,null,null,null,null,{"$f":"IF(ROW(I23)-ROW(L$5)>MAX(RRE!$V$13:$V$24),\"\",INDEX(RRE!$J$13:$J$24,MATCH(ROW(I23)-ROW(I$5),RRE!$V$13:$V$24,0)))","v":""},{"$f":"IF(I23=\"\",\"\",SUMIF(RRE!$J$13:$J$24,OFÍCIO!$I23,RRE!$L$13:$L$24))","v":""},{"$f":"IF(J23=\"\",\"\",SUMIF(RRE!$J$13:$J$24,OFÍCIO!$I23,RRE!$N$13:$N$24))","v":""},{"$f":"IF(K23=\"\",\"\",SUMIF(RRE!$J$13:$J$24,OFÍCIO!$I23,RRE!$O$13:$O$24))","v":""}]
[null,{"$f":"CONCATENATE(\"1. Vimos pelo presente, solicitar à Caixa Econômica Federal autorização para \",IF(import.recurso=\"OGU\",\"desbloqueio\",\"desembolso\"),\" da parcela de recursos relativa ao Contrato de \",IF(import.recurso=\"OGU\",\"Repasse\",\"Financiamento\"),\" em referência, conforme valores abaixo discriminados e, para tanto, anexamos a documentação necessária ao pleito.\")","v":"1. Vimos pelo presente, solicitar à Caixa Econômica Federal autorização para desbloqueio da parcela de recursos relativa ao Contrato de Repasse em referência, conforme valores abaixo discriminados e, para tanto, anexamos a documentação necessária ao pleito."},null,null,null,null,null,null,{"$f":"IF(ROW(I24)-ROW(L$5)>MAX(RRE!$V$13:$V$24),\"\",INDEX(RRE!$J$13:$J$24,MATCH(ROW(I24)-ROW(I$5),RRE!$V$13:$V$24,0)))","v":""},{"$f":"IF(I24=\"\",\"\",SUMIF(RRE!$J$13:$J$24,OFÍCIO!$I24,RRE!$L$13:$L$24))","v":""},{"$f":"IF(J24=\"\",\"\",SUMIF(RRE!$J$13:$J$24,OFÍCIO!$I24,RRE!$N$13:$N$24))","v":""},{"$f":"IF(K24=\"\",\"\",SUMIF(RRE!$J$13:$J$24,OFÍCIO!$I24,RRE!$O$13:$O$24))","v":""}]
[null,null,null,null,null,null,null,null,{"$f":"IF(ROW(I25)-ROW(L$5)>MAX(RRE!$V$13:$V$24),\"\",INDEX(RRE!$J$13:$J$24,MATCH(ROW(I25)-ROW(I$5),RRE!$V$13:$V$24,0)))","v":""},{"$f":"IF(I25=\"\",\"\",SUMIF(RRE!$J$13:$J$24,OFÍCIO!$I25,RRE!$L$13:$L$24))","v":""},{"$f":"IF(J25=\"\",\"\",SUMIF(RRE!$J$13:$J$24,OFÍCIO!$I25,RRE!$N$13:$N$24))","v":""},{"$f":"IF(K25=\"\",\"\",SUMIF(RRE!$J$13:$J$24,OFÍCIO!$I25,RRE!$O$13:$O$24))","v":""}]
[null,null,null,null,null,null,null,null,{"$f":"IF(ROW(I26)-ROW(L$5)>MAX(RRE!$V$13:$V$24),\"\",INDEX(RRE!$J$13:$J$24,MATCH(ROW(I26)-ROW(I$5),RRE!$V$13:$V$24,0)))","v":""},{"$f":"IF(I26=\"\",\"\",SUMIF(RRE!$J$13:$J$24,OFÍCIO!$I26,RRE!$L$13:$L$24))","v":""},{"$f":"IF(J26=\"\",\"\",SUMIF(RRE!$J$13:$J$24,OFÍCIO!$I26,RRE!$N$13:$N$24))","v":""},{"$f":"IF(K26=\"\",\"\",SUMIF(RRE!$J$13:$J$24,OFÍCIO!$I26,RRE!$O$13:$O$24))","v":""}]
[null,null,null,null,null,null,null,null,{"$f":"IF(ROW(I27)-ROW(L$5)>MAX(RRE!$V$13:$V$24),\"\",INDEX(RRE!$J$13:$J$24,MATCH(ROW(I27)-ROW(I$5),RRE!$V$13:$V$24,0)))","v":""},{"$f":"IF(I27=\"\",\"\",SUMIF(RRE!$J$13:$J$24,OFÍCIO!$I27,RRE!$L$13:$L$24))","v":""},{"$f":"IF(J27=\"\",\"\",SUMIF(RRE!$J$13:$J$24,OFÍCIO!$I27,RRE!$N$13:$N$24))","v":""},{"$f":"IF(K27=\"\",\"\",SUMIF(RRE!$J$13:$J$24,OFÍCIO!$I27,RRE!$O$13:$O$24))","v":""}]
[null,null,null,"Valores Vigentes do TC/CR",{"$f":"\"Evolução da \"&RRE.Numero&\"ª Medição\"","v":"Evolução da 1ª Medição"},"Valores Medidos Acumulados",null,null,{"$f":"IF(ROW(I28)-ROW(L$5)>MAX(RRE!$V$13:$V$24),\"\",INDEX(RRE!$J$13:$J$24,MATCH(ROW(I28)-ROW(I$5),RRE!$V$13:$V$24,0)))","v":""},{"$f":"IF(I28=\"\",\"\",SUMIF(RRE!$J$13:$J$24,OFÍCIO!$I28,RRE!$L$13:$L$24))","v":""},{"$f":"IF(J28=\"\",\"\",SUMIF(RRE!$J$13:$J$24,OFÍCIO!$I28,RRE!$N$13:$N$24))","v":""},{"$f":"IF(K28=\"\",\"\",SUMIF(RRE!$J$13:$J$24,OFÍCIO!$I28,RRE!$O$13:$O$24))","v":""}]
[null,null,null,null,null,null,null,null,{"$f":"IF(ROW(I29)-ROW(L$5)>MAX(RRE!$V$13:$V$24),\"\",INDEX(RRE!$J$13:$J$24,MATCH(ROW(I29)-ROW(I$5),RRE!$V$13:$V$24,0)))","v":""},{"$f":"IF(I29=\"\",\"\",SUMIF(RRE!$J$13:$J$24,OFÍCIO!$I29,RRE!$L$13:$L$24))","v":""},{"$f":"IF(J29=\"\",\"\",SUMIF(RRE!$J$13:$J$24,OFÍCIO!$I29,RRE!$N$13:$N$24))","v":""},{"$f":"IF(K29=\"\",\"\",SUMIF(RRE!$J$13:$J$24,OFÍCIO!$I29,RRE!$O$13:$O$24))","v":""}]
[null,{"$f":"IF(import.recurso=\"FGTS\",\"Financiamento:\",\"Repasse:\")","v":"Repasse:"},null,{"$f":"RRE!L25","v":0},{"$f":"RRE!N25","v":0},{"$f":"RRE!O25","v":0},null,null,{"$f":"IF(ROW(I30)-ROW(L$5)>MAX(RRE!$V$13:$V$24),\"\",INDEX(RRE!$J$13:$J$24,MATCH(ROW(I30)-ROW(I$5),RRE!$V$13:$V$24,0)))","v":""},{"$f":"IF(I30=\"\",\"\",SUMIF(RRE!$J$13:$J$24,OFÍCIO!$I30,RRE!$L$13:$L$24))","v":""},{"$f":"IF(J30=\"\",\"\",SUMIF(RRE!$J$13:$J$24,OFÍCIO!$I30,RRE!$N$13:$N$24))","v":""},{"$f":"IF(K30=\"\",\"\",SUMIF(RRE!$J$13:$J$24,OFÍCIO!$I30,RRE!$O$13:$O$24))","v":""}]
[null,"Contrapartida Financeira:",null,{"$f":"RRE!L26","v":196407.48},{"$f":"RRE!N26","v":0},{"$f":"RRE!O26","v":0},null,null,{"$f":"IF(ROW(I31)-ROW(L$5)>MAX(RRE!$V$13:$V$24),\"\",INDEX(RRE!$J$13:$J$24,MATCH(ROW(I31)-ROW(I$5),RRE!$V$13:$V$24,0)))","v":""},{"$f":"IF(I31=\"\",\"\",SUMIF(RRE!$J$13:$J$24,OFÍCIO!$I31,RRE!$L$13:$L$24))","v":""},{"$f":"IF(J31=\"\",\"\",SUMIF(RRE!$J$13:$J$24,OFÍCIO!$I31,RRE!$N$13:$N$24))","v":""},{"$f":"IF(K31=\"\",\"\",SUMIF(RRE!$J$13:$J$24,OFÍCIO!$I31,RRE!$O$13:$O$24))","v":""}]
[null,"Outros:",null,{"$f":"RRE!L27","v":0},{"$f":"RRE!N27","v":0},{"$f":"RRE!O27","v":0},null,null,{"$f":"IF(ROW(I32)-ROW(L$5)>MAX(RRE!$V$13:$V$24),\"\",INDEX(RRE!$J$13:$J$24,MATCH(ROW(I32)-ROW(I$5),RRE!$V$13:$V$24,0)))","v":""},{"$f":"IF(I32=\"\",\"\",SUMIF(RRE!$J$13:$J$24,OFÍCIO!$I32,RRE!$L$13:$L$24))","v":""},{"$f":"IF(J32=\"\",\"\",SUMIF(RRE!$J$13:$J$24,OFÍCIO!$I32,RRE!$N$13:$N$24))","v":""},{"$f":"IF(K32=\"\",\"\",SUMIF(RRE!$J$13:$J$24,OFÍCIO!$I32,RRE!$O$13:$O$24))","v":""}]
[null,"Investimento:",null,{"$f":"RRE!L28","v":196407.48},{"$f":"RRE!N28","v":0},{"$f":"RRE!O28","v":0},null,null,{"$f":"IF(ROW(I33)-ROW(L$5)>MAX(RRE!$V$13:$V$24),\"\",INDEX(RRE!$J$13:$J$24,MATCH(ROW(I33)-ROW(I$5),RRE!$V$13:$V$24,0)))","v":""},{"$f":"IF(I33=\"\",\"\",SUMIF(RRE!$J$13:$J$24,OFÍCIO!$I33,RRE!$L$13:$L$24))","v":""},{"$f":"IF(J33=\"\",\"\",SUMIF(RRE!$J$13:$J$24,OFÍCIO!$I33,RRE!$N$13:$N$24))","v":""},{"$f":"IF(K33=\"\",\"\",SUMIF(RRE!$J$13:$J$24,OFÍCIO!$I33,RRE!$O$13:$O$24))","v":""}]
[null,"Execução Física:",null,"-",{"$f":"RRE!$N$28/(RRE!$L$28+10^-12)","v":0},{"$f":"RRE!P24","v":0},null,null,{"$f":"IF(ROW(I34)-ROW(L$5)>MAX(RRE!$V$13:$V$24),\"\",INDEX(RRE!$J$13:$J$24,MATCH(ROW(I34)-ROW(I$5),RRE!$V$13:$V$24,0)))","v":""},{"$f":"IF(I34=\"\",\"\",SUMIF(RRE!$J$13:$J$24,OFÍCIO!$I34,RRE!$L$13:$L$24))","v":""},{"$f":"IF(J34=\"\",\"\",SUMIF(RRE!$J$13:$J$24,OFÍCIO!$I34,RRE!$N$13:$N$24))","v":""},{"$f":"IF(K34=\"\",\"\",SUMIF(RRE!$J$13:$J$24,OFÍCIO!$I34,RRE!$O$13:$O$24))","v":""}]
[null,null,null,null,null,null,null,null,{"$f":"IF(ROW(I35)-ROW(L$5)>MAX(RRE!$V$13:$V$24),\"\",INDEX(RRE!$J$13:$J$24,MATCH(ROW(I35)-ROW(I$5),RRE!$V$13:$V$24,0)))","v":""},{"$f":"IF(I35=\"\",\"\",SUMIF(RRE!$J$13:$J$24,OFÍCIO!$I35,RRE!$L$13:$L$24))","v":""},{"$f":"IF(J35=\"\",\"\",SUMIF(RRE!$J$13:$J$24,OFÍCIO!$I35,RRE!$N$13:$N$24))","v":""},{"$f":"IF(K35=\"\",\"\",SUMIF(RRE!$J$13:$J$24,OFÍCIO!$I35,RRE!$O$13:$O$24))","v":""}]
[null,null,null,null,null,null,null,null,{"$f":"IF(ROW(I36)-ROW(L$5)>MAX(RRE!$V$13:$V$24),\"\",INDEX(RRE!$J$13:$J$24,MATCH(ROW(I36)-ROW(I$5),RRE!$V$13:$V$24,0)))","v":""},{"$f":"IF(I36=\"\",\"\",SUMIF(RRE!$J$13:$J$24,OFÍCIO!$I36,RRE!$L$13:$L$24))","v":""},{"$f":"IF(J36=\"\",\"\",SUMIF(RRE!$J$13:$J$24,OFÍCIO!$I36,RRE!$N$13:$N$24))","v":""},{"$f":"IF(K36=\"\",\"\",SUMIF(RRE!$J$13:$J$24,OFÍCIO!$I36,RRE!$O$13:$O$24))","v":""}]
[null,{"$f":"IF(RRE.Numero>1,\"2. Encaminhamos ainda a documentação relativa à prestação de contas da etapa físico-financeira anterior.\",\"\")","v":""},null,null,null,null,null,null,{"$f":"IF(ROW(I37)-ROW(L$5)>MAX(RRE!$V$13:$V$24),\"\",INDEX(RRE!$J$13:$J$24,MATCH(ROW(I37)-ROW(I$5),RRE!$V$13:$V$24,0)))","v":""},{"$f":"IF(I37=\"\",\"\",SUMIF(RRE!$J$13:$J$24,OFÍCIO!$I37,RRE!$L$13:$L$24))","v":""},{"$f":"IF(J37=\"\",\"\",SUMIF(RRE!$J$13:$J$24,OFÍCIO!$I37,RRE!$N$13:$N$24))","v":""},{"$f":"IF(K37=\"\",\"\",SUMIF(RRE!$J$13:$J$24,OFÍCIO!$I37,RRE!$O$13:$O$24))","v":""}]
[null,null,null,null,null,null,null,null,{"$f":"IF(ROW(I38)-ROW(L$5)>MAX(RRE!$V$13:$V$24),\"\",INDEX(RRE!$J$13:$J$24,MATCH(ROW(I38)-ROW(I$5),RRE!$V$13:$V$24,0)))","v":""},{"$f":"IF(I38=\"\",\"\",SUMIF(RRE!$J$13:$J$24,OFÍCIO!$I38,RRE!$L$13:$L$24))","v":""},{"$f":"IF(J38=\"\",\"\",SUMIF(RRE!$J$13:$J$24,OFÍCIO!$I38,RRE!$N$13:$N$24))","v":""},{"$f":"IF(K38=\"\",\"\",SUMIF(RRE!$J$13:$J$24,OFÍCIO!$I38,RRE!$O$13:$O$24))","v":""}]
[null,{"$f":"IF(AND(RRE.Numero>1,NOT(ISBLANK(Import.TransfereGOV))),\"3. Na oportunidade, informamos que a execução financeira da parcela anterior está devidamente comprovada no TransfereGOV.\",\"\")","v":""},null,null,null,null,null,null,{"$f":"IF(ROW(I39)-ROW(L$5)>MAX(RRE!$V$13:$V$24),\"\",INDEX(RRE!$J$13:$J$24,MATCH(ROW(I39)-ROW(I$5),RRE!$V$13:$V$24,0)))","v":""},{"$f":"IF(I39=\"\",\"\",SUMIF(RRE!$J$13:$J$24,OFÍCIO!$I39,RRE!$L$13:$L$24))","v":""},{"$f":"IF(J39=\"\",\"\",SUMIF(RRE!$J$13:$J$24,OFÍCIO!$I39,RRE!$N$13:$N$24))","v":""},{"$f":"IF(K39=\"\",\"\",SUMIF(RRE!$J$13:$J$24,OFÍCIO!$I39,RRE!$O$13:$O$24))","v":""}]
[null,null,null,null,null,null,null,null,{"$f":"IF(ROW(I40)-ROW(L$5)>MAX(RRE!$V$13:$V$24),\"\",INDEX(RRE!$J$13:$J$24,MATCH(ROW(I40)-ROW(I$5),RRE!$V$13:$V$24,0)))","v":""},{"$f":"IF(I40=\"\",\"\",SUMIF(RRE!$J$13:$J$24,OFÍCIO!$I40,RRE!$L$13:$L$24))","v":""},{"$f":"IF(J40=\"\",\"\",SUMIF(RRE!$J$13:$J$24,OFÍCIO!$I40,RRE!$N$13:$N$24))","v":""},{"$f":"IF(K40=\"\",\"\",SUMIF(RRE!$J$13:$J$24,OFÍCIO!$I40,RRE!$O$13:$O$24))","v":""}]
[null,null,null,null,null,null,null,null,{"$f":"IF(ROW(I41)-ROW(L$5)>MAX(RRE!$V$13:$V$24),\"\",INDEX(RRE!$J$13:$J$24,MATCH(ROW(I41)-ROW(I$5),RRE!$V$13:$V$24,0)))","v":""},{"$f":"IF(I41=\"\",\"\",SUMIF(RRE!$J$13:$J$24,OFÍCIO!$I41,RRE!$L$13:$L$24))","v":""},{"$f":"IF(J41=\"\",\"\",SUMIF(RRE!$J$13:$J$24,OFÍCIO!$I41,RRE!$N$13:$N$24))","v":""},{"$f":"IF(K41=\"\",\"\",SUMIF(RRE!$J$13:$J$24,OFÍCIO!$I41,RRE!$O$13:$O$24))","v":""}]
[null,{"$f":"IF($B$37=\"\",0,1)+IF($B$39=\"\",0,1)+2&\". Informamos também a manutenção da Placa de Obra em local visível e de acordo com padrão estabelecido pela Presidência da República, constante do Manual Visual de Placas e Adesivos de Obra.\"","v":"2. Informamos também a manutenção da Placa de Obra em local visível e de acordo com padrão estabelecido pela Presidência da República, constante do Manual Visual de Placas e Adesivos de Obra."},null,null,null,null,null,null,{"$f":"IF(ROW(I42)-ROW(L$5)>MAX(RRE!$V$13:$V$24),\"\",INDEX(RRE!$J$13:$J$24,MATCH(ROW(I42)-ROW(I$5),RRE!$V$13:$V$24,0)))","v":""},{"$f":"IF(I42=\"\",\"\",SUMIF(RRE!$J$13:$J$24,OFÍCIO!$I42,RRE!$L$13:$L$24))","v":""},{"$f":"IF(J42=\"\",\"\",SUMIF(RRE!$J$13:$J$24,OFÍCIO!$I42,RRE!$N$13:$N$24))","v":""},{"$f":"IF(K42=\"\",\"\",SUMIF(RRE!$J$13:$J$24,OFÍCIO!$I42,RRE!$O$13:$O$24))","v":""}]
[null,null,null,null,null,null,null,null,{"$f":"IF(ROW(I43)-ROW(L$5)>MAX(RRE!$V$13:$V$24),\"\",INDEX(RRE!$J$13:$J$24,MATCH(ROW(I43)-ROW(I$5),RRE!$V$13:$V$24,0)))","v":""},{"$f":"IF(I43=\"\",\"\",SUMIF(RRE!$J$13:$J$24,OFÍCIO!$I43,RRE!$L$13:$L$24))","v":""},{"$f":"IF(J43=\"\",\"\",SUMIF(RRE!$J$13:$J$24,OFÍCIO!$I43,RRE!$N$13:$N$24))","v":""},{"$f":"IF(K43=\"\",\"\",SUMIF(RRE!$J$13:$J$24,OFÍCIO!$I43,RRE!$O$13:$O$24))","v":""}]
[null,null,null,null,null,null,null,null,{"$f":"IF(ROW(I44)-ROW(L$5)>MAX(RRE!$V$13:$V$24),\"\",INDEX(RRE!$J$13:$J$24,MATCH(ROW(I44)-ROW(I$5),RRE!$V$13:$V$24,0)))","v":""},{"$f":"IF(I44=\"\",\"\",SUMIF(RRE!$J$13:$J$24,OFÍCIO!$I44,RRE!$L$13:$L$24))","v":""},{"$f":"IF(J44=\"\",\"\",SUMIF(RRE!$J$13:$J$24,OFÍCIO!$I44,RRE!$N$13:$N$24))","v":""},{"$f":"IF(K44=\"\",\"\",SUMIF(RRE!$J$13:$J$24,OFÍCIO!$I44,RRE!$O$13:$O$24))","v":""}]
[null,null,null,null,null,null,null,null,{"$f":"IF(ROW(I45)-ROW(L$5)>MAX(RRE!$V$13:$V$24),\"\",INDEX(RRE!$J$13:$J$24,MATCH(ROW(I45)-ROW(I$5),RRE!$V$13:$V$24,0)))","v":""},{"$f":"IF(I45=\"\",\"\",SUMIF(RRE!$J$13:$J$24,OFÍCIO!$I45,RRE!$L$13:$L$24))","v":""},{"$f":"IF(J45=\"\",\"\",SUMIF(RRE!$J$13:$J$24,OFÍCIO!$I45,RRE!$N$13:$N$24))","v":""},{"$f":"IF(K45=\"\",\"\",SUMIF(RRE!$J$13:$J$24,OFÍCIO!$I45,RRE!$O$13:$O$24))","v":""}]
[null,null,null,null,null,null,null,null,{"$f":"IF(ROW(I46)-ROW(L$5)>MAX(RRE!$V$13:$V$24),\"\",INDEX(RRE!$J$13:$J$24,MATCH(ROW(I46)-ROW(I$5),RRE!$V$13:$V$24,0)))","v":""},{"$f":"IF(I46=\"\",\"\",SUMIF(RRE!$J$13:$J$24,OFÍCIO!$I46,RRE!$L$13:$L$24))","v":""},{"$f":"IF(J46=\"\",\"\",SUMIF(RRE!$J$13:$J$24,OFÍCIO!$I46,RRE!$N$13:$N$24))","v":""},{"$f":"IF(K46=\"\",\"\",SUMIF(RRE!$J$13:$J$24,OFÍCIO!$I46,RRE!$O$13:$O$24))","v":""}]
[]
[]
[null,"Atenciosamente,"]
[]
[]
[]
[]
[null,{"$f":"DADOS!$F$28","v":0}]
[null,{"$f":"DADOS!$F$29","v":0}]